You are viewing a plain text version of this content. The canonical link for it is here.
Posted to issues@tez.apache.org by Apache Jenkins Server <je...@builds.apache.org> on 2015/08/16 23:29:00 UTC
Failed: TEZ-2723 PreCommit Build #997
Jira: https://issues.apache.org/jira/browse/TEZ-2723
Build: https://builds.apache.org/job/PreCommit-TEZ-Build/997/
###################################################################################
########################## LAST 60 LINES OF THE CONSOLE ###########################
[...truncated 3322 lines...]
{color:red}-1 overall{color}. Here are the results of testing the latest attachment
http://issues.apache.org/jira/secure/attachment/12750720/TEZ-2723.1.patch
against master revision 6b67b0b.
{color:green}+1 @author{color}. The patch does not contain any @author tags.
{color:red}-1 tests included{color}. The patch doesn't appear to include any new or modified tests.
Please justify why no new tests are needed for this patch.
Also please list what manual steps were performed to verify this patch.
{color:green}+1 javac{color}. The applied patch does not increase the total number of javac compiler warnings.
{color:green}+1 javadoc{color}. There were no new javadoc warning messages.
{color:green}+1 findbugs{color}. The patch does not introduce any new Findbugs (version 3.0.1) warnings.
{color:green}+1 release audit{color}. The applied patch does not increase the total number of release audit warnings.
{color:green}+1 core tests{color}. The patch passed unit tests in .
Test results: https://builds.apache.org/job/PreCommit-TEZ-Build/997//testReport/
Console output: https://builds.apache.org/job/PreCommit-TEZ-Build/997//console
This message is automatically generated.
======================================================================
======================================================================
Adding comment to Jira.
======================================================================
======================================================================
Comment added.
aaa2a0db93dfb59b43fac615b3b0813d55eb12fd logged out
======================================================================
======================================================================
Finished build.
======================================================================
======================================================================
Build step 'Execute shell' marked build as failure
Archiving artifacts
Sending artifact delta relative to PreCommit-TEZ-Build #988
Archived 50 artifacts
Archive block size is 32768
Received 2 blocks and 2997224 bytes
Compression is 2.1%
Took 0.91 sec
[description-setter] Could not determine description.
Recording test results
Email was triggered for: Failure
Sending email for trigger: Failure
###################################################################################
############################## FAILED TESTS (if any) ##############################
All tests passed
Success: TEZ-2727 PreCommit Build #1000
Posted by Apache Jenkins Server <je...@builds.apache.org>.
Jira: https://issues.apache.org/jira/browse/TEZ-2727
Build: https://builds.apache.org/job/PreCommit-TEZ-Build/1000/
###################################################################################
########################## LAST 60 LINES OF THE CONSOLE ###########################
[...truncated 3620 lines...]
[INFO] Final Memory: 93M/1163M
[INFO] ------------------------------------------------------------------------
{color:green}+1 overall{color}. Here are the results of testing the latest attachment
http://issues.apache.org/jira/secure/attachment/12750879/2003_20150817.1.txt
against master revision 6cb8206.
{color:green}+1 @author{color}. The patch does not contain any @author tags.
{color:green}+1 tests included{color}. The patch appears to include 51 new or modified test files.
{color:green}+1 javac{color}. The applied patch does not increase the total number of javac compiler warnings.
{color:green}+1 javadoc{color}. There were no new javadoc warning messages.
{color:green}+1 findbugs{color}. The patch does not introduce any new Findbugs (version 3.0.1) warnings.
{color:green}+1 release audit{color}. The applied patch does not increase the total number of release audit warnings.
{color:green}+1 core tests{color}. The patch passed unit tests in .
Test results: https://builds.apache.org/job/PreCommit-TEZ-Build/1000//testReport/
Console output: https://builds.apache.org/job/PreCommit-TEZ-Build/1000//console
This message is automatically generated.
======================================================================
======================================================================
Adding comment to Jira.
======================================================================
======================================================================
Comment added.
9789e853f14a49bfc68c5ee4acc461d5551d0d68 logged out
======================================================================
======================================================================
Finished build.
======================================================================
======================================================================
Archiving artifacts
Sending artifact delta relative to PreCommit-TEZ-Build #988
Archived 53 artifacts
Archive block size is 32768
Received 0 blocks and 3205963 bytes
Compression is 0.0%
Took 1.3 sec
Description set: TEZ-2727
Recording test results
Email was triggered for: Success
Sending email for trigger: Success
###################################################################################
############################## FAILED TESTS (if any) ##############################
All tests passed
Failed: TEZ-2294 PreCommit Build #999
Posted by Apache Jenkins Server <je...@builds.apache.org>.
Jira: https://issues.apache.org/jira/browse/TEZ-2294
Build: https://builds.apache.org/job/PreCommit-TEZ-Build/999/
###################################################################################
########################## LAST 60 LINES OF THE CONSOLE ###########################
[...truncated 38 lines...]
TEZ-2294 patch is being downloaded at Mon Aug 17 20:59:59 UTC 2015 from
http://issues.apache.org/jira/secure/attachment/12750871/TEZ-2294.6.patch
======================================================================
======================================================================
Pre-build master to verify master stability and javac warnings
======================================================================
======================================================================
Compiling /home/jenkins/jenkins-slave/workspace/PreCommit-TEZ-Build
/home/jenkins/tools/maven/latest/bin/mvn clean test -DskipTests -Ptest-patch > /home/jenkins/jenkins-slave/workspace/PreCommit-TEZ-Build/../patchprocess/masterJavacWarnings.txt 2>&1
master compilation is broken?
{color:red}-1 overall{color}. Here are the results of testing the latest attachment
http://issues.apache.org/jira/secure/attachment/12750871/TEZ-2294.6.patch
against master revision 6cb8206.
{color:red}-1 patch{color}. master compilation may be broken.
Console output: https://builds.apache.org/job/PreCommit-TEZ-Build/999//console
This message is automatically generated.
======================================================================
======================================================================
Adding comment to Jira.
======================================================================
======================================================================
Comment added.
876db1de0274684c51f7e0136549c906f0661902 logged out
======================================================================
======================================================================
Finished build.
======================================================================
======================================================================
Build step 'Execute shell' marked build as failure
Archiving artifacts
Sending artifact delta relative to PreCommit-TEZ-Build #988
Archived 1 artifacts
Archive block size is 32768
Received 0 blocks and 180377 bytes
Compression is 0.0%
Took 0.43 sec
[description-setter] Could not determine description.
Recording test results
Email was triggered for: Failure
Sending email for trigger: Failure
###################################################################################
############################## FAILED TESTS (if any) ##############################
No tests ran.
Failed: TEZ-2724 PreCommit Build #998
Posted by Apache Jenkins Server <je...@builds.apache.org>.
Jira: https://issues.apache.org/jira/browse/TEZ-2724
Build: https://builds.apache.org/job/PreCommit-TEZ-Build/998/
###################################################################################
########################## LAST 60 LINES OF THE CONSOLE ###########################
[...truncated 3288 lines...]
{color:red}-1 overall{color}. Here are the results of testing the latest attachment
http://issues.apache.org/jira/secure/attachment/12750751/TEZ-2724-1.patch
against master revision 6cb8206.
{color:green}+1 @author{color}. The patch does not contain any @author tags.
{color:red}-1 tests included{color}. The patch doesn't appear to include any new or modified tests.
Please justify why no new tests are needed for this patch.
Also please list what manual steps were performed to verify this patch.
{color:green}+1 javac{color}. The applied patch does not increase the total number of javac compiler warnings.
{color:green}+1 javadoc{color}. There were no new javadoc warning messages.
{color:green}+1 findbugs{color}. The patch does not introduce any new Findbugs (version 3.0.1) warnings.
{color:green}+1 release audit{color}. The applied patch does not increase the total number of release audit warnings.
{color:green}+1 core tests{color}. The patch passed unit tests in .
Test results: https://builds.apache.org/job/PreCommit-TEZ-Build/998//testReport/
Console output: https://builds.apache.org/job/PreCommit-TEZ-Build/998//console
This message is automatically generated.
======================================================================
======================================================================
Adding comment to Jira.
======================================================================
======================================================================
Comment added.
e8a16e5069ee061dadad7d571ce396b1548bc200 logged out
======================================================================
======================================================================
Finished build.
======================================================================
======================================================================
Build step 'Execute shell' marked build as failure
Archiving artifacts
Sending artifact delta relative to PreCommit-TEZ-Build #988
Archived 50 artifacts
Archive block size is 32768
Received 0 blocks and 3094207 bytes
Compression is 0.0%
Took 0.92 sec
[description-setter] Could not determine description.
Recording test results
Email was triggered for: Failure
Sending email for trigger: Failure
###################################################################################
############################## FAILED TESTS (if any) ##############################
All tests passed