You are viewing a plain text version of this content. The canonical link for it is here.
Posted to dev@allura.apache.org by Apache Jenkins Server <je...@builds.apache.org> on 2023/08/08 15:37:28 UTC

Build failed in Jenkins: Allura » Allura-py3.7 #254

See <https://ci-builds.apache.org/job/Allura/job/Allura-py3.7/254/display/redirect?page=changes>

Changes:

[dbrondsema] [#8517] Upgrade EasyWidgets 0.4.1 -> no upgrade, and its deps: formencode,six,markupsafe,paste,setuptools,six,python-dateutil,six,six,webob

[dbrondsema] [#8517] Upgrade emoji 2.2.0 -> 2.7.0

[dbrondsema] [#8517] Upgrade GitPython 3.1.31 -> 3.1.32, and its deps: gitdb,smmap

[dbrondsema] [#8517] Upgrade markdown 3.4.3 -> 3.4.4

[dbrondsema] [#8517] Upgrade Pillow 9.5.0 -> 10.0.0

[dbrondsema] [#8517] Upgrade Werkzeug 2.2.3 -> 2.3.6, and its deps: markupsafe

[dbrondsema] [#8517] Upgrade mock 5.0.2 -> 5.1.0

[dbrondsema] [#8517] Upgrade ruff 0.0.262 -> 0.0.281 (OUTDATED! latest is: 0.0.280)

[dbrondsema] [#8517] Upgrade pytest 7.3.1 -> 7.4.0, and its deps: iniconfig,packaging,pluggy

[dbrondsema] [#8517] Upgrade pytest-xdist 3.2.1 -> 3.3.1, and its deps: execnet,pytest,iniconfig,packaging,pluggy

[dbrondsema] [#8517] Upgrade pytest-sugar 0.9.7 -> no upgrade, and its deps: packaging,pytest,iniconfig,packaging,pluggy,termcolor

[dbrondsema] [#8517] Upgrade gunicorn 20.1.0 -> 21.2.0, and its deps: setuptools


------------------------------------------
[...truncated 113.70 KB...]
#8 28.90 Get:4 https://deb.nodesource.com/node_14.x jammy/main amd64 Packages [776 B]
#8 28.92 Hit:5 http://security.ubuntu.com/ubuntu jammy-security InRelease
#8 28.96 Hit:6 http://archive.ubuntu.com/ubuntu jammy-backports InRelease
#8 29.24 Hit:7 https://ppa.launchpadcontent.net/deadsnakes/ppa/ubuntu jammy InRelease
#8 29.69 Fetched 5339 B in 1s (5022 B/s)
#8 29.69 Reading package lists...
#8 31.07 
#8 31.07 ## Run `sudo apt-get install -y nodejs` to install Node.js 14.x and npm
#8 31.07 ## You may also need development tools to build native addons:
#8 31.07      sudo apt-get install gcc g++ make
#8 31.07 ## To install the Yarn package manager, run:
#8 31.07      curl -sL https://dl.yarnpkg.com/debian/pubkey.gpg | gpg --dearmor | sudo tee /usr/share/keyrings/yarnkey.gpg >/dev/null
#8 31.07      echo "deb [signed-by=/usr/share/keyrings/yarnkey.gpg] https://dl.yarnpkg.com/debian stable main" | sudo tee /etc/apt/sources.list.d/yarn.list
#8 31.07      sudo apt-get update && sudo apt-get install yarn
#8 31.07 
#8 31.07 
#8 31.14 Reading package lists...
#8 32.52 Building dependency tree...
#8 32.81 Reading state information...
#8 33.07 The following NEW packages will be installed:
#8 33.07   nodejs
#8 33.18 0 upgraded, 1 newly installed, 0 to remove and 0 not upgraded.
#8 33.18 Need to get 25.4 MB of archives.
#8 33.18 After this operation, 121 MB of additional disk space will be used.
#8 33.18 Get:1 https://deb.nodesource.com/node_14.x jammy/main amd64 nodejs amd64 14.21.3-deb-1nodesource1 [25.4 MB]
#8 34.03 debconf: delaying package configuration, since apt-utils is not installed
#8 34.22 Fetched 25.4 MB in 1s (48.4 MB/s)
#8 34.41 Selecting previously unselected package nodejs.
#8 34.41 (Reading database ... (Reading database ... 5%(Reading database ... 10%(Reading database ... 15%(Reading database ... 20%(Reading database ... 25%(Reading database ... 30%(Reading database ... 35%(Reading database ... 40%(Reading database ... 45%(Reading database ... 50%(Reading database ... 55%(Reading database ... 60%(Reading database ... 65%(Reading database ... 70%(Reading database ... 75%(Reading database ... 80%(Reading database ... 85%(Reading database ... 90%(Reading database ... 95%(Reading database ... 100%(Reading database ... 19190 files and directories currently installed.)
#8 34.44 Preparing to unpack .../nodejs_14.21.3-deb-1nodesource1_amd64.deb ...
#8 34.56 Unpacking nodejs (14.21.3-deb-1nodesource1) ...
#8 40.36 Setting up nodejs (14.21.3-deb-1nodesource1) ...
#8 DONE 42.8s

#9 [6/7] RUN locale-gen en_US.UTF-8
#9 2.936 Generating locales (this might take a while)...
#9 2.941   en_US.UTF-8... done
#9 5.887 Generation complete.
#9 DONE 7.3s

#10 [7/7] WORKDIR /allura
#10 DONE 1.8s

#11 exporting to image
#11 exporting layers
#11 exporting layers 6.9s done
#11 writing image sha256:f10234e3516b8995c69b7c223168dbe2cfb8ca9f1d88dbb6022963fd842e40ce 0.1s done
#11 naming to docker.io/library/allura-web
#11 naming to docker.io/library/allura-web 0.2s done
#11 DONE 7.2s
Building http
#1 [internal] load build definition from Dockerfile
#1 transferring dockerfile: 2.40kB done
#1 ...

#2 [internal] load .dockerignore
#2 transferring context: 2B done
#2 DONE 2.3s

#1 [internal] load build definition from Dockerfile
#1 DONE 2.5s

#3 [internal] load metadata for docker.io/library/ubuntu:18.04
#3 DONE 3.5s

#4 [internal] load build context
#4 DONE 0.0s

#5 [ 1/10] FROM docker.io/library/ubuntu:18.04@sha256:152dc042452c496007f07ca9127571cb9c29697f42acbfad72324b2bb2e43c98
#5 DONE 0.0s

#4 [internal] load build context
#4 transferring context: 4.20kB done
#4 DONE 1.0s

#6 [ 2/10] RUN apt-get update && DEBIAN_FRONTEND=noninteractive apt-get install -y --no-install-recommends     apache2     libapache2-mod-python     python-requests     git     curl     sudo     && rm -rf /var/lib/apt/lists/*
#6 CACHED

#7 [ 3/10] RUN a2enmod cgi proxy proxy_http
#7 CACHED

#8 [ 4/10] ADD ./git-http.conf /etc/apache2/sites-available/
#8 CACHED

#9 [ 5/10] RUN a2dissite 000-default.conf
#9 3.342 Site 000-default disabled.
#9 3.342 To activate the new configuration, you need to run:
#9 3.342   service apache2 reload
#9 DONE 4.4s

#10 [ 6/10] RUN a2ensite git-http.conf
#10 2.572 Enabling site git-http.
#10 2.581 To activate the new configuration, you need to run:
#10 2.581   service apache2 reload
#10 DONE 3.9s

#11 [ 7/10] RUN apachectl configtest
#11 3.590 AH00558: apache2: Could not reliably determine the server's fully qualified domain name, using 127.0.0.1. Set the 'ServerName' directive globally to suppress this message
#11 3.591 Syntax OK
#11 DONE 5.0s

#12 [ 8/10] ADD git-http-backend-wrapper.sh /usr/lib/git-core
#12 DONE 2.4s

#13 [ 9/10] RUN adduser www-data sudo
#13 2.987 Adding user `www-data' to group `sudo' ...
#13 3.043 Adding user www-data to group sudo
#13 3.875 Done.
#13 DONE 5.3s

#14 [10/10] RUN echo '%sudo  ALL=(ALL) NOPASSWD:ALL' > /etc/sudoers.d/sudo_group_passwordless
#14 DONE 4.2s

#15 exporting to image
#15 exporting layers
#15 exporting layers 4.3s done
#15 writing image sha256:3b4cf350bd6bdb032324eb9f19eab59dd42c9f2df4eec671c003919c6982d759 0.1s done
#15 naming to docker.io/library/allura_http
#15 naming to docker.io/library/allura_http 0.2s done
#15 DONE 4.6s

=============================================================================
Setup: venv, pip, pysvn, ./rebuild-all.sh, npm, etc.
=============================================================================
Creating network "allura_default" with the default driver
Pulling solr (solr:6-alpine)...
6-alpine: Pulling from library/solr
Digest: sha256:4f63093698313437a49b2f945c4b1545c9e3a655f52581bc6e01ea006fae132e
Status: Downloaded newer image for solr:6-alpine
Pulling mongo (mongo:4.2)...
4.2: Pulling from library/mongo
Digest: sha256:699d652ed67423d689258bad7b316cf005dfbb82b334118ec306f049042f3717
Status: Downloaded newer image for mongo:4.2
Creating allura_mongo_1 ... 
Creating allura_solr_1  ... 
Creating allura_solr_1  ... done
Creating allura_mongo_1 ... done
Creating allura_web_run ... 
Creating allura_web_run ... done

Running scripts/init-docker-dev.sh

Creating SCM directories

Creating directory for SOLR data

Changing it's permissions to 777 so that container will have access to it

Creating virtualenv

Requirement already satisfied: pip in /allura-data/virtualenv/lib/python3.7/site-packages (23.0.1)
Collecting pip
  Downloading pip-23.2.1-py3-none-any.whl (2.1 MB)
     ━━━━━━━━━━━━━━━━━━━━━━━━━━━━━━━━━━━━━━━━ 2.1/2.1 MB 9.0 MB/s eta 0:00:00
Installing collected packages: pip
  Attempting uninstall: pip
    Found existing installation: pip 23.0.1
    Uninstalling pip-23.0.1:
      Successfully uninstalled pip-23.0.1
Successfully installed pip-23.2.1
Collecting wheel
  Obtaining dependency information for wheel from https://files.pythonhosted.org/packages/28/f5/6955d7b3a5d71ce6bac104f9cf98c1b0513ad656cdaca8ea7d579196f771/wheel-0.41.1-py3-none-any.whl.metadata
  Downloading wheel-0.41.1-py3-none-any.whl.metadata (2.2 kB)
Downloading wheel-0.41.1-py3-none-any.whl (64 kB)
   ━━━━━━━━━━━━━━━━━━━━━━━━━━━━━━━━━━━━━━━━ 64.8/64.8 kB 486.8 kB/s eta 0:00:00
Installing collected packages: wheel
Successfully installed wheel-0.41.1
  % Total    % Received % Xferd  Average Speed   Time    Time     Time  Current
                                 Dload  Upload   Total   Spent    Left  Speed
  0     0    0     0    0     0      0      0 --:--:-- --:--:-- --:--:--     0100 12741  100 12741    0     0  39342      0 --:--:-- --:--:-- --:--:-- 39445
Looking up latest PySVN version...
Downloading PySVN 1.9.20...
Building PySVN...
Processing /tmp/tmpl_n2av24.pysvn-install/pysvn-1.9.20
  Preparing metadata (setup.py): started
  Preparing metadata (setup.py): finished with status 'done'
Building wheels for collected packages: pysvn
  Building wheel for pysvn (setup.py): started
  Building wheel for pysvn (setup.py): still running...
  Building wheel for pysvn (setup.py): finished with status 'done'
  Created wheel for pysvn: filename=pysvn-1.9.20-cp37-cp37m-linux_x86_64.whl size=738992 sha256=25d7c85100e8138fc7f2a1634c644dcd8a2a8481794d8b6db4909ac97bbe772b
  Stored in directory: /root/.cache/pip/wheels/e1/4f/24/1bd3006a3602833a073b5d1244a42c51185336b5202a0564e2
Successfully built pysvn
Installing collected packages: pysvn
Successfully installed pysvn-1.9.20

PySVN is installed.

Installing python packages

ERROR: Ignored the following versions that require a different python version: 10.0.0 Requires-Python >=3.8; 6.8.0 Requires-Python >=3.8
ERROR: Could not find a version that satisfies the requirement pillow==10.0.0 (from versions: 1.0, 1.1, 1.2, 1.3, 1.4, 1.5, 1.6, 1.7.0, 1.7.1, 1.7.2, 1.7.3, 1.7.4, 1.7.5, 1.7.6, 1.7.7, 1.7.8, 2.0.0, 2.1.0, 2.2.0, 2.2.1, 2.2.2, 2.3.0, 2.3.1, 2.3.2, 2.4.0, 2.5.0, 2.5.1, 2.5.2, 2.5.3, 2.6.0, 2.6.1, 2.6.2, 2.7.0, 2.8.0, 2.8.1, 2.8.2, 2.9.0, 3.0.0, 3.1.0rc1, 3.1.0, 3.1.1, 3.1.2, 3.2.0, 3.3.0, 3.3.1, 3.3.2, 3.3.3, 3.4.0, 3.4.1, 3.4.2, 4.0.0, 4.1.0, 4.1.1, 4.2.0, 4.2.1, 4.3.0, 5.0.0, 5.1.0, 5.2.0, 5.3.0, 5.4.0, 5.4.1, 6.0.0, 6.1.0, 6.2.0, 6.2.1, 6.2.2, 7.0.0, 7.1.0, 7.1.1, 7.1.2, 7.2.0, 8.0.0, 8.0.1, 8.1.0, 8.1.1, 8.1.2, 8.2.0, 8.3.0, 8.3.1, 8.3.2, 8.4.0, 9.0.0, 9.0.1, 9.1.0, 9.1.1, 9.2.0, 9.3.0, 9.4.0, 9.5.0)
ERROR: No matching distribution found for pillow==10.0.0
1

=============================================================================
Starting up docker containers
=============================================================================
allura_mongo_1 is up-to-date
allura_solr_1 is up-to-date
Creating allura_web_1 ... 
Creating allura_web_1 ... done

=============================================================================
Docker Container Info:
=============================================================================
Error response from daemon: Container 4c0f67f94ed0af24842cdd4bea6d13c322b2a9eb83c548770c144fb0a44eb861 is not running

=============================================================================
Setup: tests
=============================================================================

=============================================================================
Run: tests
=============================================================================

=============================================================================
Shutdown
=============================================================================
Stopping allura_solr_1  ... 
Stopping allura_mongo_1 ... 
Stopping allura_solr_1  ... done
Stopping allura_mongo_1 ... done
Removing allura_web_1   ... 
Removing allura_solr_1  ... 
Removing allura_mongo_1 ... 
Removing allura_solr_1  ... done
Removing allura_web_1   ... done
Removing allura_mongo_1 ... done
Removing network allura_default
Deleted Containers:
ab5a206e0b138b1f58573077d73aeafc20afdba4e0c81f9ea0d8f3ed8b39226f

Total reclaimed space: 0B
Deleted Volumes:
13b895b81158a132b3fb4a84b1c5c687cdadb6d494f4c7c9a7765a0ea19478ce
248ebb062225e81bb9b8b4bcc54227e21eb31eb116640bd2c6502c4daeb407ac
971170e74b3d6febfa9da04bde3838fa91835d839947641bf0d188b96648a936
50a0b7aaf2884010f04d2544afe5eab3780f24a52c8baf687980622d22e8d1d4
a988a70e4048aab88fb712205fbf026ef4f9ee64adefaba3a52f75317621d714
136f89b4af949f86792162da8cf43f1850e83c945a66216b4f742dd624140176
af2c227b2ca922930a9599cb4acd22e295803bbc0fa83fedf66507ad53a12f44
9c7eb5724a57a206c2028ea060b59468cb99efd676a566af43ecc5fb5f291236
1667e70c84fe5556b9cde8f79fd430c811e7e501a8cefa67afbfa23a85def343

Total reclaimed space: 1.358GB
Build step 'Execute shell' marked build as failure
Recording test results
ERROR: Step ?Publish JUnit test result report? failed: No test report files were found. Configuration error?

Jenkins build is back to normal : Allura » Allura-py3.7 #262

Posted by Apache Jenkins Server <je...@builds.apache.org>.
See <https://ci-builds.apache.org/job/Allura/job/Allura-py3.7/262/display/redirect?page=changes>


Build failed in Jenkins: Allura » Allura-py3.7 #261

Posted by Apache Jenkins Server <je...@builds.apache.org>.
See <https://ci-builds.apache.org/job/Allura/job/Allura-py3.7/261/display/redirect>

Changes:


------------------------------------------
[...truncated 151.97 KB...]
#6 41.48 Enabling conf charset.
#6 41.51 Enabling conf localized-error-pages.
#6 41.54 Enabling conf other-vhosts-access-log.
#6 41.56 Enabling conf security.
#6 41.60 Enabling conf serve-cgi-bin.
#6 41.62 Enabling site 000-default.
#6 41.87 invoke-rc.d: could not determine current runlevel
#6 41.88 invoke-rc.d: policy-rc.d denied execution of start.
#6 41.98 Setting up curl (7.58.0-2ubuntu3.24) ...
#6 42.02 Setting up libapache2-mod-python (3.3.1-11ubuntu2) ...
#6 42.15 apache2_invoke: Enable module python
#6 42.19 invoke-rc.d: could not determine current runlevel
#6 42.19 invoke-rc.d: policy-rc.d denied execution of restart.
#6 42.87 Processing triggers for libc-bin (2.27-3ubuntu1.6) ...
#6 42.93 Processing triggers for ca-certificates (20230311ubuntu0.18.04.1) ...
#6 42.95 Updating certificates in /etc/ssl/certs...
#6 43.44 0 added, 0 removed; done.
#6 43.44 Running hooks in /etc/ca-certificates/update.d...
#6 43.44 done.
#6 DONE 44.8s

#7 [ 3/10] RUN a2enmod cgi proxy proxy_http
#7 0.861 Your MPM seems to be threaded. Selecting cgid instead of cgi.
#7 0.861 Enabling module cgid.
#7 0.868 Enabling module proxy.
#7 0.874 Considering dependency proxy for proxy_http:
#7 0.874 Module proxy already enabled
#7 0.874 Enabling module proxy_http.
#7 0.881 To activate the new configuration, you need to run:
#7 0.881   service apache2 restart
#7 DONE 1.0s

#8 [ 4/10] ADD ./git-http.conf /etc/apache2/sites-available/
#8 DONE 0.2s

#9 [ 5/10] RUN a2dissite 000-default.conf
#9 0.594 Site 000-default disabled.
#9 0.594 To activate the new configuration, you need to run:
#9 0.594   service apache2 reload
#9 DONE 0.7s

#10 [ 6/10] RUN a2ensite git-http.conf
#10 0.587 Enabling site git-http.
#10 0.593 To activate the new configuration, you need to run:
#10 0.593   service apache2 reload
#10 DONE 0.7s

#11 [ 7/10] RUN apachectl configtest
#11 0.506 AH00558: apache2: Could not reliably determine the server's fully qualified domain name, using 127.0.0.1. Set the 'ServerName' directive globally to suppress this message
#11 0.507 Syntax OK
#11 DONE 0.6s

#12 [ 8/10] ADD git-http-backend-wrapper.sh /usr/lib/git-core
#12 DONE 0.3s

#13 [ 9/10] RUN adduser www-data sudo
#13 0.425 Adding user `www-data' to group `sudo' ...
#13 0.427 Adding user www-data to group sudo
#13 0.464 Done.
#13 DONE 0.5s

#14 [10/10] RUN echo '%sudo  ALL=(ALL) NOPASSWD:ALL' > /etc/sudoers.d/sudo_group_passwordless
#14 DONE 0.5s

#15 exporting to image
#15 exporting layers
#15 exporting layers 2.7s done
#15 writing image sha256:c1cafb39cd347a25ca3d035ba3742dee5760e14400b9e09177eafed1db5e9c12 done
#15 naming to docker.io/library/allura_http 0.0s done
#15 DONE 2.8s

=============================================================================
Setup: venv, pip, pysvn, ./rebuild-all.sh, npm, etc.
=============================================================================
Creating network "allura_default" with the default driver
Pulling solr (solr:6-alpine)...
6-alpine: Pulling from library/solr
Digest: sha256:4f63093698313437a49b2f945c4b1545c9e3a655f52581bc6e01ea006fae132e
Status: Downloaded newer image for solr:6-alpine
Pulling mongo (mongo:4.2)...
4.2: Pulling from library/mongo
Digest: sha256:699d652ed67423d689258bad7b316cf005dfbb82b334118ec306f049042f3717
Status: Downloaded newer image for mongo:4.2
Creating allura_mongo_1 ... 
Creating allura_solr_1  ... 
Creating allura_mongo_1 ... done
Creating allura_solr_1  ... done
Creating allura_web_run ... 
Creating allura_web_run ... done

Running scripts/init-docker-dev.sh

Creating SCM directories

Creating directory for SOLR data

Changing it's permissions to 777 so that container will have access to it

Creating virtualenv

Requirement already satisfied: pip in /allura-data/virtualenv/lib/python3.7/site-packages (23.0.1)
Collecting pip
  Downloading pip-23.2.1-py3-none-any.whl (2.1 MB)
     ━━━━━━━━━━━━━━━━━━━━━━━━━━━━━━━━━━━━━━━━ 2.1/2.1 MB 16.3 MB/s eta 0:00:00
Installing collected packages: pip
  Attempting uninstall: pip
    Found existing installation: pip 23.0.1
    Uninstalling pip-23.0.1:
      Successfully uninstalled pip-23.0.1
Successfully installed pip-23.2.1
Collecting wheel
  Obtaining dependency information for wheel from https://files.pythonhosted.org/packages/28/f5/6955d7b3a5d71ce6bac104f9cf98c1b0513ad656cdaca8ea7d579196f771/wheel-0.41.1-py3-none-any.whl.metadata
  Downloading wheel-0.41.1-py3-none-any.whl.metadata (2.2 kB)
Downloading wheel-0.41.1-py3-none-any.whl (64 kB)
   ━━━━━━━━━━━━━━━━━━━━━━━━━━━━━━━━━━━━━━━━ 64.8/64.8 kB 1.9 MB/s eta 0:00:00
Installing collected packages: wheel
Successfully installed wheel-0.41.1
  % Total    % Received % Xferd  Average Speed   Time    Time     Time  Current
                                 Dload  Upload   Total   Spent    Left  Speed
  0     0    0     0    0     0      0      0 --:--:-- --:--:-- --:--:--     0100 12741  100 12741    0     0  49980      0 --:--:-- --:--:-- --:--:-- 49964100 12741  100 12741    0     0  49960      0 --:--:-- --:--:-- --:--:-- 49964
Looking up latest PySVN version...
Downloading PySVN 1.9.20...
Building PySVN...
Processing /tmp/tmpuvho7ru9.pysvn-install/pysvn-1.9.20
  Preparing metadata (setup.py): started
  Preparing metadata (setup.py): finished with status 'done'
Building wheels for collected packages: pysvn
  Building wheel for pysvn (setup.py): started
  Building wheel for pysvn (setup.py): finished with status 'done'
  Created wheel for pysvn: filename=pysvn-1.9.20-cp37-cp37m-linux_x86_64.whl size=738992 sha256=d0eecc43d7793b04e5d655a76c5d211fd05a2e48af5efa04e2f3b6858cb04b97
  Stored in directory: /root/.cache/pip/wheels/3e/eb/6e/025a44f6f93925cf9360d22a2b89c40830aced032572f98f40
Successfully built pysvn
Installing collected packages: pysvn
Successfully installed pysvn-1.9.20

PySVN is installed.

Installing python packages

ERROR: Ignored the following versions that require a different python version: 10.0.0 Requires-Python >=3.8; 2.3.0 Requires-Python >=3.8; 2.3.1 Requires-Python >=3.8; 2.3.2 Requires-Python >=3.8; 2.3.3 Requires-Python >=3.8; 2.3.4 Requires-Python >=3.8; 2.3.5 Requires-Python >=3.8; 2.3.6 Requires-Python >=3.8; 2.3.7 Requires-Python >=3.8; 2023.3.22 Requires-Python >=3.8; 2023.3.23 Requires-Python >=3.8; 2023.5.2 Requires-Python >=3.8; 6.8.0 Requires-Python >=3.8
ERROR: Could not find a version that satisfies the requirement werkzeug==2.3.6 (from versions: 0.1, 0.2, 0.3, 0.3.1, 0.4, 0.4.1, 0.5, 0.5.1, 0.6, 0.6.1, 0.6.2, 0.7, 0.7.1, 0.7.2, 0.8, 0.8.1, 0.8.2, 0.8.3, 0.9, 0.9.1, 0.9.2, 0.9.3, 0.9.4, 0.9.5, 0.9.6, 0.10, 0.10.1, 0.10.2, 0.10.4, 0.11, 0.11.1, 0.11.2, 0.11.3, 0.11.4, 0.11.5, 0.11.6, 0.11.7, 0.11.8, 0.11.9, 0.11.10, 0.11.11, 0.11.12, 0.11.13, 0.11.14, 0.11.15, 0.12, 0.12.1, 0.12.2, 0.13, 0.14, 0.14.1, 0.15.0, 0.15.1, 0.15.2, 0.15.3, 0.15.4, 0.15.5, 0.15.6, 0.16.0, 0.16.1, 1.0.0rc1, 1.0.0, 1.0.1, 2.0.0rc1, 2.0.0rc2, 2.0.0rc3, 2.0.0rc4, 2.0.0rc5, 2.0.0, 2.0.1, 2.0.2, 2.0.3, 2.1.0, 2.1.1, 2.1.2, 2.2.0a1, 2.2.0, 2.2.1, 2.2.2, 2.2.3)
ERROR: No matching distribution found for werkzeug==2.3.6
1

=============================================================================
Starting up docker containers
=============================================================================
allura_solr_1 is up-to-date
allura_mongo_1 is up-to-date
Creating allura_web_1 ... 
Creating allura_web_1 ... done

=============================================================================
Docker Container Info:
=============================================================================

=============================================================================
Setup: tests
=============================================================================

=============================================================================
Run: tests
=============================================================================

=============================================================================
Shutdown
=============================================================================
Stopping allura_solr_1  ... 
Stopping allura_mongo_1 ... 
Stopping allura_mongo_1 ... done
Stopping allura_solr_1  ... done
Removing allura_web_1   ... 
Removing allura_solr_1  ... 
Removing allura_mongo_1 ... 
Removing allura_web_1   ... done
Removing allura_mongo_1 ... done
Removing allura_solr_1  ... done
Removing network allura_default
Total reclaimed space: 0B
Deleted Volumes:
1c20d2fe4b4775c73dc75c60923a14f5381f928002b62419a7a59ba3812ed890
676ef1d8bb8192f3e0b90eca608b3dca487b32934fa5335f7728719f1bd89ee5
80952bb88897fe99ad042148fbfaea1b5e0ced2003eb216ac7baede0dd8fc9b9
a4edf768dcdd069f6ca6399a6e4b2323027c49364a6b0b3781938dddee1d93ba
f7e8da6369decb1231d6062e222e012a988683b1da29e2dcf4c4e95f827164ad
050e40a5dfc58ae48d0be94d7c248d5ead18632ded1f4dbf0e0f525bc6550eef
4bc3ed1ce4e89cae159dcbfcf4e8753ad82f4bd3a42904a4ffb9e28a3760d65d
551318c96b7bb45dfa7db4202cbed1406e75d1ec9fad7d10228e34ce45ef1ca4
81144862d1645ac1e0a568320c383a7920cd4deaae0063be161b8867a5179d7f
c0500c8fa7c009905bfdb54cd4506a9ffdf899109d4e60310d11cad19792fd05
0a7f30bc86b10e56e8319c1d226f1e6f958e495f36882bf977967def590bb6d0
5cb1d0fec53799208da644ba6413855b32364172aefbde3b0e42c93467b726eb
6328fffb0df5736c27fdf4e39f24dbf42d6a24b6b931a0c1055563424b4ecbf7
9566d87fa998dc7d5e41102c39511652e99142656744a05836cd3c1c86843de2
a2642e03c5d2cd46515160b5c916c98714ad4e40abb07ca25039694c102fe557
a4bcf3cc8ca7a19c8b9c39fdc69d2280b064895f762ab480f97faaca4621cbd2
aca0d6139c549b70c9ce17781186257ee4bdb381e49f5fcad6231c1e0e0edbfa
009012e2c8613e54144b4f1d0002f0b7e79a302d9121ce84d610d1f8ff46b8f3
a14fcce1bc96912775dbb01e6309fc41246f68f41f70c272a49d86cc189af29a
33865cc3b2e95cdf004fc6d1395ba3ce8a336d990ab32da1f978f99c94ba4aaa
68f844832bce032c2bed3ac126f051e04f94c79195da18c944154e8a5ddf356f
84f103e5b69f266e45a317118b2be3a99b73a90c741e09d9be020ae3f4046173
85a320bb725491b03ec8da45f206463a9e3992ca9d81e14802b6a3108e3c2342
c68cc26f147c16c101bfac45e4d5246a141831e4f0543d8221c297309605d47f
317c33e4f9698bba650e9c1945ba4b048de41f0ddc2ae693559e25d98a54179c
db397837035bae836b574dbd33b0d858c13e07c74491a5dafc83720f98aade11
ebc5d90dda5e558b26b3340c1053728768c9089d7fa53c00aa55f99b3f91cddb
8ebcebef8686aa4051440b98006c9f27b098d17a00c9c199c40ee0d21c8b05ed
81ce8fb51b50726e26784a67e08291232da9a5c5cf8af55ddb4bccc1087b8333
f94276ded07aba1cd687b53a5a44eb901747464d73798d526187a28cf0637e86
64990d3b8fe11d2cb281743b3530b00040549e3b0e53ed690535dceaaff4174c
5c2f46f4265d9f7a784993b6425ae40d490d9080827381461156fc4db6ae4c72
f65641d7a4bc6d930696a809b3dd539ca147c0fd899acf57b5075c44006241f5
3cf8a625b16ae0faed4775b6f996bc2170b92a3a7a296afa4f1f23006c31d87f
acfc2ffcc7a2ed71ca888b6c01a0936c444056bb30ba3419c36eeb69a83479c1
ce6e58bc265c077a38a26446e2afeeac71b4dd86443cc1f927fe61eab1b59dd4
e3ff6d4262e31a052310df667a1ab5b764496b7b01ab742c0b3fab0a6956ec4a
6dd927b27e2314f3155b87ca4133b85ca40629dd7852b2a2b1c5d59d7ca648fb
81152fde3cec55eedd593f8904f510f4816cf2ee923a2200a2c93deeeee9688d
4db5a0b43fc47c703a7a58e9811fe7b500297560f02d5001675b89fd2cfae482
5b23690ac855f0e4b807c6e777a8f7040c25fe2cfadbe0f069d4ca8458751c09
d2d3bd9fc073808a5bfbc45b2506188b6dd2668e30706891c9858d0460026cf2
4be5f608e2beb0be5534f37c25425dd356fdc3b50c7d05edc07a0a1de90c2d60
306b6a6801f4b0cd0543c152cbeb916ee8a331cb5017f8dc9751169a3a12992c
6b88d116d1234826be27f52274450ab322695db7b559d1452d480a47d9a31a4e
7852bb1c21a09cedde2fc2d604d22767d23cd6700469e24e2e446b2183b8977e
8aaa8be7efe58b1b82e467d192fedfe5c837769bf7f95b12350da654f7afb4f5
23dc50e5b14a92429ad8f9e18f8af2ad72a30b1a1846afb1d790377bf414165f
51cca00365c70ddaa34fb89788d2afdd0091177a346a50170b0d548e2153d9e4
5f4c8a34f9c39470cb007bc66ae322e5bf3646bfd0a9c1e414bf931ce556eb30
87f8dcb7cff768539b0765ec0b0de7ea63402f801d7df18314301c766dc4feae
e48e1db68367b0e030f81dea86e50f735d1d1124fe50db4de977c2111ea4eb5f
0e3f57768b7b6471ecdef4cc211d0298295c700efebf61b438cb89eec55ae4d8
314f5c6a0b25ceb7985018dbd74f555aaf8e865d65eb2f3ac72ea16deb6e3757
1e3b43f06d357c1b6828ca87626d9e09e40cdca02c8e2c9f664e1ff4ef52ea9a
24c7bf4ec7bebdbf260eb14c5fca51c2e8ad81ea4941abb9a3e7d17ccdd2e8b4
4b4a544a12542adfbe969586334d9f802ef998d230dd777c7d504d8305d21272
584af47936139271fc6c748cf9e4c60fd385bd06c909aa51cc7c73d0a1019603
ef52ed5382f18fb8dfb4dd62feeaeecf96397251debd54a3fd56eba7b6fb4152
09891a41df585a27205ebc3efeedd166b306e1ef3b30f910217a2cd89af3fab3
d90731d9cdce28b86f8f4c16296b2d9b51f8a5540627c16b27260aa43147bedd
51a65e61af8cbd6e345543618c135ca10c9cc20bbe0fed43cefb8edff8a6660b
e00e8579356f00a9cd144bd583de5c459d7e4d41008ce115eb445d2e3617b401
237df3d8a99e7cf609182f665d2ae50d8ab180041712842655244ea608dff9c0

Total reclaimed space: 11.08GB
Build step 'Execute shell' marked build as failure
Recording test results
ERROR: Step ‘Publish JUnit test result report’ failed: No test report files were found. Configuration error?

Build failed in Jenkins: Allura » Allura-py3.7 #260

Posted by Apache Jenkins Server <je...@builds.apache.org>.
See <https://ci-builds.apache.org/job/Allura/job/Allura-py3.7/260/display/redirect>

Changes:


------------------------------------------
[...truncated 4.41 KB...]
BUILD_TIMESTAMP=2023-08-14 17:29:23 UTC
CI=true
GIT_URL=https://gitbox.apache.org/repos/asf/allura.git/
HUDSON_COOKIE=e268b23c-f7a6-44d4-a65e-c8233f6effc4
XDG_SESSION_ID=2611
USER=jenkins
BUILD_NUMBER=260
WORKSPACE=<https://ci-builds.apache.org/job/Allura/job/Allura-py3.7/ws/>
PWD=<https://ci-builds.apache.org/job/Allura/job/Allura-py3.7/ws/>
HUDSON_URL=https://ci-builds.apache.org/
HOME=/home/jenkins
JENKINSGRADLEPLUGIN_CCUD_PLUGIN_VERSION=1.10
NODE_NAME=builds58
HUDSON_SERVER_COOKIE=9c7f00b5d9bf9427
SSH_CLIENT=95.217.196.215 59128 22
JENKINS_HOME=/home/jenkins/jenkins-home
JOB_NAME=Allura/Allura-py3.7
RUN_TESTS_DISPLAY_URL=https://ci-builds.apache.org/job/Allura/job/Allura-py3.7/260/display/redirect?page=tests
GIT_PREVIOUS_COMMIT=90b07ba2f6d010273068235f31185075d02fd317
HUDSON_HOME=/home/jenkins/jenkins-home
JOB_DISPLAY_URL=https://ci-builds.apache.org/job/Allura/job/Allura-py3.7/display/redirect
JENKINSGRADLEPLUGIN_GRADLE_ENTERPRISE_ENFORCE_URL=true
JENKINSGRADLEPLUGIN_GRADLE_AUTO_INJECTION=true
RUN_ARTIFACTS_DISPLAY_URL=https://ci-builds.apache.org/job/Allura/job/Allura-py3.7/260/display/redirect?page=artifacts
MAIL=/var/mail/jenkins
BUILD_URL=https://ci-builds.apache.org/job/Allura/job/Allura-py3.7/260/
SHELL=/bin/bash
JOB_URL=https://ci-builds.apache.org/job/Allura/job/Allura-py3.7/
BUILD_DISPLAY_NAME=#260
PY_VERSION=3.7
ROOT_BUILD_CAUSE=MANUALTRIGGER
SHLVL=3
GIT_BRANCH=origin/master
JENKINSGRADLEPLUGIN_GRADLE_ENTERPRISE_URL=https://ge.apache.org
ROOT_BUILD_CAUSE_MANUALTRIGGER=true
BUILD_TAG=jenkins-Allura-Allura-py3.7-260
JENKINSGRADLEPLUGIN_GRADLE_ENTERPRISE_GRADLE_INJECTION_ENABLED=false
NODE_LABELS=builds58 ubuntu
LOGNAME=jenkins
DBUS_SESSION_BUS_ADDRESS=unix:path=/run/user/910/bus
XDG_RUNTIME_DIR=/run/user/910
PATH=/usr/local/sbin:/usr/local/bin:/usr/sbin:/usr/bin:/sbin:/bin:/snap/bin
BUILD_CAUSE_MANUALTRIGGER=true
GIT_PREVIOUS_SUCCESSFUL_COMMIT=61ee60cac206a2ef7e705c1e4496cc6a43fd91a1
JENKINS_SERVER_COOKIE=9c7f00b5d9bf9427
_=/usr/bin/env

=============================================================================
Run: cleanup previous runs
=============================================================================
/usr/local/lib/python2.7/dist-packages/paramiko/transport.py:33: CryptographyDeprecationWarning: Python 2 is no longer supported by the Python core team. Support for it is now deprecated in cryptography, and will be removed in the next release.
  from cryptography.hazmat.backends import default_backend
Removing network allura_default
Network allura_default not found.

=============================================================================
Run: build docker image
=============================================================================
/usr/local/lib/python2.7/dist-packages/paramiko/transport.py:33: CryptographyDeprecationWarning: Python 2 is no longer supported by the Python core team. Support for it is now deprecated in cryptography, and will be removed in the next release.
  from cryptography.hazmat.backends import default_backend
--build-arg is only supported when services are specified for API version < 1.25. Please use a Compose file version > 2.2 or specify which services to build.

=============================================================================
Setup: venv, pip, pysvn, ./rebuild-all.sh, npm, etc.
=============================================================================
/usr/local/lib/python2.7/dist-packages/paramiko/transport.py:33: CryptographyDeprecationWarning: Python 2 is no longer supported by the Python core team. Support for it is now deprecated in cryptography, and will be removed in the next release.
  from cryptography.hazmat.backends import default_backend
Creating network "allura_default" with the default driver
Pulling mongo (mongo:4.2)...
4.2: Pulling from library/mongo
Digest: sha256:699d652ed67423d689258bad7b316cf005dfbb82b334118ec306f049042f3717
Status: Downloaded newer image for mongo:4.2
Pulling solr (solr:6-alpine)...
6-alpine: Pulling from library/solr
Digest: sha256:4f63093698313437a49b2f945c4b1545c9e3a655f52581bc6e01ea006fae132e
Status: Downloaded newer image for solr:6-alpine
Creating allura_solr_1 ... 
Creating allura_mongo_1 ... 
Creating allura_mongo_1 ... doneCreating allura_solr_1  ... doneBuilding web
Traceback (most recent call last):
  File "/usr/local/bin/docker-compose", line 8, in <module>
    sys.exit(main())
  File "/usr/local/lib/python2.7/dist-packages/compose/cli/main.py", line 72, in main
    command()
  File "/usr/local/lib/python2.7/dist-packages/compose/cli/main.py", line 128, in perform_command
    handler(command, command_options)
  File "/usr/local/lib/python2.7/dist-packages/compose/cli/main.py", line 866, in run
    self.toplevel_options, self.toplevel_environment
  File "/usr/local/lib/python2.7/dist-packages/compose/cli/main.py", line 1327, in run_one_off_container
    **container_options)
  File "/usr/local/lib/python2.7/dist-packages/compose/service.py", line 331, in create_container
    self.ensure_image_exists()
  File "/usr/local/lib/python2.7/dist-packages/compose/service.py", line 367, in ensure_image_exists
    self.build(cli=cli)
  File "/usr/local/lib/python2.7/dist-packages/compose/service.py", line 1106, in build
    platform=self.platform,
  File "/usr/local/lib/python2.7/dist-packages/docker/api/build.py", line 160, in build
    path, exclude=exclude, dockerfile=dockerfile, gzip=gzip
  File "/usr/local/lib/python2.7/dist-packages/docker/utils/build.py", line 30, in tar
    files=sorted(exclude_paths(root, exclude, dockerfile=dockerfile[0])),
  File "/usr/local/lib/python2.7/dist-packages/docker/utils/build.py", line 49, in exclude_paths
    return set(pm.walk(root))
  File "/usr/local/lib/python2.7/dist-packages/docker/utils/build.py", line 215, in rec_walk
    for sub in rec_walk(cur):
  File "/usr/local/lib/python2.7/dist-packages/docker/utils/build.py", line 215, in rec_walk
    for sub in rec_walk(cur):
  File "/usr/local/lib/python2.7/dist-packages/docker/utils/build.py", line 215, in rec_walk
    for sub in rec_walk(cur):
  File "/usr/local/lib/python2.7/dist-packages/docker/utils/build.py", line 185, in rec_walk
    for f in os.listdir(current_dir):
OSError: [Errno 13] Permission denied: '<https://ci-builds.apache.org/job/Allura/job/Allura-py3.7/ws/allura-data/mongo/journal'>

=============================================================================
Starting up docker containers
=============================================================================
/usr/local/lib/python2.7/dist-packages/paramiko/transport.py:33: CryptographyDeprecationWarning: Python 2 is no longer supported by the Python core team. Support for it is now deprecated in cryptography, and will be removed in the next release.
  from cryptography.hazmat.backends import default_backend
Building web
Traceback (most recent call last):
  File "/usr/local/bin/docker-compose", line 8, in <module>
    sys.exit(main())
  File "/usr/local/lib/python2.7/dist-packages/compose/cli/main.py", line 72, in main
    command()
  File "/usr/local/lib/python2.7/dist-packages/compose/cli/main.py", line 128, in perform_command
    handler(command, command_options)
  File "/usr/local/lib/python2.7/dist-packages/compose/cli/main.py", line 1078, in up
    to_attach = up(False)
  File "/usr/local/lib/python2.7/dist-packages/compose/cli/main.py", line 1074, in up
    cli=native_builder,
  File "/usr/local/lib/python2.7/dist-packages/compose/project.py", line 548, in up
    svc.ensure_image_exists(do_build=do_build, silent=silent, cli=cli)
  File "/usr/local/lib/python2.7/dist-packages/compose/service.py", line 367, in ensure_image_exists
    self.build(cli=cli)
  File "/usr/local/lib/python2.7/dist-packages/compose/service.py", line 1106, in build
    platform=self.platform,
  File "/usr/local/lib/python2.7/dist-packages/docker/api/build.py", line 160, in build
    path, exclude=exclude, dockerfile=dockerfile, gzip=gzip
  File "/usr/local/lib/python2.7/dist-packages/docker/utils/build.py", line 30, in tar
    files=sorted(exclude_paths(root, exclude, dockerfile=dockerfile[0])),
  File "/usr/local/lib/python2.7/dist-packages/docker/utils/build.py", line 49, in exclude_paths
    return set(pm.walk(root))
  File "/usr/local/lib/python2.7/dist-packages/docker/utils/build.py", line 215, in rec_walk
    for sub in rec_walk(cur):
  File "/usr/local/lib/python2.7/dist-packages/docker/utils/build.py", line 215, in rec_walk
    for sub in rec_walk(cur):
  File "/usr/local/lib/python2.7/dist-packages/docker/utils/build.py", line 215, in rec_walk
    for sub in rec_walk(cur):
  File "/usr/local/lib/python2.7/dist-packages/docker/utils/build.py", line 185, in rec_walk
    for f in os.listdir(current_dir):
OSError: [Errno 13] Permission denied: '<https://ci-builds.apache.org/job/Allura/job/Allura-py3.7/ws/allura-data/mongo/journal'>

=============================================================================
Docker Container Info:
=============================================================================
/usr/local/lib/python2.7/dist-packages/paramiko/transport.py:33: CryptographyDeprecationWarning: Python 2 is no longer supported by the Python core team. Support for it is now deprecated in cryptography, and will be removed in the next release.
  from cryptography.hazmat.backends import default_backend
No container found for web_1

=============================================================================
Setup: tests
=============================================================================
/usr/local/lib/python2.7/dist-packages/paramiko/transport.py:33: CryptographyDeprecationWarning: Python 2 is no longer supported by the Python core team. Support for it is now deprecated in cryptography, and will be removed in the next release.
  from cryptography.hazmat.backends import default_backend
No container found for web_1
/usr/local/lib/python2.7/dist-packages/paramiko/transport.py:33: CryptographyDeprecationWarning: Python 2 is no longer supported by the Python core team. Support for it is now deprecated in cryptography, and will be removed in the next release.
  from cryptography.hazmat.backends import default_backend
No container found for web_1

=============================================================================
Run: tests
=============================================================================
/usr/local/lib/python2.7/dist-packages/paramiko/transport.py:33: CryptographyDeprecationWarning: Python 2 is no longer supported by the Python core team. Support for it is now deprecated in cryptography, and will be removed in the next release.
  from cryptography.hazmat.backends import default_backend
No container found for web_1
/usr/local/lib/python2.7/dist-packages/paramiko/transport.py:33: CryptographyDeprecationWarning: Python 2 is no longer supported by the Python core team. Support for it is now deprecated in cryptography, and will be removed in the next release.
  from cryptography.hazmat.backends import default_backend
No container found for web_1
/usr/local/lib/python2.7/dist-packages/paramiko/transport.py:33: CryptographyDeprecationWarning: Python 2 is no longer supported by the Python core team. Support for it is now deprecated in cryptography, and will be removed in the next release.
  from cryptography.hazmat.backends import default_backend
Setting environment for exec is not supported in API < 1.25 (1.24)

=============================================================================
Shutdown
=============================================================================
/usr/local/lib/python2.7/dist-packages/paramiko/transport.py:33: CryptographyDeprecationWarning: Python 2 is no longer supported by the Python core team. Support for it is now deprecated in cryptography, and will be removed in the next release.
  from cryptography.hazmat.backends import default_backend
Stopping allura_solr_1  ... 
Stopping allura_mongo_1 ... 
Stopping allura_mongo_1 ... doneStopping allura_solr_1  ... doneRemoving allura_solr_1  ... 
Removing allura_mongo_1 ... 
Removing allura_mongo_1 ... doneRemoving allura_solr_1  ... doneRemoving network allura_default
Total reclaimed space: 0B
Deleted Volumes:
aa77711e48e5d42ba50dc740ed9ca3f64459449af08050734eeaeb0ea0bd3d34
75cf2c5fa9418ccf6f551413e3938ddf3ecbc974d084896540672d2447ff1f6e
7ec69ee44fe3b7a67d660c02213deca31c82343e86c24a556722cf1eef67ea9c
090c4c8e6f9def28d02888fd5232592ecf919f0a9e1197cb5c14c8abf9594a14
59cca35b87bc2f9f76f84e9d8601802b47ebc503a2578f19cacf18e2bd142dd9
be835e8d52c5fe2472f022b8f125c1e4f4ab420b199746e698cab4300ab50366
7a1ea03ee1a0d9ff2d3b561744446f377b313d3da5f8f409ac6a5c4c62e35adc
7745186b452b1d9292173425381d229cb5a3448468f077d7c1b06eb23b72fd98
e4339382b1e334888fec96d723a2a2bc3c014babc902f3178d0635dae062257c
566dceab33a1845b751a19a7ea3536957e1a4c1e4e9e1bb12f8a6ddd93ff1fc3
230650f59513d7357f1dd63da0d791ca4f390f7406ec71bf88200f844ccd1cff
f6515be6ab1ef96bf12198cc1c73bbc5b9285e13035079452bdc87d64788938e
e4b1ad91a092d315f554be108ce2d6159ef3dc2d97d55ba218b217e1e87e5f34
a25d56f96474e28f954ec58f0504fb3be896ef0414261af8f9c001bc6c38759c
17f91a3e8933e128048b7db0073052d63269b6c7a44a87b645f45ca9249552ee
595fdfb78ef12bb56faa5be2d76c7fd067e348d05eeec0cb4041710975f01fa3
848971e2ee982e1283a1e6b259f282b99cc303bd578c09919133e987742382ab
0517d3b85ad07e5dd347a2c205f404f9f8351c4207b9dc849fdcae520f6424c8
8722151c6624a8a28ed83f73f7b187325e96b1ee0bb59b0b707de527f2a6d921
ee983f4967f4fa0c7817caae4003a73c6c9463ed471227793df791034821cbff
6706073a2156f5b829fc0d681f555b23fa9babb44122b93aac953311a98d55d6
06c5ac5197c24e2965dc9081a71d12d2fcabb1574b4fdd6456ef38739f52b6ed
4a24a2a2cf181eaadfc1d297b6c41a9b5dc6e1e5a3c66fb7138dcd3772f895b4
70a06e22143f69451387be8315374a2ee035fd3cb70251ddfd7d91aa4036e985
4f041ce60f0e3f40e51a582acb9285ea4be78a26f5b32d6df94f88c9143240e4
e84c71e2df1f18523d4bfcf38e46a8a013df3a14628267fbc8e9aac857428b34
f2d4d9cb98628068379eac11990bc525e93b2cba407f2ee5ce09fc6a9eed1ad7
3be1fd013050f502ff364ab98b963dfb6f85027974f57c81e7916ffc55b129ad
7fbf54a3a5d742a4f54649b079918dbb86b1d36452b76b8dc630bd011f275f7b
d7e1c675ed0c2835331ef88309aa64eb671274d669c6d533fcfeee8346557564
f92b3b8022fa02021a849a4825f79bdfcda4ccc7cdf2be42c25129db25e52b38
c4e75fc82146bce8598b40151ec1e536fdac514cbc56f38ac527da5b87d6a793
c4b7dc824f797c9fc312b6ef3db884d72e82e3770fcc22e3c2da967f9f1f67e6
8b0467dc2638b04fca4ed22502624c04bc070ec1fb3b529a0cf8014fdfec67b6
dbe10c592f45e066bb0638157eaf7e5351569e5c62742bbde08e112248419d5b
7d33db582c58d6b4649f65286346876d88dc5b6f5ac350dc58738471b5ff55a8
5025e370c45550622cf9905a87e18384621fa79a15fc93bd42cdc05c13efa367
3bec7d71ca8fb8398d0978b4dbb5af7280a78aa8074db532ee9904e3370f37be
7964ebfa1fc82f716fff5a292ec14e5a2eaeb3a4cfed2617cba8354c335bbbdc
6820c5b7737a644945fe2eede0ed9ae8337ebcc6202529d08207f27002fc9505
d2d88f65e982476902337d092a320f78cb8e528c7f802640a8b1a2e401c6b124
0866cc1f34e0d2a94a1700b3b4136711421199d9f08de235ada3469c89bb9cf2
042ad93ef7baa61cd957a530d38bd828054f001c512efaa0db9509064911dbac
be872cd9b7986bdee1b23e74309268f76fd449d39388cbe7574d31d55d5ec595
9cd9f99514b4af81ccdaae9e80e96ee77ae05185bac0294351574635f0266760
220a83ca9e0ca2c2a2295dadf6d3b872f983339b7ece868897e3e9a871ac9891
2a91744c7ca899142e597d1abafb9144ef57521153004c0be98f74c2900ea2fc
3dd2bdb050d59dd54bfd3f7d418b8780fa056696a06c114502b8498236d0d90a
abc9d596fa2301ac184f9507f4984eb16b5a50fc2d1e651944248883fd9ec562
ac811939117a8188fb410d6fb7beb9d57a86347765691e5c8e6dc5ab3a4f3da5
13c963040f1a95f4b130819846ffbc2f4e836adbb56b09f61e43b5127c1bb2b3

Total reclaimed space: 8.595GB
Build step 'Execute shell' marked build as failure
Recording test results
ERROR: Step ?Publish JUnit test result report? failed: No test report files were found. Configuration error?

Build failed in Jenkins: Allura » Allura-py3.7 #259

Posted by Apache Jenkins Server <je...@builds.apache.org>.
See <https://ci-builds.apache.org/job/Allura/job/Allura-py3.7/259/display/redirect>

Changes:


------------------------------------------
[...truncated 3.53 KB...]
workspace: <https://ci-builds.apache.org/job/Allura/job/Allura-py3.7/ws/>
jenkins_home: /home/jenkins/jenkins-home
home: /home/jenkins
pwd: <https://ci-builds.apache.org/job/Allura/job/Allura-py3.7/ws/>
GIT_COMMIT=90b07ba2f6d010273068235f31185075d02fd317
RUN_DISPLAY_URL=https://ci-builds.apache.org/job/Allura/job/Allura-py3.7/259/display/redirect
JENKINS_URL=https://ci-builds.apache.org/
EXECUTOR_NUMBER=0
SSH_CONNECTION=95.217.196.215 57886 67.195.81.182 22
LANG=en_US
BUILD_ID=259
BUILD_CAUSE=MANUALTRIGGER
OLDPWD=/home/jenkins
RUN_CHANGES_DISPLAY_URL=https://ci-builds.apache.org/job/Allura/job/Allura-py3.7/259/display/redirect?page=changes
GRADLE_ENTERPRISE_ACCESS_KEY=ge.apache.org=etlwjhwel56ybdijfxymbj5bb6fwydcy3sj2oe6rlwjzotgalrea
JENKINSGRADLEPLUGIN_GRADLE_ENTERPRISE_PLUGIN_VERSION=3.13.1
JOB_BASE_NAME=Allura-py3.7
WORKSPACE_TMP=<ht...@tmp>
BUILD_TIMESTAMP=2023-08-14 17:25:48 UTC
CI=true
GIT_URL=https://gitbox.apache.org/repos/asf/allura.git/
HUDSON_COOKIE=64267e7c-ea87-4742-9246-a27912b00f6e
XDG_SESSION_ID=2577
USER=jenkins
BUILD_NUMBER=259
WORKSPACE=<https://ci-builds.apache.org/job/Allura/job/Allura-py3.7/ws/>
PWD=<https://ci-builds.apache.org/job/Allura/job/Allura-py3.7/ws/>
HUDSON_URL=https://ci-builds.apache.org/
HOME=/home/jenkins
JENKINSGRADLEPLUGIN_CCUD_PLUGIN_VERSION=1.10
NODE_NAME=builds56
HUDSON_SERVER_COOKIE=9c7f00b5d9bf9427
SSH_CLIENT=95.217.196.215 57886 22
JENKINS_HOME=/home/jenkins/jenkins-home
JOB_NAME=Allura/Allura-py3.7
RUN_TESTS_DISPLAY_URL=https://ci-builds.apache.org/job/Allura/job/Allura-py3.7/259/display/redirect?page=tests
GIT_PREVIOUS_COMMIT=90b07ba2f6d010273068235f31185075d02fd317
HUDSON_HOME=/home/jenkins/jenkins-home
JOB_DISPLAY_URL=https://ci-builds.apache.org/job/Allura/job/Allura-py3.7/display/redirect
JENKINSGRADLEPLUGIN_GRADLE_ENTERPRISE_ENFORCE_URL=true
JENKINSGRADLEPLUGIN_GRADLE_AUTO_INJECTION=true
RUN_ARTIFACTS_DISPLAY_URL=https://ci-builds.apache.org/job/Allura/job/Allura-py3.7/259/display/redirect?page=artifacts
MAIL=/var/mail/jenkins
BUILD_URL=https://ci-builds.apache.org/job/Allura/job/Allura-py3.7/259/
SHELL=/bin/bash
JOB_URL=https://ci-builds.apache.org/job/Allura/job/Allura-py3.7/
BUILD_DISPLAY_NAME=#259
PY_VERSION=3.7
ROOT_BUILD_CAUSE=MANUALTRIGGER
SHLVL=3
GIT_BRANCH=origin/master
JENKINSGRADLEPLUGIN_GRADLE_ENTERPRISE_URL=https://ge.apache.org
ROOT_BUILD_CAUSE_MANUALTRIGGER=true
BUILD_TAG=jenkins-Allura-Allura-py3.7-259
JENKINSGRADLEPLUGIN_GRADLE_ENTERPRISE_GRADLE_INJECTION_ENABLED=false
NODE_LABELS=builds56 ubuntu
LOGNAME=jenkins
DBUS_SESSION_BUS_ADDRESS=unix:path=/run/user/910/bus
XDG_RUNTIME_DIR=/run/user/910
PATH=/usr/local/sbin:/usr/local/bin:/usr/sbin:/usr/bin:/sbin:/bin:/snap/bin
BUILD_CAUSE_MANUALTRIGGER=true
GIT_PREVIOUS_SUCCESSFUL_COMMIT=61ee60cac206a2ef7e705c1e4496cc6a43fd91a1
JENKINS_SERVER_COOKIE=9c7f00b5d9bf9427
_=/usr/bin/env

=============================================================================
Run: cleanup previous runs
=============================================================================
/usr/local/lib/python2.7/dist-packages/paramiko/transport.py:33: CryptographyDeprecationWarning: Python 2 is no longer supported by the Python core team. Support for it is now deprecated in cryptography, and will be removed in the next release.
  from cryptography.hazmat.backends import default_backend
Removing network allura_default
Network allura_default not found.

=============================================================================
Run: build docker image
=============================================================================
/usr/local/lib/python2.7/dist-packages/paramiko/transport.py:33: CryptographyDeprecationWarning: Python 2 is no longer supported by the Python core team. Support for it is now deprecated in cryptography, and will be removed in the next release.
  from cryptography.hazmat.backends import default_backend
--build-arg is only supported when services are specified for API version < 1.25. Please use a Compose file version > 2.2 or specify which services to build.

=============================================================================
Setup: venv, pip, pysvn, ./rebuild-all.sh, npm, etc.
=============================================================================
/usr/local/lib/python2.7/dist-packages/paramiko/transport.py:33: CryptographyDeprecationWarning: Python 2 is no longer supported by the Python core team. Support for it is now deprecated in cryptography, and will be removed in the next release.
  from cryptography.hazmat.backends import default_backend
Creating network "allura_default" with the default driver
Pulling mongo (mongo:4.2)...
4.2: Pulling from library/mongo
Digest: sha256:699d652ed67423d689258bad7b316cf005dfbb82b334118ec306f049042f3717
Status: Downloaded newer image for mongo:4.2
Pulling solr (solr:6-alpine)...
6-alpine: Pulling from library/solr
Digest: sha256:4f63093698313437a49b2f945c4b1545c9e3a655f52581bc6e01ea006fae132e
Status: Downloaded newer image for solr:6-alpine
Creating allura_mongo_1 ... 
Creating allura_solr_1  ... 
Creating allura_mongo_1 ... doneCreating allura_solr_1  ... doneBuilding web
Traceback (most recent call last):
  File "/usr/local/bin/docker-compose", line 8, in <module>
    sys.exit(main())
  File "/usr/local/lib/python2.7/dist-packages/compose/cli/main.py", line 72, in main
    command()
  File "/usr/local/lib/python2.7/dist-packages/compose/cli/main.py", line 128, in perform_command
    handler(command, command_options)
  File "/usr/local/lib/python2.7/dist-packages/compose/cli/main.py", line 866, in run
    self.toplevel_options, self.toplevel_environment
  File "/usr/local/lib/python2.7/dist-packages/compose/cli/main.py", line 1327, in run_one_off_container
    **container_options)
  File "/usr/local/lib/python2.7/dist-packages/compose/service.py", line 331, in create_container
    self.ensure_image_exists()
  File "/usr/local/lib/python2.7/dist-packages/compose/service.py", line 367, in ensure_image_exists
    self.build(cli=cli)
  File "/usr/local/lib/python2.7/dist-packages/compose/service.py", line 1106, in build
    platform=self.platform,
  File "/usr/local/lib/python2.7/dist-packages/docker/api/build.py", line 160, in build
    path, exclude=exclude, dockerfile=dockerfile, gzip=gzip
  File "/usr/local/lib/python2.7/dist-packages/docker/utils/build.py", line 30, in tar
    files=sorted(exclude_paths(root, exclude, dockerfile=dockerfile[0])),
  File "/usr/local/lib/python2.7/dist-packages/docker/utils/build.py", line 49, in exclude_paths
    return set(pm.walk(root))
  File "/usr/local/lib/python2.7/dist-packages/docker/utils/build.py", line 215, in rec_walk
    for sub in rec_walk(cur):
  File "/usr/local/lib/python2.7/dist-packages/docker/utils/build.py", line 215, in rec_walk
    for sub in rec_walk(cur):
  File "/usr/local/lib/python2.7/dist-packages/docker/utils/build.py", line 215, in rec_walk
    for sub in rec_walk(cur):
  File "/usr/local/lib/python2.7/dist-packages/docker/utils/build.py", line 185, in rec_walk
    for f in os.listdir(current_dir):
OSError: [Errno 13] Permission denied: '<https://ci-builds.apache.org/job/Allura/job/Allura-py3.7/ws/allura-data/mongo/journal'>

=============================================================================
Starting up docker containers
=============================================================================
/usr/local/lib/python2.7/dist-packages/paramiko/transport.py:33: CryptographyDeprecationWarning: Python 2 is no longer supported by the Python core team. Support for it is now deprecated in cryptography, and will be removed in the next release.
  from cryptography.hazmat.backends import default_backend
Building web
Traceback (most recent call last):
  File "/usr/local/bin/docker-compose", line 8, in <module>
    sys.exit(main())
  File "/usr/local/lib/python2.7/dist-packages/compose/cli/main.py", line 72, in main
    command()
  File "/usr/local/lib/python2.7/dist-packages/compose/cli/main.py", line 128, in perform_command
    handler(command, command_options)
  File "/usr/local/lib/python2.7/dist-packages/compose/cli/main.py", line 1078, in up
    to_attach = up(False)
  File "/usr/local/lib/python2.7/dist-packages/compose/cli/main.py", line 1074, in up
    cli=native_builder,
  File "/usr/local/lib/python2.7/dist-packages/compose/project.py", line 548, in up
    svc.ensure_image_exists(do_build=do_build, silent=silent, cli=cli)
  File "/usr/local/lib/python2.7/dist-packages/compose/service.py", line 367, in ensure_image_exists
    self.build(cli=cli)
  File "/usr/local/lib/python2.7/dist-packages/compose/service.py", line 1106, in build
    platform=self.platform,
  File "/usr/local/lib/python2.7/dist-packages/docker/api/build.py", line 160, in build
    path, exclude=exclude, dockerfile=dockerfile, gzip=gzip
  File "/usr/local/lib/python2.7/dist-packages/docker/utils/build.py", line 30, in tar
    files=sorted(exclude_paths(root, exclude, dockerfile=dockerfile[0])),
  File "/usr/local/lib/python2.7/dist-packages/docker/utils/build.py", line 49, in exclude_paths
    return set(pm.walk(root))
  File "/usr/local/lib/python2.7/dist-packages/docker/utils/build.py", line 215, in rec_walk
    for sub in rec_walk(cur):
  File "/usr/local/lib/python2.7/dist-packages/docker/utils/build.py", line 215, in rec_walk
    for sub in rec_walk(cur):
  File "/usr/local/lib/python2.7/dist-packages/docker/utils/build.py", line 215, in rec_walk
    for sub in rec_walk(cur):
  File "/usr/local/lib/python2.7/dist-packages/docker/utils/build.py", line 185, in rec_walk
    for f in os.listdir(current_dir):
OSError: [Errno 13] Permission denied: '<https://ci-builds.apache.org/job/Allura/job/Allura-py3.7/ws/allura-data/mongo/diagnostic.data'>

=============================================================================
Docker Container Info:
=============================================================================
/usr/local/lib/python2.7/dist-packages/paramiko/transport.py:33: CryptographyDeprecationWarning: Python 2 is no longer supported by the Python core team. Support for it is now deprecated in cryptography, and will be removed in the next release.
  from cryptography.hazmat.backends import default_backend
No container found for web_1

=============================================================================
Setup: tests
=============================================================================
/usr/local/lib/python2.7/dist-packages/paramiko/transport.py:33: CryptographyDeprecationWarning: Python 2 is no longer supported by the Python core team. Support for it is now deprecated in cryptography, and will be removed in the next release.
  from cryptography.hazmat.backends import default_backend
No container found for web_1
/usr/local/lib/python2.7/dist-packages/paramiko/transport.py:33: CryptographyDeprecationWarning: Python 2 is no longer supported by the Python core team. Support for it is now deprecated in cryptography, and will be removed in the next release.
  from cryptography.hazmat.backends import default_backend
No container found for web_1

=============================================================================
Run: tests
=============================================================================
/usr/local/lib/python2.7/dist-packages/paramiko/transport.py:33: CryptographyDeprecationWarning: Python 2 is no longer supported by the Python core team. Support for it is now deprecated in cryptography, and will be removed in the next release.
  from cryptography.hazmat.backends import default_backend
No container found for web_1
/usr/local/lib/python2.7/dist-packages/paramiko/transport.py:33: CryptographyDeprecationWarning: Python 2 is no longer supported by the Python core team. Support for it is now deprecated in cryptography, and will be removed in the next release.
  from cryptography.hazmat.backends import default_backend
No container found for web_1
/usr/local/lib/python2.7/dist-packages/paramiko/transport.py:33: CryptographyDeprecationWarning: Python 2 is no longer supported by the Python core team. Support for it is now deprecated in cryptography, and will be removed in the next release.
  from cryptography.hazmat.backends import default_backend
Setting environment for exec is not supported in API < 1.25 (1.24)

=============================================================================
Shutdown
=============================================================================
/usr/local/lib/python2.7/dist-packages/paramiko/transport.py:33: CryptographyDeprecationWarning: Python 2 is no longer supported by the Python core team. Support for it is now deprecated in cryptography, and will be removed in the next release.
  from cryptography.hazmat.backends import default_backend
Stopping allura_solr_1  ... 
Stopping allura_mongo_1 ... 
Stopping allura_mongo_1 ... doneStopping allura_solr_1  ... doneRemoving allura_solr_1  ... 
Removing allura_mongo_1 ... 
Removing allura_mongo_1 ... doneRemoving allura_solr_1  ... doneRemoving network allura_default
Total reclaimed space: 0B
Deleted Volumes:
4a23909d8858b8d8ae0cb5e3c1887a73a90b95fc267be75744dc908b0d5853ec
90140afe8445df7064c57f0b93064717be0d89fe12f2137f39b36690b9af0191
330753ef0844dadcd456e3ad00f2d0e67d393c96cdc575761507bddd8aa96f30
db6893ab2a443ab25e5477598a2630e307a9eafe7ec8e56ebc824b5a63ef0890
27246149f5ae2cce1d0691054e6e53f8009fecfcbc1edf46f641a33004814602
003a4cd5af9d1127b9a08d783099ac06c85025f68a2928fa241446058ce55f3d
1cd2dd47097c4d4313cc2801aeb9d6f14f5357bb75119c54c802da89a00abd7a
536e90fe3391a3505314e7c811b3a837fd5bbda19de6d3ccf0354b0bf4b99d5a
8345fd35218c9ebb997520006fb1f60d60e310c26d1b2646ec8ce3df093a44a4
5d0bee0db8de3e216abba6c8fa6133a824e2e8537d38d2e714c375287d153b2b
74fb61389011b9cef09e8954cfc4ae323fb542078a2d68c4397326fd4e08e7b5
b30ca294e982360326c1e32119b92ec2a710366ae8f232a3107db3e0722f70e9
508f34239095e80ef432e43974399aa069da0c8da62c9247a2ef94390fb44e6e
6ac6fae3078d15d0fde38f62473f44496f4f8c4ddcd9dacd1fc5807f6e1b6a20
a61756aa6250f79959eb53439810b21107fd334749da1ff488a7936c04ac2f96
404f2067c819936a46cb807d675a8bd05290a98b65e188b97cc2dca8e98cd378
aa38120353795d1a529f53e7676f60147674221d06d12a2e2bb6a0965bfa1343
95bd0a2f84518379520c5b01632ea6f5aa46d2fb0eba09dafc0fb8e02a3fe579
7f74a5edd93a72dcf279d574f674efcede4dbd5312904d79105e7394d2002693
ae42ae372afe78b6ab207a11979fd48836318c548aa45d0dc71da5cf8cc0cad3
6b52f38d1f129b3eb75c480f778271cab4ff6f1905bfcc14463fb3dc63585045
28fedcf6bd03f5fcce668985f805f24fd032116d6826d44827f24ca33f084291
07ece4096b252a065cd8094e2168af167a519456575348ed5f9213c28bdee709
518c54c8ca395b47a007f66c2dc60ee2dfb51ec872d9e4e88fc7bb3a7f4d2b6b
d45ed4e3f9c73081df4effd3243ea52751da471f9620a3a372b230e954a741c5
6d8c41941fcc755980c4cf9b6c677c584d86c67d1d734ea0f493663efd96aba7
cc119fddca2e89dcbbe9ce43dd6f0395f783dd28fa36e596e5fea329da32d826
057ac2938fda02f2064f00ddb1c142b6a8fc1b4d99d2647c5754505ea24a2ff6
a0c1ae2a41fcb0b8d1c6ffdcb22b24b4194da82b842580974ba5aadd45b872fe
c2cc04b6ec6f16dc69de855a3828b41f3bf5ac29445819f44b2984562b8cd997
33eca9b9adc401381e8ee0b63d6484ca5a523dbd5617dc9b33c55265a9479009
c72f34b4dc4a5cf925251faabf6879ed5247a440dbccf606f9a3477b2fa76ba7
bd0965031d2515d4d0199d2d08cb91fb59c04410f49ee09eeffed65753ef6dfa

Total reclaimed space: 5.272GB
Build step 'Execute shell' marked build as failure
Recording test results
ERROR: Step ?Publish JUnit test result report? failed: No test report files were found. Configuration error?

Build failed in Jenkins: Allura » Allura-py3.7 #258

Posted by Apache Jenkins Server <je...@builds.apache.org>.
See <https://ci-builds.apache.org/job/Allura/job/Allura-py3.7/258/display/redirect>

Changes:


------------------------------------------
Started by user David Philip Brondsema
Running as SYSTEM
[EnvInject] - Loading node environment variables.
Building remotely on builds60 (ubuntu) in workspace <https://ci-builds.apache.org/job/Allura/job/Allura-py3.7/ws/>
[WS-CLEANUP] Deleting project workspace...
[WS-CLEANUP] Deferred wipeout is used...
[WS-CLEANUP] Done
The recommended git tool is: NONE
No credentials specified
Cloning the remote Git repository
Cloning repository https://gitbox.apache.org/repos/asf/allura.git/
 > git init <https://ci-builds.apache.org/job/Allura/job/Allura-py3.7/ws/> # timeout=10
Fetching upstream changes from https://gitbox.apache.org/repos/asf/allura.git/
 > git --version # timeout=10
 > git --version # 'git version 2.17.1'
 > git fetch --tags --progress -- https://gitbox.apache.org/repos/asf/allura.git/ +refs/heads/*:refs/remotes/origin/* # timeout=10
 > git config remote.origin.url https://gitbox.apache.org/repos/asf/allura.git/ # timeout=10
 > git config --add remote.origin.fetch +refs/heads/*:refs/remotes/origin/* # timeout=10
Avoid second fetch
 > git rev-parse refs/remotes/origin/master^{commit} # timeout=10
Checking out Revision 90b07ba2f6d010273068235f31185075d02fd317 (refs/remotes/origin/master)
 > git config core.sparsecheckout # timeout=10
 > git checkout -f 90b07ba2f6d010273068235f31185075d02fd317 # timeout=10
Commit message: "pillow downgrade 10.0.0 -> 9.5.0"
 > git rev-list --no-walk 90b07ba2f6d010273068235f31185075d02fd317 # timeout=10
[Allura-py3.7] $ /bin/bash /tmp/jenkins4856687153645778376.sh

=============================================================================
Jenkins Host Info:
=============================================================================
cpu count: 24
hostname: asf960
whoami: jenkins
NODE_NAME: builds60
docker: Client: Docker Engine - Community Version: 24.0.2 API version: 1.43 Go version: go1.20.4 Git commit: cb74dfc Built: Thu May 25 21:52:13 2023 OS/Arch: linux/amd64 Context: default Server: Docker Engine - Community Engine: Version: 24.0.2 API version: 1.43 (minimum version 1.12) Go version: go1.20.4 Git commit: 659604f Built: Thu May 25 21:52:13 2023 OS/Arch: linux/amd64 Experimental: false containerd: Version: 1.6.21 GitCommit: 3dce8eb055cbb6872793272b4f20ed16117344f8 runc: Version: 1.1.7 GitCommit: v1.1.7-0-g860f061 docker-init: Version: 0.19.0 GitCommit: de40ad0
/usr/local/lib/python2.7/dist-packages/paramiko/transport.py:33: CryptographyDeprecationWarning: Python 2 is no longer supported by the Python core team. Support for it is now deprecated in cryptography, and will be removed in the next release.
  from cryptography.hazmat.backends import default_backend
docker compose: docker-compose version 1.26.2, build unknown docker-py version: 4.4.4 CPython version: 2.7.17 OpenSSL version: OpenSSL 1.1.1 11 Sep 2018
path: /usr/local/sbin:/usr/local/bin:/usr/sbin:/usr/bin:/sbin:/bin:/snap/bin
workspace: <https://ci-builds.apache.org/job/Allura/job/Allura-py3.7/ws/>
jenkins_home: /home/jenkins/jenkins-home
home: /home/jenkins
pwd: <https://ci-builds.apache.org/job/Allura/job/Allura-py3.7/ws/>
GIT_COMMIT=90b07ba2f6d010273068235f31185075d02fd317
RUN_DISPLAY_URL=https://ci-builds.apache.org/job/Allura/job/Allura-py3.7/258/display/redirect
JENKINS_URL=https://ci-builds.apache.org/
EXECUTOR_NUMBER=2
SSH_CONNECTION=95.217.196.215 57114 67.195.81.180 22
LANG=en_US
BUILD_ID=258
BUILD_CAUSE=MANUALTRIGGER
OLDPWD=/home/jenkins
RUN_CHANGES_DISPLAY_URL=https://ci-builds.apache.org/job/Allura/job/Allura-py3.7/258/display/redirect?page=changes
GRADLE_ENTERPRISE_ACCESS_KEY=ge.apache.org=etlwjhwel56ybdijfxymbj5bb6fwydcy3sj2oe6rlwjzotgalrea
JENKINSGRADLEPLUGIN_GRADLE_ENTERPRISE_PLUGIN_VERSION=3.13.1
JOB_BASE_NAME=Allura-py3.7
WORKSPACE_TMP=<ht...@tmp>
BUILD_TIMESTAMP=2023-08-14 17:22:51 UTC
CI=true
GIT_URL=https://gitbox.apache.org/repos/asf/allura.git/
HUDSON_COOKIE=2de2b422-5931-4e6b-97c7-350927baef88
XDG_SESSION_ID=1081
USER=jenkins
BUILD_NUMBER=258
WORKSPACE=<https://ci-builds.apache.org/job/Allura/job/Allura-py3.7/ws/>
PWD=<https://ci-builds.apache.org/job/Allura/job/Allura-py3.7/ws/>
HUDSON_URL=https://ci-builds.apache.org/
HOME=/home/jenkins
JENKINSGRADLEPLUGIN_CCUD_PLUGIN_VERSION=1.10
NODE_NAME=builds60
HUDSON_SERVER_COOKIE=9c7f00b5d9bf9427
SSH_CLIENT=95.217.196.215 57114 22
JENKINS_HOME=/home/jenkins/jenkins-home
JOB_NAME=Allura/Allura-py3.7
RUN_TESTS_DISPLAY_URL=https://ci-builds.apache.org/job/Allura/job/Allura-py3.7/258/display/redirect?page=tests
GIT_PREVIOUS_COMMIT=90b07ba2f6d010273068235f31185075d02fd317
HUDSON_HOME=/home/jenkins/jenkins-home
JOB_DISPLAY_URL=https://ci-builds.apache.org/job/Allura/job/Allura-py3.7/display/redirect
JENKINSGRADLEPLUGIN_GRADLE_ENTERPRISE_ENFORCE_URL=true
JENKINSGRADLEPLUGIN_GRADLE_AUTO_INJECTION=true
RUN_ARTIFACTS_DISPLAY_URL=https://ci-builds.apache.org/job/Allura/job/Allura-py3.7/258/display/redirect?page=artifacts
MAIL=/var/mail/jenkins
BUILD_URL=https://ci-builds.apache.org/job/Allura/job/Allura-py3.7/258/
SHELL=/bin/bash
JOB_URL=https://ci-builds.apache.org/job/Allura/job/Allura-py3.7/
BUILD_DISPLAY_NAME=#258
PY_VERSION=3.7
ROOT_BUILD_CAUSE=MANUALTRIGGER
SHLVL=3
GIT_BRANCH=origin/master
JENKINSGRADLEPLUGIN_GRADLE_ENTERPRISE_URL=https://ge.apache.org
ROOT_BUILD_CAUSE_MANUALTRIGGER=true
BUILD_TAG=jenkins-Allura-Allura-py3.7-258
JENKINSGRADLEPLUGIN_GRADLE_ENTERPRISE_GRADLE_INJECTION_ENABLED=false
NODE_LABELS=builds60 ubuntu
LOGNAME=jenkins
DBUS_SESSION_BUS_ADDRESS=unix:path=/run/user/910/bus
XDG_RUNTIME_DIR=/run/user/910
PATH=/usr/local/sbin:/usr/local/bin:/usr/sbin:/usr/bin:/sbin:/bin:/snap/bin
BUILD_CAUSE_MANUALTRIGGER=true
GIT_PREVIOUS_SUCCESSFUL_COMMIT=61ee60cac206a2ef7e705c1e4496cc6a43fd91a1
JENKINS_SERVER_COOKIE=9c7f00b5d9bf9427
_=/usr/bin/env

=============================================================================
Run: cleanup previous runs
=============================================================================
/usr/local/lib/python2.7/dist-packages/paramiko/transport.py:33: CryptographyDeprecationWarning: Python 2 is no longer supported by the Python core team. Support for it is now deprecated in cryptography, and will be removed in the next release.
  from cryptography.hazmat.backends import default_backend
Removing network allura_default
Network allura_default not found.

=============================================================================
Run: build docker image
=============================================================================
/usr/local/lib/python2.7/dist-packages/paramiko/transport.py:33: CryptographyDeprecationWarning: Python 2 is no longer supported by the Python core team. Support for it is now deprecated in cryptography, and will be removed in the next release.
  from cryptography.hazmat.backends import default_backend
--build-arg is only supported when services are specified for API version < 1.25. Please use a Compose file version > 2.2 or specify which services to build.

=============================================================================
Setup: venv, pip, pysvn, ./rebuild-all.sh, npm, etc.
=============================================================================
/usr/local/lib/python2.7/dist-packages/paramiko/transport.py:33: CryptographyDeprecationWarning: Python 2 is no longer supported by the Python core team. Support for it is now deprecated in cryptography, and will be removed in the next release.
  from cryptography.hazmat.backends import default_backend
Creating network "allura_default" with the default driver
Creating allura_mongo_1 ... 
Creating allura_solr_1  ... 
Creating allura_solr_1  ... doneCreating allura_mongo_1 ... doneBuilding web
Traceback (most recent call last):
  File "/usr/local/bin/docker-compose", line 8, in <module>
    sys.exit(main())
  File "/usr/local/lib/python2.7/dist-packages/compose/cli/main.py", line 72, in main
    command()
  File "/usr/local/lib/python2.7/dist-packages/compose/cli/main.py", line 128, in perform_command
    handler(command, command_options)
  File "/usr/local/lib/python2.7/dist-packages/compose/cli/main.py", line 866, in run
    self.toplevel_options, self.toplevel_environment
  File "/usr/local/lib/python2.7/dist-packages/compose/cli/main.py", line 1327, in run_one_off_container
    **container_options)
  File "/usr/local/lib/python2.7/dist-packages/compose/service.py", line 331, in create_container
    self.ensure_image_exists()
  File "/usr/local/lib/python2.7/dist-packages/compose/service.py", line 367, in ensure_image_exists
    self.build(cli=cli)
  File "/usr/local/lib/python2.7/dist-packages/compose/service.py", line 1106, in build
    platform=self.platform,
  File "/usr/local/lib/python2.7/dist-packages/docker/api/build.py", line 160, in build
    path, exclude=exclude, dockerfile=dockerfile, gzip=gzip
  File "/usr/local/lib/python2.7/dist-packages/docker/utils/build.py", line 30, in tar
    files=sorted(exclude_paths(root, exclude, dockerfile=dockerfile[0])),
  File "/usr/local/lib/python2.7/dist-packages/docker/utils/build.py", line 49, in exclude_paths
    return set(pm.walk(root))
  File "/usr/local/lib/python2.7/dist-packages/docker/utils/build.py", line 215, in rec_walk
    for sub in rec_walk(cur):
  File "/usr/local/lib/python2.7/dist-packages/docker/utils/build.py", line 215, in rec_walk
    for sub in rec_walk(cur):
  File "/usr/local/lib/python2.7/dist-packages/docker/utils/build.py", line 215, in rec_walk
    for sub in rec_walk(cur):
  File "/usr/local/lib/python2.7/dist-packages/docker/utils/build.py", line 185, in rec_walk
    for f in os.listdir(current_dir):
OSError: [Errno 13] Permission denied: '<https://ci-builds.apache.org/job/Allura/job/Allura-py3.7/ws/allura-data/mongo/journal'>

=============================================================================
Starting up docker containers
=============================================================================
/usr/local/lib/python2.7/dist-packages/paramiko/transport.py:33: CryptographyDeprecationWarning: Python 2 is no longer supported by the Python core team. Support for it is now deprecated in cryptography, and will be removed in the next release.
  from cryptography.hazmat.backends import default_backend
Building web
Traceback (most recent call last):
  File "/usr/local/bin/docker-compose", line 8, in <module>
    sys.exit(main())
  File "/usr/local/lib/python2.7/dist-packages/compose/cli/main.py", line 72, in main
    command()
  File "/usr/local/lib/python2.7/dist-packages/compose/cli/main.py", line 128, in perform_command
    handler(command, command_options)
  File "/usr/local/lib/python2.7/dist-packages/compose/cli/main.py", line 1078, in up
    to_attach = up(False)
  File "/usr/local/lib/python2.7/dist-packages/compose/cli/main.py", line 1074, in up
    cli=native_builder,
  File "/usr/local/lib/python2.7/dist-packages/compose/project.py", line 548, in up
    svc.ensure_image_exists(do_build=do_build, silent=silent, cli=cli)
  File "/usr/local/lib/python2.7/dist-packages/compose/service.py", line 367, in ensure_image_exists
    self.build(cli=cli)
  File "/usr/local/lib/python2.7/dist-packages/compose/service.py", line 1106, in build
    platform=self.platform,
  File "/usr/local/lib/python2.7/dist-packages/docker/api/build.py", line 160, in build
    path, exclude=exclude, dockerfile=dockerfile, gzip=gzip
  File "/usr/local/lib/python2.7/dist-packages/docker/utils/build.py", line 30, in tar
    files=sorted(exclude_paths(root, exclude, dockerfile=dockerfile[0])),
  File "/usr/local/lib/python2.7/dist-packages/docker/utils/build.py", line 49, in exclude_paths
    return set(pm.walk(root))
  File "/usr/local/lib/python2.7/dist-packages/docker/utils/build.py", line 215, in rec_walk
    for sub in rec_walk(cur):
  File "/usr/local/lib/python2.7/dist-packages/docker/utils/build.py", line 215, in rec_walk
    for sub in rec_walk(cur):
  File "/usr/local/lib/python2.7/dist-packages/docker/utils/build.py", line 215, in rec_walk
    for sub in rec_walk(cur):
  File "/usr/local/lib/python2.7/dist-packages/docker/utils/build.py", line 185, in rec_walk
    for f in os.listdir(current_dir):
OSError: [Errno 13] Permission denied: '<https://ci-builds.apache.org/job/Allura/job/Allura-py3.7/ws/allura-data/mongo/journal'>

=============================================================================
Docker Container Info:
=============================================================================
/usr/local/lib/python2.7/dist-packages/paramiko/transport.py:33: CryptographyDeprecationWarning: Python 2 is no longer supported by the Python core team. Support for it is now deprecated in cryptography, and will be removed in the next release.
  from cryptography.hazmat.backends import default_backend
No container found for web_1

=============================================================================
Setup: tests
=============================================================================
/usr/local/lib/python2.7/dist-packages/paramiko/transport.py:33: CryptographyDeprecationWarning: Python 2 is no longer supported by the Python core team. Support for it is now deprecated in cryptography, and will be removed in the next release.
  from cryptography.hazmat.backends import default_backend
No container found for web_1
/usr/local/lib/python2.7/dist-packages/paramiko/transport.py:33: CryptographyDeprecationWarning: Python 2 is no longer supported by the Python core team. Support for it is now deprecated in cryptography, and will be removed in the next release.
  from cryptography.hazmat.backends import default_backend
No container found for web_1

=============================================================================
Run: tests
=============================================================================
/usr/local/lib/python2.7/dist-packages/paramiko/transport.py:33: CryptographyDeprecationWarning: Python 2 is no longer supported by the Python core team. Support for it is now deprecated in cryptography, and will be removed in the next release.
  from cryptography.hazmat.backends import default_backend
No container found for web_1
/usr/local/lib/python2.7/dist-packages/paramiko/transport.py:33: CryptographyDeprecationWarning: Python 2 is no longer supported by the Python core team. Support for it is now deprecated in cryptography, and will be removed in the next release.
  from cryptography.hazmat.backends import default_backend
No container found for web_1
/usr/local/lib/python2.7/dist-packages/paramiko/transport.py:33: CryptographyDeprecationWarning: Python 2 is no longer supported by the Python core team. Support for it is now deprecated in cryptography, and will be removed in the next release.
  from cryptography.hazmat.backends import default_backend
Setting environment for exec is not supported in API < 1.25 (1.24)

=============================================================================
Shutdown
=============================================================================
/usr/local/lib/python2.7/dist-packages/paramiko/transport.py:33: CryptographyDeprecationWarning: Python 2 is no longer supported by the Python core team. Support for it is now deprecated in cryptography, and will be removed in the next release.
  from cryptography.hazmat.backends import default_backend
Stopping allura_solr_1  ... 
Stopping allura_mongo_1 ... 
Stopping allura_mongo_1 ... doneStopping allura_solr_1  ... doneRemoving allura_solr_1  ... 
Removing allura_mongo_1 ... 
Removing allura_solr_1  ... doneRemoving allura_mongo_1 ... doneRemoving network allura_default
Total reclaimed space: 0B
Deleted Volumes:
812455041cf0dac3cafc3e34c09db5bb8cb35ade687c1fd404d86a740e51ab13

Total reclaimed space: 0B
Build step 'Execute shell' marked build as failure
Recording test results
ERROR: Step ?Publish JUnit test result report? failed: No test report files were found. Configuration error?

Build failed in Jenkins: Allura » Allura-py3.7 #257

Posted by Apache Jenkins Server <je...@builds.apache.org>.
See <https://ci-builds.apache.org/job/Allura/job/Allura-py3.7/257/display/redirect?page=changes>

Changes:

[Guillermo Cruz] pillow downgrade 10.0.0 -> 9.5.0


------------------------------------------
[...truncated 3.83 KB...]
RUN_CHANGES_DISPLAY_URL=https://ci-builds.apache.org/job/Allura/job/Allura-py3.7/257/display/redirect?page=changes
GRADLE_ENTERPRISE_ACCESS_KEY=ge.apache.org=etlwjhwel56ybdijfxymbj5bb6fwydcy3sj2oe6rlwjzotgalrea
JENKINSGRADLEPLUGIN_GRADLE_ENTERPRISE_PLUGIN_VERSION=3.13.1
JOB_BASE_NAME=Allura-py3.7
WORKSPACE_TMP=<ht...@tmp>
BUILD_TIMESTAMP=2023-08-14 17:19:09 UTC
CI=true
GIT_URL=https://gitbox.apache.org/repos/asf/allura.git/
HUDSON_COOKIE=2ab939a4-4ecd-40a2-b80d-7caf8494c8e8
XDG_SESSION_ID=1081
USER=jenkins
BUILD_NUMBER=257
WORKSPACE=<https://ci-builds.apache.org/job/Allura/job/Allura-py3.7/ws/>
PWD=<https://ci-builds.apache.org/job/Allura/job/Allura-py3.7/ws/>
HUDSON_URL=https://ci-builds.apache.org/
HOME=/home/jenkins
JENKINSGRADLEPLUGIN_CCUD_PLUGIN_VERSION=1.10
NODE_NAME=builds60
HUDSON_SERVER_COOKIE=9c7f00b5d9bf9427
SSH_CLIENT=95.217.196.215 57114 22
JENKINS_HOME=/home/jenkins/jenkins-home
JOB_NAME=Allura/Allura-py3.7
RUN_TESTS_DISPLAY_URL=https://ci-builds.apache.org/job/Allura/job/Allura-py3.7/257/display/redirect?page=tests
GIT_PREVIOUS_COMMIT=dff1ab371ba70b3a2f33d55b04cf93aec8c0373b
ROOT_BUILD_CAUSE_SCMTRIGGER=true
BUILD_CAUSE_SCMTRIGGER=true
HUDSON_HOME=/home/jenkins/jenkins-home
JOB_DISPLAY_URL=https://ci-builds.apache.org/job/Allura/job/Allura-py3.7/display/redirect
JENKINSGRADLEPLUGIN_GRADLE_ENTERPRISE_ENFORCE_URL=true
JENKINSGRADLEPLUGIN_GRADLE_AUTO_INJECTION=true
RUN_ARTIFACTS_DISPLAY_URL=https://ci-builds.apache.org/job/Allura/job/Allura-py3.7/257/display/redirect?page=artifacts
MAIL=/var/mail/jenkins
BUILD_URL=https://ci-builds.apache.org/job/Allura/job/Allura-py3.7/257/
SHELL=/bin/bash
JOB_URL=https://ci-builds.apache.org/job/Allura/job/Allura-py3.7/
BUILD_DISPLAY_NAME=#257
PY_VERSION=3.7
ROOT_BUILD_CAUSE=SCMTRIGGER
SHLVL=3
GIT_BRANCH=origin/master
JENKINSGRADLEPLUGIN_GRADLE_ENTERPRISE_URL=https://ge.apache.org
BUILD_TAG=jenkins-Allura-Allura-py3.7-257
JENKINSGRADLEPLUGIN_GRADLE_ENTERPRISE_GRADLE_INJECTION_ENABLED=false
NODE_LABELS=builds60 ubuntu
LOGNAME=jenkins
DBUS_SESSION_BUS_ADDRESS=unix:path=/run/user/910/bus
XDG_RUNTIME_DIR=/run/user/910
PATH=/usr/local/sbin:/usr/local/bin:/usr/sbin:/usr/bin:/sbin:/bin:/snap/bin
GIT_PREVIOUS_SUCCESSFUL_COMMIT=61ee60cac206a2ef7e705c1e4496cc6a43fd91a1
JENKINS_SERVER_COOKIE=9c7f00b5d9bf9427
_=/usr/bin/env

=============================================================================
Run: cleanup previous runs
=============================================================================
/usr/local/lib/python2.7/dist-packages/paramiko/transport.py:33: CryptographyDeprecationWarning: Python 2 is no longer supported by the Python core team. Support for it is now deprecated in cryptography, and will be removed in the next release.
  from cryptography.hazmat.backends import default_backend
Removing network allura_default
Network allura_default not found.

=============================================================================
Run: build docker image
=============================================================================
/usr/local/lib/python2.7/dist-packages/paramiko/transport.py:33: CryptographyDeprecationWarning: Python 2 is no longer supported by the Python core team. Support for it is now deprecated in cryptography, and will be removed in the next release.
  from cryptography.hazmat.backends import default_backend
--build-arg is only supported when services are specified for API version < 1.25. Please use a Compose file version > 2.2 or specify which services to build.

=============================================================================
Setup: venv, pip, pysvn, ./rebuild-all.sh, npm, etc.
=============================================================================
/usr/local/lib/python2.7/dist-packages/paramiko/transport.py:33: CryptographyDeprecationWarning: Python 2 is no longer supported by the Python core team. Support for it is now deprecated in cryptography, and will be removed in the next release.
  from cryptography.hazmat.backends import default_backend
Creating network "allura_default" with the default driver
Pulling mongo (mongo:4.2)...
4.2: Pulling from library/mongo
Digest: sha256:699d652ed67423d689258bad7b316cf005dfbb82b334118ec306f049042f3717
Status: Downloaded newer image for mongo:4.2
Pulling solr (solr:6-alpine)...
6-alpine: Pulling from library/solr
Digest: sha256:4f63093698313437a49b2f945c4b1545c9e3a655f52581bc6e01ea006fae132e
Status: Downloaded newer image for solr:6-alpine
Creating allura_mongo_1 ... 
Creating allura_solr_1  ... 
Creating allura_mongo_1 ... doneCreating allura_solr_1  ... doneBuilding web
Traceback (most recent call last):
  File "/usr/local/bin/docker-compose", line 8, in <module>
    sys.exit(main())
  File "/usr/local/lib/python2.7/dist-packages/compose/cli/main.py", line 72, in main
    command()
  File "/usr/local/lib/python2.7/dist-packages/compose/cli/main.py", line 128, in perform_command
    handler(command, command_options)
  File "/usr/local/lib/python2.7/dist-packages/compose/cli/main.py", line 866, in run
    self.toplevel_options, self.toplevel_environment
  File "/usr/local/lib/python2.7/dist-packages/compose/cli/main.py", line 1327, in run_one_off_container
    **container_options)
  File "/usr/local/lib/python2.7/dist-packages/compose/service.py", line 331, in create_container
    self.ensure_image_exists()
  File "/usr/local/lib/python2.7/dist-packages/compose/service.py", line 367, in ensure_image_exists
    self.build(cli=cli)
  File "/usr/local/lib/python2.7/dist-packages/compose/service.py", line 1106, in build
    platform=self.platform,
  File "/usr/local/lib/python2.7/dist-packages/docker/api/build.py", line 160, in build
    path, exclude=exclude, dockerfile=dockerfile, gzip=gzip
  File "/usr/local/lib/python2.7/dist-packages/docker/utils/build.py", line 30, in tar
    files=sorted(exclude_paths(root, exclude, dockerfile=dockerfile[0])),
  File "/usr/local/lib/python2.7/dist-packages/docker/utils/build.py", line 49, in exclude_paths
    return set(pm.walk(root))
  File "/usr/local/lib/python2.7/dist-packages/docker/utils/build.py", line 215, in rec_walk
    for sub in rec_walk(cur):
  File "/usr/local/lib/python2.7/dist-packages/docker/utils/build.py", line 215, in rec_walk
    for sub in rec_walk(cur):
  File "/usr/local/lib/python2.7/dist-packages/docker/utils/build.py", line 215, in rec_walk
    for sub in rec_walk(cur):
  File "/usr/local/lib/python2.7/dist-packages/docker/utils/build.py", line 185, in rec_walk
    for f in os.listdir(current_dir):
OSError: [Errno 13] Permission denied: '<https://ci-builds.apache.org/job/Allura/job/Allura-py3.7/ws/allura-data/mongo/journal'>

=============================================================================
Starting up docker containers
=============================================================================
/usr/local/lib/python2.7/dist-packages/paramiko/transport.py:33: CryptographyDeprecationWarning: Python 2 is no longer supported by the Python core team. Support for it is now deprecated in cryptography, and will be removed in the next release.
  from cryptography.hazmat.backends import default_backend
Building web
Traceback (most recent call last):
  File "/usr/local/bin/docker-compose", line 8, in <module>
    sys.exit(main())
  File "/usr/local/lib/python2.7/dist-packages/compose/cli/main.py", line 72, in main
    command()
  File "/usr/local/lib/python2.7/dist-packages/compose/cli/main.py", line 128, in perform_command
    handler(command, command_options)
  File "/usr/local/lib/python2.7/dist-packages/compose/cli/main.py", line 1078, in up
    to_attach = up(False)
  File "/usr/local/lib/python2.7/dist-packages/compose/cli/main.py", line 1074, in up
    cli=native_builder,
  File "/usr/local/lib/python2.7/dist-packages/compose/project.py", line 548, in up
    svc.ensure_image_exists(do_build=do_build, silent=silent, cli=cli)
  File "/usr/local/lib/python2.7/dist-packages/compose/service.py", line 367, in ensure_image_exists
    self.build(cli=cli)
  File "/usr/local/lib/python2.7/dist-packages/compose/service.py", line 1106, in build
    platform=self.platform,
  File "/usr/local/lib/python2.7/dist-packages/docker/api/build.py", line 160, in build
    path, exclude=exclude, dockerfile=dockerfile, gzip=gzip
  File "/usr/local/lib/python2.7/dist-packages/docker/utils/build.py", line 30, in tar
    files=sorted(exclude_paths(root, exclude, dockerfile=dockerfile[0])),
  File "/usr/local/lib/python2.7/dist-packages/docker/utils/build.py", line 49, in exclude_paths
    return set(pm.walk(root))
  File "/usr/local/lib/python2.7/dist-packages/docker/utils/build.py", line 215, in rec_walk
    for sub in rec_walk(cur):
  File "/usr/local/lib/python2.7/dist-packages/docker/utils/build.py", line 215, in rec_walk
    for sub in rec_walk(cur):
  File "/usr/local/lib/python2.7/dist-packages/docker/utils/build.py", line 215, in rec_walk
    for sub in rec_walk(cur):
  File "/usr/local/lib/python2.7/dist-packages/docker/utils/build.py", line 185, in rec_walk
    for f in os.listdir(current_dir):
OSError: [Errno 13] Permission denied: '<https://ci-builds.apache.org/job/Allura/job/Allura-py3.7/ws/allura-data/mongo/journal'>

=============================================================================
Docker Container Info:
=============================================================================
/usr/local/lib/python2.7/dist-packages/paramiko/transport.py:33: CryptographyDeprecationWarning: Python 2 is no longer supported by the Python core team. Support for it is now deprecated in cryptography, and will be removed in the next release.
  from cryptography.hazmat.backends import default_backend
No container found for web_1

=============================================================================
Setup: tests
=============================================================================
/usr/local/lib/python2.7/dist-packages/paramiko/transport.py:33: CryptographyDeprecationWarning: Python 2 is no longer supported by the Python core team. Support for it is now deprecated in cryptography, and will be removed in the next release.
  from cryptography.hazmat.backends import default_backend
No container found for web_1
/usr/local/lib/python2.7/dist-packages/paramiko/transport.py:33: CryptographyDeprecationWarning: Python 2 is no longer supported by the Python core team. Support for it is now deprecated in cryptography, and will be removed in the next release.
  from cryptography.hazmat.backends import default_backend
No container found for web_1

=============================================================================
Run: tests
=============================================================================
/usr/local/lib/python2.7/dist-packages/paramiko/transport.py:33: CryptographyDeprecationWarning: Python 2 is no longer supported by the Python core team. Support for it is now deprecated in cryptography, and will be removed in the next release.
  from cryptography.hazmat.backends import default_backend
No container found for web_1
/usr/local/lib/python2.7/dist-packages/paramiko/transport.py:33: CryptographyDeprecationWarning: Python 2 is no longer supported by the Python core team. Support for it is now deprecated in cryptography, and will be removed in the next release.
  from cryptography.hazmat.backends import default_backend
No container found for web_1
/usr/local/lib/python2.7/dist-packages/paramiko/transport.py:33: CryptographyDeprecationWarning: Python 2 is no longer supported by the Python core team. Support for it is now deprecated in cryptography, and will be removed in the next release.
  from cryptography.hazmat.backends import default_backend
Setting environment for exec is not supported in API < 1.25 (1.24)

=============================================================================
Shutdown
=============================================================================
/usr/local/lib/python2.7/dist-packages/paramiko/transport.py:33: CryptographyDeprecationWarning: Python 2 is no longer supported by the Python core team. Support for it is now deprecated in cryptography, and will be removed in the next release.
  from cryptography.hazmat.backends import default_backend
Stopping allura_mongo_1 ... 
Stopping allura_solr_1  ... 
Stopping allura_mongo_1 ... doneStopping allura_solr_1  ... doneRemoving allura_mongo_1 ... 
Removing allura_solr_1  ... 
Removing allura_solr_1  ... doneRemoving allura_mongo_1 ... doneRemoving network allura_default
Total reclaimed space: 0B
Deleted Volumes:
86e6b81850bf6ef30361b3825e5b807653620e8ec72384af7a2ecf4839b63856
d57bb4a35dbe54c02d486370c98171cf2f440cf8e6db58f9eac14e93d2d30628
dfeebb9bb571c28eb357cb5818b927e35011d8c7c57bdd67c939a494a115a174
f3d4c1039a642a1af21690516e007815ed00e7638c0b8c0ac2a4ac7909519d86
c237e5892b94ea24ce6b5d511dc6a0aa85659c1651b395d963451142aa1b9b1d
8c8893e1f265dddfd4d76d387ced7094ade84a7e8e9069b347602080ac59082a
f3de5c458cbc843b6db3a17b3bec17f25cbe441e6240837b96be8f9c26117360
860594a3ae27bc9252ee4ba6399f62e8ae70b896e6a62f0bea57f048e9fc48dc
82bd84431a9e2d74a78022ecdf1bc38353a9a76f451035f38b54c985829ee98c
b1971fd02208c689a4ab4fa8794bd29423de06a3d83afb46a7c626ab694fd32f
4f1c9ee711885d773adc487a1783b1818144c90218f83b530c400f501320a19f
0fe6ee423b1704da39a7a6ae5c3aa272f9977f52e2a2ac07f02863c0db139175
680d424d7529bc91e27e1a3be4a77ee426e38f26acbdac35e918409a404d34a9
b494e020e2e2cbc87387e3998cf749224da5ddef7371654aefd98a270245bf29
179d49d0f2b9f7c60e2d172d336649c008411bb5e9833b2d6b5b133eca0473c7
9c16f3bbc30128f4fb8efc8c2326ddc78cee277c0148c859be32014ee4b6e504
b42e7dfe8fc7d4f1975176157f2a9c7f5bb8200c2ed5f0d148d4ccc4b2904815
72164547f640e9560685fff55d3bc7c394e3976795caa45e45f6df71aee5954d
7fa52b59a3487b3eacde154747d1ea53f4ffdd005c5d797ea09a8e0e5927d7c4
03e360548080a52d4fed4b75e0384ce6fc8d36ffd1a60fd1da76ca64a5e05e7e
4875ead96f8af645991a9c750f0aae3313e0fb00f51e59e574edca9df48ea4cb
1ef276d23c2322c21aa079130613bb80f9ea4ab694b7810f3a4093758ecb22ec
57077a09ce65bc80c67f4dd1bd07084dc3a0ad271dd4cb1cc9fc5149419f03b8
9dcc9e3005cd30379449c8767c8417d07901dcb22f4f1ff940c1b9e7da6eddbd
a6da006463812af290ca1bbea962a8d6f0583f5f152f1b33e394d20d1c86a35d
38d5eea7a398dd332be051bccff8660905df459edfae8b89bef5bf1cb2f342db
dcbac76148fd7104b4e519bd882650d63fe13060ea01d3179ae41a022a8853cb
4e290bedbf2c06cac3989440f881929c7524a22497ac8ff2fee58e315ee2d5b0
ccf2b604e663158a54f54e30bdd36a34b04558cef3dcd6f253918fe101ce5b86
69e41de27058b947af972af4dee7d52c9c4c0118b4117fb0f22e88728880c0a3
8e3b5ce743fe4f6d1e2c01552217d5c7518e0be7de3305e1a2298a1205d59af7
7f6c2a2cc6be582341bc4c6794c3703469b79fc160d807fb544bb049aa6dbc98
34f9ab67081ca7513277ae21d782e8e8d9cc6685b4e2314126a180f4d8a0d439
ea741cf73f56c8c5501368c4420a3d6ad036cb64904d17de820b7c3085cbd089
a86beee5ba8361cac9f79f28a67e3814b4c35de47fdf15961bdd9607ed1c7af0
24c2bfd5dc16a7de00c75b0b5b98a8d9f50edad69c0dd6bb73b603ebd6cf7053
8366a10a8d8ab70b60acbd25551c312e899362b84a4f4747aa38a6650b0ca732
5841b69f927ab52d46c80ce98338ff60fe5128f228b06a71845bf2040d7020fa
74bb6f8c508037f54c1aeb2e72c83ede9f6223ab614214e0bbae0a5324cf90bf
c918ba5dc0809c9286d87bea4fa154552ba6a5cee8f50dd9c75f453345a77e7f
a2935135f697340d6a25d3712efbb690757d18f1c609d23f447dec601e4791e9
88edf6a1ff75afe66275ece70e988e00a5e2a9f1e9551eba365a76047af758f3
266bf870e8e74166a8a65e29bbab9dd134db9c0ef575a445d85c9477ee18f266
e1fe74c631bf3c97c18b2ab413dbf0bbf9f7842953437a9543daccc4df6eb734
7a68bf4e01a3d66e08db0921c92dc8f845fe9604ceff230d0bed0f7a1e3f81d4
ae0d803132aab40ca810e2755e8e75f6400f1a3863bb789ddfade91c0f9fab83

Total reclaimed space: 7.298GB
Build step 'Execute shell' marked build as failure
Recording test results
ERROR: Step ?Publish JUnit test result report? failed: No test report files were found. Configuration error?

Build failed in Jenkins: Allura » Allura-py3.7 #256

Posted by Apache Jenkins Server <je...@builds.apache.org>.
See <https://ci-builds.apache.org/job/Allura/job/Allura-py3.7/256/display/redirect?page=changes>

Changes:

[dbrondsema] fix error on feed url for non-existant ticket


------------------------------------------
[...truncated 150.00 KB...]
#6 67.68 Setting up libaprutil1-ldap:amd64 (1.6.1-2ubuntu0.1) ...
#6 67.83 Setting up libcurl3-gnutls:amd64 (7.58.0-2ubuntu3.24) ...
#6 67.96 Setting up libcurl4:amd64 (7.58.0-2ubuntu3.24) ...
#6 68.08 Setting up apache2-bin (2.4.29-1ubuntu4.27) ...
#6 68.21 Setting up git (1:2.17.1-1ubuntu0.18) ...
#6 68.42 Setting up apache2 (2.4.29-1ubuntu4.27) ...
#6 75.85 Enabling module mpm_event.
#6 75.93 Enabling module authz_core.
#6 75.94 Enabling module authz_host.
#6 76.01 Enabling module authn_core.
#6 76.02 Enabling module auth_basic.
#6 76.09 Enabling module access_compat.
#6 76.16 Enabling module authn_file.
#6 76.23 Enabling module authz_user.
#6 76.30 Enabling module alias.
#6 76.37 Enabling module dir.
#6 76.44 Enabling module autoindex.
#6 76.51 Enabling module env.
#6 76.58 Enabling module mime.
#6 76.65 Enabling module negotiation.
#6 76.71 Enabling module setenvif.
#6 76.78 Enabling module filter.
#6 76.84 Enabling module deflate.
#6 76.91 Enabling module status.
#6 76.98 Enabling module reqtimeout.
#6 77.05 Enabling conf charset.
#6 77.12 Enabling conf localized-error-pages.
#6 77.19 Enabling conf other-vhosts-access-log.
#6 77.26 Enabling conf security.
#6 77.33 Enabling conf serve-cgi-bin.
#6 77.40 Enabling site 000-default.
#6 77.95 invoke-rc.d: could not determine current runlevel
#6 77.95 invoke-rc.d: policy-rc.d denied execution of start.
#6 78.21 Setting up curl (7.58.0-2ubuntu3.24) ...
#6 78.36 Setting up libapache2-mod-python (3.3.1-11ubuntu2) ...
#6 78.72 apache2_invoke: Enable module python
#6 78.81 invoke-rc.d: could not determine current runlevel
#6 78.82 invoke-rc.d: policy-rc.d denied execution of restart.
#6 79.82 Processing triggers for libc-bin (2.27-3ubuntu1.6) ...
#6 79.95 Processing triggers for ca-certificates (20230311ubuntu0.18.04.1) ...
#6 80.00 Updating certificates in /etc/ssl/certs...
#6 81.12 0 added, 0 removed; done.
#6 81.12 Running hooks in /etc/ca-certificates/update.d...
#6 81.12 done.
#6 DONE 81.9s

#7 [ 3/10] RUN a2enmod cgi proxy proxy_http
#7 1.285 Your MPM seems to be threaded. Selecting cgid instead of cgi.
#7 1.285 Enabling module cgid.
#7 1.296 Enabling module proxy.
#7 1.307 Considering dependency proxy for proxy_http:
#7 1.307 Module proxy already enabled
#7 1.307 Enabling module proxy_http.
#7 1.316 To activate the new configuration, you need to run:
#7 1.316   service apache2 restart
#7 DONE 1.9s

#8 [ 4/10] ADD ./git-http.conf /etc/apache2/sites-available/
#8 DONE 1.0s

#9 [ 5/10] RUN a2dissite 000-default.conf
#9 1.046 Site 000-default disabled.
#9 1.046 To activate the new configuration, you need to run:
#9 1.046   service apache2 reload
#9 DONE 1.7s

#10 [ 6/10] RUN a2ensite git-http.conf
#10 1.174 Enabling site git-http.
#10 1.184 To activate the new configuration, you need to run:
#10 1.184   service apache2 reload
#10 DONE 1.9s

#11 [ 7/10] RUN apachectl configtest
#11 1.198 AH00558: apache2: Could not reliably determine the server's fully qualified domain name, using 127.0.0.1. Set the 'ServerName' directive globally to suppress this message
#11 1.198 Syntax OK
#11 DONE 1.8s

#12 [ 8/10] ADD git-http-backend-wrapper.sh /usr/lib/git-core
#12 DONE 1.0s

#13 [ 9/10] RUN adduser www-data sudo
#13 1.115 Adding user `www-data' to group `sudo' ...
#13 1.119 Adding user www-data to group sudo
#13 1.324 Done.
#13 DONE 2.1s

#14 [10/10] RUN echo '%sudo  ALL=(ALL) NOPASSWD:ALL' > /etc/sudoers.d/sudo_group_passwordless
#14 DONE 1.8s

#15 exporting to image
#15 exporting layers
#15 exporting layers 4.7s done
#15 writing image sha256:6167d4f18478eec78908b21f518d73edc1ec619b75373286c5934b3ee4096138 0.0s done
#15 naming to docker.io/library/allura_http 0.1s done
#15 DONE 4.8s

=============================================================================
Setup: venv, pip, pysvn, ./rebuild-all.sh, npm, etc.
=============================================================================
Creating network "allura_default" with the default driver
Pulling solr (solr:6-alpine)...
6-alpine: Pulling from library/solr
Digest: sha256:4f63093698313437a49b2f945c4b1545c9e3a655f52581bc6e01ea006fae132e
Status: Downloaded newer image for solr:6-alpine
Pulling mongo (mongo:4.2)...
4.2: Pulling from library/mongo
Digest: sha256:699d652ed67423d689258bad7b316cf005dfbb82b334118ec306f049042f3717
Status: Downloaded newer image for mongo:4.2
Creating allura_solr_1 ... 
Creating allura_mongo_1 ... 
Creating allura_solr_1  ... done
Creating allura_mongo_1 ... done
Creating allura_web_run ... 
Creating allura_web_run ... done

Running scripts/init-docker-dev.sh

Creating SCM directories

Creating directory for SOLR data

Changing it's permissions to 777 so that container will have access to it

Creating virtualenv

Requirement already satisfied: pip in /allura-data/virtualenv/lib/python3.7/site-packages (23.0.1)
Collecting pip
  Downloading pip-23.2.1-py3-none-any.whl (2.1 MB)
     ━━━━━━━━━━━━━━━━━━━━━━━━━━━━━━━━━━━━━━━━ 2.1/2.1 MB 9.6 MB/s eta 0:00:00
Installing collected packages: pip
  Attempting uninstall: pip
    Found existing installation: pip 23.0.1
    Uninstalling pip-23.0.1:
      Successfully uninstalled pip-23.0.1
Successfully installed pip-23.2.1
Collecting wheel
  Obtaining dependency information for wheel from https://files.pythonhosted.org/packages/28/f5/6955d7b3a5d71ce6bac104f9cf98c1b0513ad656cdaca8ea7d579196f771/wheel-0.41.1-py3-none-any.whl.metadata
  Downloading wheel-0.41.1-py3-none-any.whl.metadata (2.2 kB)
Downloading wheel-0.41.1-py3-none-any.whl (64 kB)
   ━━━━━━━━━━━━━━━━━━━━━━━━━━━━━━━━━━━━━━━━ 64.8/64.8 kB 679.5 kB/s eta 0:00:00
Installing collected packages: wheel
Successfully installed wheel-0.41.1
  % Total    % Received % Xferd  Average Speed   Time    Time     Time  Current
                                 Dload  Upload   Total   Spent    Left  Speed
  0     0    0     0    0     0      0      0 --:--:-- --:--:-- --:--:--     0100 12741  100 12741    0     0  41803      0 --:--:-- --:--:-- --:--:-- 41911
Looking up latest PySVN version...
Downloading PySVN 1.9.20...
Building PySVN...
Processing /tmp/tmp76i0rq3e.pysvn-install/pysvn-1.9.20
  Preparing metadata (setup.py): started
  Preparing metadata (setup.py): finished with status 'done'
Building wheels for collected packages: pysvn
  Building wheel for pysvn (setup.py): started
  Building wheel for pysvn (setup.py): still running...
  Building wheel for pysvn (setup.py): finished with status 'done'
  Created wheel for pysvn: filename=pysvn-1.9.20-cp37-cp37m-linux_x86_64.whl size=738992 sha256=ac342158a90dd41a79a18b17be0c56333a01867d080a95b74aed0bb216b9b5a7
  Stored in directory: /root/.cache/pip/wheels/8f/a2/b7/87e58c4e5f6b25f5e584e0788cc140e07bc9315f38387dbce3
Successfully built pysvn
Installing collected packages: pysvn
Successfully installed pysvn-1.9.20

PySVN is installed.

Installing python packages

ERROR: Ignored the following versions that require a different python version: 10.0.0 Requires-Python >=3.8; 6.8.0 Requires-Python >=3.8
ERROR: Could not find a version that satisfies the requirement pillow==10.0.0 (from versions: 1.0, 1.1, 1.2, 1.3, 1.4, 1.5, 1.6, 1.7.0, 1.7.1, 1.7.2, 1.7.3, 1.7.4, 1.7.5, 1.7.6, 1.7.7, 1.7.8, 2.0.0, 2.1.0, 2.2.0, 2.2.1, 2.2.2, 2.3.0, 2.3.1, 2.3.2, 2.4.0, 2.5.0, 2.5.1, 2.5.2, 2.5.3, 2.6.0, 2.6.1, 2.6.2, 2.7.0, 2.8.0, 2.8.1, 2.8.2, 2.9.0, 3.0.0, 3.1.0rc1, 3.1.0, 3.1.1, 3.1.2, 3.2.0, 3.3.0, 3.3.1, 3.3.2, 3.3.3, 3.4.0, 3.4.1, 3.4.2, 4.0.0, 4.1.0, 4.1.1, 4.2.0, 4.2.1, 4.3.0, 5.0.0, 5.1.0, 5.2.0, 5.3.0, 5.4.0, 5.4.1, 6.0.0, 6.1.0, 6.2.0, 6.2.1, 6.2.2, 7.0.0, 7.1.0, 7.1.1, 7.1.2, 7.2.0, 8.0.0, 8.0.1, 8.1.0, 8.1.1, 8.1.2, 8.2.0, 8.3.0, 8.3.1, 8.3.2, 8.4.0, 9.0.0, 9.0.1, 9.1.0, 9.1.1, 9.2.0, 9.3.0, 9.4.0, 9.5.0)
ERROR: No matching distribution found for pillow==10.0.0
1

=============================================================================
Starting up docker containers
=============================================================================
allura_solr_1 is up-to-date
allura_mongo_1 is up-to-date
Creating allura_web_1 ... 
Creating allura_web_1 ... done

=============================================================================
Docker Container Info:
=============================================================================
Error response from daemon: Container dd6c2e28d82858decd968573909d1e73de14eddecdf06433cb1c08139f83b87d is not running

=============================================================================
Setup: tests
=============================================================================

=============================================================================
Run: tests
=============================================================================

=============================================================================
Shutdown
=============================================================================
Stopping allura_mongo_1 ... 
Stopping allura_solr_1  ... 
Stopping allura_mongo_1 ... done
Stopping allura_solr_1  ... done
Removing allura_web_1   ... 
Removing allura_mongo_1 ... 
Removing allura_solr_1  ... 
Removing allura_mongo_1 ... done
Removing allura_solr_1  ... done
Removing allura_web_1   ... done
Removing network allura_default
Total reclaimed space: 0B
Deleted Volumes:
43fffd60807751843417bf2d7b82d74c5c16e373f56a8fecbc5d8e1d01501b6f
c6a14915d4f86e584684315f4105f95dbad4bb0c64604c02d8bb0b41dadc9cda
aa457e62ecd0a41281e8520c5bd5033abf59953acee635a5b4004bf897c7a064
28c0b877fe8be36d0757f8be04488e2dfa53a77853d8e8cefeb6bcf673b30436
29f5fa4c818672320873f74e27a152fcbdc50f5abfa49be393150a19509efff6
a6872994431a48f99bae9f64f72f20eeb6da19fa1916aabd7bc008ae9936f93f
bdb96b84316c1d50a9953479e8ee18232552bf2db898cb15ae87286fa8400ffe
b816e598e4e3dc3e1c8fc8f4e332f0131553cbf01c4d2ffa0e457021f22cae63
364d25e2e5c4de98a7f9499e121bab784f128d9ac67297800e4ed75a7761269a
b73a54280215d250fb94aba0c08f3243a8a79e9c2d4fb73fb592021ca92a6b21
28f2e4e4f74c1053f6b6b607609a5b7880728733b5fd8f9017a5ba85ffa62de6
7bd942451e59fdaeedaeb85b45b7148caa145228fd1c9fd3a80c3958ff21283b
a4ac4293209efae9f26ac84dfe41bbe35aa912a7c9eecbc26042b1f8934bc058
445cae7d69a74e6c1f83dd0a1824d212336126aae6d9da6ae700fd63c41384b4
182106a5d163c4e26645438ac0e26d1ff6c280c641c446ff37ec1ec847a205c1
05a89a52fb7b891e3ec7c6b390d34207de3ac50a9bddf08bc8f007eaf7a5006d
80ba8e6b5fe8503796a42817c63e463f7e0c917dd9263fa5680eb974843709e9
776d8b833bab01944b7a84f5b2aa55b53a6c1ab13503321687c69134bf113f8e
7d0b1871e4179d404f6659fcc04dc13362a4effba3e236a80cd81017ab500ded
6ed89e2bd572793efe38f1fd112e32a17835787a962fd1b17cad620df47d6d48
0ea1ce36865433d7a832f494c43366788919271319807ae13deb11f60a699d76
fed8560df261b932204ee66a8013dac5cfe0a25518f56eb8b1c2168a75b73e0f
27bd3f3814f331435397a6fc059374e08b07074da37b185089db8a701d023527
aa9018d202ba84cb54802b612049188a8890b8763afd226039304b5aac90ac75
19675448522dd7a1759936e18b468d8221abd439fba8af01d04f64ca07510e8e
c987be4b6ffb78498072fe0430833171c78a273e97758bd48d2dfd2e79ca87e5
498b485eea4b941e47fa380e549e4d121fe62c718df4384f329514f743390413
8c214adeabf8129775ba0d825ff76622be4c09df5a799f68983b737ca5a67aab
2be1dfeb4e45ec633735f01f7965eac0515f2cc55c3e7cd1f5406bcdf8fa41e8
c9a4de49692449f446f182ec57fe9fdefae4d6121ad8e5e62191e59d1798c515
1cc3b241a5ac849e6e289eac0ff6f870af7dd691b6406a139b034ba9700b0516
594e9d791a5e6287a3cf8240bd7c74adad4c82824e2224c89278030f0e877c46
1fb0220a09f628c339a7fe5c294c6e0e70c6ed115ef97183a85bf33340843dd4
8e5094e263b2e8f2f3a13dc83154c9f40c23fcedd63d429b841764f98dacb094
efcb102987edf7918dc3921d26a715cc858d612625590d3f442255a184e7f0de
c79373bddb51dab140019e82374818e6a99a59c258acc5f96de887f5243710fa
a8a071c94df3f0528d0d40cdcb55677f07e4bfef3dc712237b5cce6da3cd1de9

Total reclaimed space: 6.271GB
Build step 'Execute shell' marked build as failure
Recording test results
ERROR: Step ?Publish JUnit test result report? failed: No test report files were found. Configuration error?

Build failed in Jenkins: Allura » Allura-py3.7 #255

Posted by Apache Jenkins Server <je...@builds.apache.org>.
See <https://ci-builds.apache.org/job/Allura/job/Allura-py3.7/255/display/redirect?page=changes>

Changes:

[Guillermo Cruz] bump cryptography 41.0.2 -> 41.0.3


------------------------------------------
[...truncated 4.91 KB...]
RUN_ARTIFACTS_DISPLAY_URL=https://ci-builds.apache.org/job/Allura/job/Allura-py3.7/255/display/redirect?page=artifacts
MAIL=/var/mail/jenkins
BUILD_URL=https://ci-builds.apache.org/job/Allura/job/Allura-py3.7/255/
SHELL=/bin/bash
JOB_URL=https://ci-builds.apache.org/job/Allura/job/Allura-py3.7/
BUILD_DISPLAY_NAME=#255
PY_VERSION=3.7
ROOT_BUILD_CAUSE=SCMTRIGGER
SHLVL=3
GIT_BRANCH=origin/master
JENKINSGRADLEPLUGIN_GRADLE_ENTERPRISE_URL=https://ge.apache.org
BUILD_TAG=jenkins-Allura-Allura-py3.7-255
JENKINSGRADLEPLUGIN_GRADLE_ENTERPRISE_GRADLE_INJECTION_ENABLED=false
NODE_LABELS=builds40 ubuntu
LOGNAME=jenkins
DBUS_SESSION_BUS_ADDRESS=unix:path=/run/user/910/bus
XDG_RUNTIME_DIR=/run/user/910
PATH=/usr/local/sbin:/usr/local/bin:/usr/sbin:/usr/bin:/sbin:/bin:/snap/bin
GIT_PREVIOUS_SUCCESSFUL_COMMIT=61ee60cac206a2ef7e705c1e4496cc6a43fd91a1
JENKINS_SERVER_COOKIE=9c7f00b5d9bf9427
_=/usr/bin/env

=============================================================================
Run: cleanup previous runs
=============================================================================
Removing network allura_default
Network allura_default not found.

=============================================================================
Run: build docker image
=============================================================================
solr uses an image, skipping
mongo uses an image, skipping
outmail uses an image, skipping
taskd uses an image, skipping
inmail uses an image, skipping
Building web
#1 [internal] load .dockerignore
#1 transferring context:
#1 transferring context: 2B done
#1 DONE 0.6s

#2 [internal] load build definition from Dockerfile
#2 transferring dockerfile: 2.58kB done
#2 DONE 0.8s

#3 [internal] load metadata for docker.io/library/ubuntu:22.04
#3 DONE 1.3s

#4 [1/7] FROM docker.io/library/ubuntu:22.04@sha256:0bced47fffa3361afa981854fcabcd4577cd43cebbb808cea2b1f33a3dd7f508
#4 DONE 0.0s

#5 [2/7] RUN apt-get update     && apt-get install gpg gpg-agent software-properties-common -y --no-install-recommends     && add-apt-repository ppa:deadsnakes/ppa -y     && apt-get update
#5 CACHED

#6 [3/7] RUN apt-get upgrade -y git
#6 CACHED

#7 [4/7] RUN DEBIAN_FRONTEND=noninteractive apt-get install -y --no-install-recommends         git-core         python3.7         python3.7-venv         python3.7-dev         gcc         libmagic1         libssl-dev         libldap2-dev         libsasl2-dev         libjpeg8-dev         zlib1g-dev         zip         subversion         curl         locales         g++         libsvn-dev         make         sudo     && rm -rf /var/lib/apt/lists/*
#7 CACHED

#8 [5/7] RUN curl --silent --location https://deb.nodesource.com/setup_14.x | sudo bash - &&     DEBIAN_FRONTEND=noninteractive apt-get install --yes --no-install-recommends nodejs
#8 CACHED

#9 [6/7] RUN locale-gen en_US.UTF-8
#9 CACHED

#10 [7/7] WORKDIR /allura
#10 CACHED

#11 exporting to image
#11 exporting layers done
#11 writing image sha256:f10234e3516b8995c69b7c223168dbe2cfb8ca9f1d88dbb6022963fd842e40ce 0.1s done
#11 naming to docker.io/library/allura-web 0.1s done
#11 DONE 0.2s
Building http
#1 [internal] load .dockerignore
#1 transferring context:
#1 transferring context: 2B done
#1 ...

#2 [internal] load build definition from Dockerfile
#2 transferring dockerfile: 2.40kB done
#2 DONE 0.6s

#1 [internal] load .dockerignore
#1 DONE 0.9s

#3 [internal] load metadata for docker.io/library/ubuntu:18.04
#3 DONE 1.0s

#4 [ 1/10] FROM docker.io/library/ubuntu:18.04@sha256:152dc042452c496007f07ca9127571cb9c29697f42acbfad72324b2bb2e43c98
#4 DONE 0.0s

#5 [internal] load build context
#5 transferring context: 4.20kB done
#5 DONE 0.4s

#6 [ 3/10] RUN a2enmod cgi proxy proxy_http
#6 CACHED

#7 [ 2/10] RUN apt-get update && DEBIAN_FRONTEND=noninteractive apt-get install -y --no-install-recommends     apache2     libapache2-mod-python     python-requests     git     curl     sudo     && rm -rf /var/lib/apt/lists/*
#7 CACHED

#8 [ 9/10] RUN adduser www-data sudo
#8 CACHED

#9 [ 4/10] ADD ./git-http.conf /etc/apache2/sites-available/
#9 CACHED

#10 [ 7/10] RUN apachectl configtest
#10 CACHED

#11 [ 8/10] ADD git-http-backend-wrapper.sh /usr/lib/git-core
#11 CACHED

#12 [ 5/10] RUN a2dissite 000-default.conf
#12 CACHED

#13 [ 6/10] RUN a2ensite git-http.conf
#13 CACHED

#14 [10/10] RUN echo '%sudo  ALL=(ALL) NOPASSWD:ALL' > /etc/sudoers.d/sudo_group_passwordless
#14 CACHED

#15 exporting to image
#15 exporting layers done
#15 writing image sha256:3b4cf350bd6bdb032324eb9f19eab59dd42c9f2df4eec671c003919c6982d759
#15 writing image sha256:3b4cf350bd6bdb032324eb9f19eab59dd42c9f2df4eec671c003919c6982d759 0.1s done
#15 naming to docker.io/library/allura_http 0.1s done
#15 DONE 0.2s

=============================================================================
Setup: venv, pip, pysvn, ./rebuild-all.sh, npm, etc.
=============================================================================
Creating network "allura_default" with the default driver
Pulling solr (solr:6-alpine)...
6-alpine: Pulling from library/solr
Digest: sha256:4f63093698313437a49b2f945c4b1545c9e3a655f52581bc6e01ea006fae132e
Status: Downloaded newer image for solr:6-alpine
Pulling mongo (mongo:4.2)...
4.2: Pulling from library/mongo
Digest: sha256:699d652ed67423d689258bad7b316cf005dfbb82b334118ec306f049042f3717
Status: Downloaded newer image for mongo:4.2
Creating allura_solr_1 ... 
Creating allura_mongo_1 ... 
Creating allura_solr_1  ... done
Creating allura_mongo_1 ... done
Creating allura_web_run ... 
Creating allura_web_run ... done

Running scripts/init-docker-dev.sh

Creating SCM directories

Creating directory for SOLR data

Changing it's permissions to 777 so that container will have access to it

Creating virtualenv

Requirement already satisfied: pip in /allura-data/virtualenv/lib/python3.7/site-packages (23.0.1)
Collecting pip
  Downloading pip-23.2.1-py3-none-any.whl (2.1 MB)
     ━━━━━━━━━━━━━━━━━━━━━━━━━━━━━━━━━━━━━━━━ 2.1/2.1 MB 8.5 MB/s eta 0:00:00
Installing collected packages: pip
  Attempting uninstall: pip
    Found existing installation: pip 23.0.1
    Uninstalling pip-23.0.1:
      Successfully uninstalled pip-23.0.1
Successfully installed pip-23.2.1
Collecting wheel
  Obtaining dependency information for wheel from https://files.pythonhosted.org/packages/28/f5/6955d7b3a5d71ce6bac104f9cf98c1b0513ad656cdaca8ea7d579196f771/wheel-0.41.1-py3-none-any.whl.metadata
  Downloading wheel-0.41.1-py3-none-any.whl.metadata (2.2 kB)
Downloading wheel-0.41.1-py3-none-any.whl (64 kB)
   ━━━━━━━━━━━━━━━━━━━━━━━━━━━━━━━━━━━━━━━━ 64.8/64.8 kB 509.0 kB/s eta 0:00:00
Installing collected packages: wheel
Successfully installed wheel-0.41.1
  % Total    % Received % Xferd  Average Speed   Time    Time     Time  Current
                                 Dload  Upload   Total   Spent    Left  Speed
  0     0    0     0    0     0      0      0 --:--:-- --:--:-- --:--:--     0  0     0    0     0    0     0      0      0 --:--:-- --:--:-- --:--:--     0100 12741  100 12741    0     0  59811      0 --:--:-- --:--:-- --:--:-- 59816
Looking up latest PySVN version...
Downloading PySVN 1.9.20...
Building PySVN...
Processing /tmp/tmp2cbh4yip.pysvn-install/pysvn-1.9.20
  Preparing metadata (setup.py): started
  Preparing metadata (setup.py): finished with status 'done'
Building wheels for collected packages: pysvn
  Building wheel for pysvn (setup.py): started
  Building wheel for pysvn (setup.py): still running...
  Building wheel for pysvn (setup.py): finished with status 'done'
  Created wheel for pysvn: filename=pysvn-1.9.20-cp37-cp37m-linux_x86_64.whl size=738992 sha256=9bee65ad05ff0e3bbbf5ee9824d0c15cbcfadeb01a3d5ffece93a87c635246d7
  Stored in directory: /root/.cache/pip/wheels/02/94/89/3b965697252276a6d55fa9c52a6d045fe4df46a9d57e14b142
Successfully built pysvn
Installing collected packages: pysvn
Successfully installed pysvn-1.9.20

PySVN is installed.

Installing python packages

ERROR: Ignored the following versions that require a different python version: 10.0.0 Requires-Python >=3.8; 6.8.0 Requires-Python >=3.8
ERROR: Could not find a version that satisfies the requirement pillow==10.0.0 (from versions: 1.0, 1.1, 1.2, 1.3, 1.4, 1.5, 1.6, 1.7.0, 1.7.1, 1.7.2, 1.7.3, 1.7.4, 1.7.5, 1.7.6, 1.7.7, 1.7.8, 2.0.0, 2.1.0, 2.2.0, 2.2.1, 2.2.2, 2.3.0, 2.3.1, 2.3.2, 2.4.0, 2.5.0, 2.5.1, 2.5.2, 2.5.3, 2.6.0, 2.6.1, 2.6.2, 2.7.0, 2.8.0, 2.8.1, 2.8.2, 2.9.0, 3.0.0, 3.1.0rc1, 3.1.0, 3.1.1, 3.1.2, 3.2.0, 3.3.0, 3.3.1, 3.3.2, 3.3.3, 3.4.0, 3.4.1, 3.4.2, 4.0.0, 4.1.0, 4.1.1, 4.2.0, 4.2.1, 4.3.0, 5.0.0, 5.1.0, 5.2.0, 5.3.0, 5.4.0, 5.4.1, 6.0.0, 6.1.0, 6.2.0, 6.2.1, 6.2.2, 7.0.0, 7.1.0, 7.1.1, 7.1.2, 7.2.0, 8.0.0, 8.0.1, 8.1.0, 8.1.1, 8.1.2, 8.2.0, 8.3.0, 8.3.1, 8.3.2, 8.4.0, 9.0.0, 9.0.1, 9.1.0, 9.1.1, 9.2.0, 9.3.0, 9.4.0, 9.5.0)
ERROR: No matching distribution found for pillow==10.0.0
1

=============================================================================
Starting up docker containers
=============================================================================
allura_mongo_1 is up-to-date
allura_solr_1 is up-to-date
Creating allura_web_1 ... 
Creating allura_web_1 ... done

=============================================================================
Docker Container Info:
=============================================================================
Error response from daemon: Container ef888ce733d77da385eda22d1253c7f272f514316ed2670fb14d362cab09a977 is not running

=============================================================================
Setup: tests
=============================================================================

=============================================================================
Run: tests
=============================================================================

=============================================================================
Shutdown
=============================================================================
Stopping allura_mongo_1 ... 
Stopping allura_solr_1  ... 
Stopping allura_solr_1  ... done
Stopping allura_mongo_1 ... done
Removing allura_web_1   ... 
Removing allura_mongo_1 ... 
Removing allura_solr_1  ... 
Removing allura_web_1   ... done
Removing allura_mongo_1 ... done
Removing allura_solr_1  ... done
Removing network allura_default
Total reclaimed space: 0B
Deleted Volumes:
6fa1ce02e51f0b3fa02f7c05064458da5d869391978611d8477c281bdf5b4d7c

Total reclaimed space: 0B
Build step 'Execute shell' marked build as failure
Recording test results
ERROR: Step ?Publish JUnit test result report? failed: No test report files were found. Configuration error?