You are viewing a plain text version of this content. The canonical link for it is here.
Posted to dev@kafka.apache.org by Apache Jenkins Server <je...@builds.apache.org> on 2019/07/11 11:50:29 UTC
Build failed in Jenkins: kafka-trunk-jdk8 #3779
See <https://builds.apache.org/job/kafka-trunk-jdk8/3779/display/redirect?page=changes>
Changes:
[ismael] KAFKA-8653; Default rebalance timeout to session timeout for JoinGroup
------------------------------------------
[...truncated 2.63 MB...]
org.apache.kafka.connect.runtime.isolation.PluginUtilsTest > testOrderOfPluginUrlsWithJars STARTED
org.apache.kafka.connect.runtime.isolation.PluginUtilsTest > testOrderOfPluginUrlsWithJars PASSED
org.apache.kafka.connect.runtime.isolation.PluginUtilsTest > testPluginUrlsWithClasses STARTED
org.apache.kafka.connect.runtime.isolation.PluginUtilsTest > testPluginUrlsWithClasses PASSED
org.apache.kafka.connect.runtime.isolation.PluginUtilsTest > testConnectFrameworkClasses STARTED
org.apache.kafka.connect.runtime.isolation.PluginUtilsTest > testConnectFrameworkClasses PASSED
org.apache.kafka.connect.runtime.isolation.PluginUtilsTest > testThirdPartyClasses STARTED
org.apache.kafka.connect.runtime.isolation.PluginUtilsTest > testThirdPartyClasses PASSED
org.apache.kafka.connect.runtime.isolation.PluginUtilsTest > testClientConfigProvider STARTED
org.apache.kafka.connect.runtime.isolation.PluginUtilsTest > testClientConfigProvider PASSED
org.apache.kafka.connect.runtime.isolation.PluginUtilsTest > testAllowedConnectFrameworkClasses STARTED
org.apache.kafka.connect.runtime.isolation.PluginUtilsTest > testAllowedConnectFrameworkClasses PASSED
org.apache.kafka.connect.runtime.isolation.PluginUtilsTest > testJavaLibraryClasses STARTED
org.apache.kafka.connect.runtime.isolation.PluginUtilsTest > testJavaLibraryClasses PASSED
org.apache.kafka.connect.runtime.isolation.PluginUtilsTest > testEmptyPluginUrls STARTED
org.apache.kafka.connect.runtime.isolation.PluginUtilsTest > testEmptyPluginUrls PASSED
org.apache.kafka.connect.runtime.isolation.PluginUtilsTest > testConnectorClientConfigOverridePolicy STARTED
org.apache.kafka.connect.runtime.isolation.PluginUtilsTest > testConnectorClientConfigOverridePolicy PASSED
org.apache.kafka.connect.runtime.isolation.PluginUtilsTest > testPluginUrlsWithJars STARTED
org.apache.kafka.connect.runtime.isolation.PluginUtilsTest > testPluginUrlsWithJars PASSED
org.apache.kafka.connect.runtime.isolation.PluginUtilsTest > testPluginUrlsWithZips STARTED
org.apache.kafka.connect.runtime.isolation.PluginUtilsTest > testPluginUrlsWithZips PASSED
org.apache.kafka.connect.runtime.isolation.PluginUtilsTest > testPluginUrlsWithRelativeSymlinkBackwards STARTED
org.apache.kafka.connect.runtime.isolation.PluginUtilsTest > testPluginUrlsWithRelativeSymlinkBackwards PASSED
org.apache.kafka.connect.runtime.isolation.PluginUtilsTest > testPluginUrlsWithAbsoluteSymlink STARTED
org.apache.kafka.connect.runtime.isolation.PluginUtilsTest > testPluginUrlsWithAbsoluteSymlink PASSED
org.apache.kafka.connect.runtime.isolation.PluginUtilsTest > testEmptyStructurePluginUrls STARTED
org.apache.kafka.connect.runtime.isolation.PluginUtilsTest > testEmptyStructurePluginUrls PASSED
org.apache.kafka.connect.runtime.isolation.PluginsTest > shouldInstantiateAndConfigureConnectRestExtension STARTED
org.apache.kafka.connect.runtime.isolation.PluginsTest > shouldInstantiateAndConfigureConnectRestExtension PASSED
org.apache.kafka.connect.runtime.isolation.PluginsTest > shouldInstantiateAndConfigureConverters STARTED
org.apache.kafka.connect.runtime.isolation.PluginsTest > shouldInstantiateAndConfigureConverters PASSED
org.apache.kafka.connect.runtime.isolation.PluginsTest > shouldInstantiateAndConfigureInternalConverters STARTED
org.apache.kafka.connect.runtime.isolation.PluginsTest > shouldInstantiateAndConfigureInternalConverters PASSED
org.apache.kafka.connect.runtime.isolation.PluginsTest > shouldInstantiateAndConfigureDefaultHeaderConverter STARTED
org.apache.kafka.connect.runtime.isolation.PluginsTest > shouldInstantiateAndConfigureDefaultHeaderConverter PASSED
org.apache.kafka.connect.runtime.isolation.PluginsTest > shouldInstantiateAndConfigureExplicitlySetHeaderConverterWithCurrentClassLoader STARTED
org.apache.kafka.connect.runtime.isolation.PluginsTest > shouldInstantiateAndConfigureExplicitlySetHeaderConverterWithCurrentClassLoader PASSED
org.apache.kafka.connect.runtime.ErrorHandlingTaskTest > testErrorHandlingInSinkTasks STARTED
org.apache.kafka.connect.runtime.ErrorHandlingTaskTest > testErrorHandlingInSinkTasks PASSED
org.apache.kafka.connect.runtime.ErrorHandlingTaskTest > testErrorHandlingInSourceTasks STARTED
org.apache.kafka.connect.runtime.ErrorHandlingTaskTest > testErrorHandlingInSourceTasks PASSED
org.apache.kafka.connect.runtime.ErrorHandlingTaskTest > testErrorHandlingInSourceTasksWthBadConverter STARTED
org.apache.kafka.connect.runtime.ErrorHandlingTaskTest > testErrorHandlingInSourceTasksWthBadConverter PASSED
org.apache.kafka.connect.util.ConnectUtilsTest > testLookupNullKafkaClusterId STARTED
org.apache.kafka.connect.util.ConnectUtilsTest > testLookupNullKafkaClusterId PASSED
org.apache.kafka.connect.util.ConnectUtilsTest > testLookupKafkaClusterId STARTED
org.apache.kafka.connect.util.ConnectUtilsTest > testLookupKafkaClusterId PASSED
org.apache.kafka.connect.util.ConnectUtilsTest > testLookupKafkaClusterIdTimeout STARTED
org.apache.kafka.connect.util.ConnectUtilsTest > testLookupKafkaClusterIdTimeout PASSED
org.apache.kafka.connect.util.LoggingContextTest > shouldCreateConnectorLoggingContext STARTED
org.apache.kafka.connect.util.LoggingContextTest > shouldCreateConnectorLoggingContext PASSED
org.apache.kafka.connect.util.LoggingContextTest > shouldCreateTaskLoggingContext STARTED
org.apache.kafka.connect.util.LoggingContextTest > shouldCreateTaskLoggingContext PASSED
org.apache.kafka.connect.util.LoggingContextTest > shouldNotAllowNullConnectorNameForConnectorContext STARTED
org.apache.kafka.connect.util.LoggingContextTest > shouldNotAllowNullConnectorNameForConnectorContext PASSED
org.apache.kafka.connect.util.LoggingContextTest > shouldAllowNestedLoggingContexts STARTED
org.apache.kafka.connect.util.LoggingContextTest > shouldAllowNestedLoggingContexts PASSED
org.apache.kafka.connect.util.LoggingContextTest > shouldNotAllowNullTaskIdForTaskContext STARTED
org.apache.kafka.connect.util.LoggingContextTest > shouldNotAllowNullTaskIdForTaskContext PASSED
org.apache.kafka.connect.util.LoggingContextTest > shouldCreateAndCloseLoggingContextEvenWithNullContextMap STARTED
org.apache.kafka.connect.util.LoggingContextTest > shouldCreateAndCloseLoggingContextEvenWithNullContextMap PASSED
org.apache.kafka.connect.util.LoggingContextTest > shouldNotAllowNullTaskIdForOffsetContext STARTED
org.apache.kafka.connect.util.LoggingContextTest > shouldNotAllowNullTaskIdForOffsetContext PASSED
org.apache.kafka.connect.util.LoggingContextTest > shouldCreateOffsetsLoggingContext STARTED
org.apache.kafka.connect.util.LoggingContextTest > shouldCreateOffsetsLoggingContext PASSED
org.apache.kafka.connect.util.TableTest > basicOperations STARTED
org.apache.kafka.connect.util.TableTest > basicOperations PASSED
org.apache.kafka.connect.util.ShutdownableThreadTest > testGracefulShutdown STARTED
org.apache.kafka.connect.util.ShutdownableThreadTest > testGracefulShutdown PASSED
org.apache.kafka.connect.util.ShutdownableThreadTest > testForcibleShutdown STARTED
org.apache.kafka.connect.util.ShutdownableThreadTest > testForcibleShutdown PASSED
org.apache.kafka.connect.util.TopicAdminTest > shouldNotCreateTopicWhenItAlreadyExists STARTED
org.apache.kafka.connect.util.TopicAdminTest > shouldNotCreateTopicWhenItAlreadyExists PASSED
org.apache.kafka.connect.util.TopicAdminTest > returnNullWithTopicAuthorizationFailure STARTED
org.apache.kafka.connect.util.TopicAdminTest > returnNullWithTopicAuthorizationFailure PASSED
org.apache.kafka.connect.util.TopicAdminTest > shouldCreateTopicWhenItDoesNotExist STARTED
org.apache.kafka.connect.util.TopicAdminTest > shouldCreateTopicWhenItDoesNotExist PASSED
org.apache.kafka.connect.util.TopicAdminTest > shouldReturnFalseWhenSuppliedNullTopicDescription STARTED
org.apache.kafka.connect.util.TopicAdminTest > shouldReturnFalseWhenSuppliedNullTopicDescription PASSED
org.apache.kafka.connect.util.TopicAdminTest > returnNullWithApiVersionMismatch STARTED
org.apache.kafka.connect.util.TopicAdminTest > returnNullWithApiVersionMismatch PASSED
org.apache.kafka.connect.util.TopicAdminTest > shouldCreateOneTopicWhenProvidedMultipleDefinitionsWithSameTopicName STARTED
org.apache.kafka.connect.util.TopicAdminTest > shouldCreateOneTopicWhenProvidedMultipleDefinitionsWithSameTopicName PASSED
org.apache.kafka.connect.util.TopicAdminTest > returnNullWithClusterAuthorizationFailure STARTED
org.apache.kafka.connect.util.TopicAdminTest > returnNullWithClusterAuthorizationFailure PASSED
org.apache.kafka.connect.util.KafkaBasedLogTest > testReloadOnStart STARTED
org.apache.kafka.connect.util.KafkaBasedLogTest > testReloadOnStart PASSED
org.apache.kafka.connect.util.KafkaBasedLogTest > testStartStop STARTED
org.apache.kafka.connect.util.KafkaBasedLogTest > testStartStop PASSED
org.apache.kafka.connect.util.KafkaBasedLogTest > testProducerError STARTED
org.apache.kafka.connect.util.KafkaBasedLogTest > testProducerError PASSED
org.apache.kafka.connect.util.KafkaBasedLogTest > testReloadOnStartWithNoNewRecordsPresent STARTED
org.apache.kafka.connect.util.KafkaBasedLogTest > testReloadOnStartWithNoNewRecordsPresent PASSED
org.apache.kafka.connect.util.KafkaBasedLogTest > testSendAndReadToEnd STARTED
org.apache.kafka.connect.util.KafkaBasedLogTest > testSendAndReadToEnd PASSED
org.apache.kafka.connect.util.KafkaBasedLogTest > testConsumerError STARTED
org.apache.kafka.connect.util.KafkaBasedLogTest > testConsumerError PASSED
470 tests completed, 1 failed
> Task :connect:runtime:test FAILED
FAILURE: Build failed with an exception.
* What went wrong:
Execution failed for task ':connect:runtime:test'.
> There were failing tests. See the report at: file://<https://builds.apache.org/job/kafka-trunk-jdk8/ws/connect/runtime/build/reports/tests/test/index.html>
* Try:
Run with --stacktrace option to get the stack trace. Run with --info or --debug option to get more log output. Run with --scan to get full insights.
* Get more help at https://help.gradle.org
Deprecated Gradle features were used in this build, making it incompatible with Gradle 6.0.
Use '--warning-mode all' to show the individual deprecation warnings.
See https://docs.gradle.org/5.4.1/userguide/command_line_interface.html#sec:command_line_warnings
BUILD FAILED in 3h 4m 18s
178 actionable tasks: 152 executed, 26 up-to-date
Build step 'Execute shell' marked build as failure
[FINDBUGS] Collecting findbugs analysis files...
Setting GRADLE_4_8_1_HOME=/home/jenkins/tools/gradle/4.8.1
[FINDBUGS] Searching for all files in <https://builds.apache.org/job/kafka-trunk-jdk8/ws/> that match the pattern **/build/reports/*bugs/*.xml
[FINDBUGS] Parsing 17 files in <https://builds.apache.org/job/kafka-trunk-jdk8/ws/>
[FINDBUGS] Successfully parsed file <https://builds.apache.org/job/kafka-trunk-jdk8/ws/clients/build/reports/spotbugs/main.xml> with 0 unique warnings and 0 duplicates.
[FINDBUGS] Successfully parsed file <https://builds.apache.org/job/kafka-trunk-jdk8/ws/connect/api/build/reports/spotbugs/main.xml> with 0 unique warnings and 0 duplicates.
[FINDBUGS] Successfully parsed file <https://builds.apache.org/job/kafka-trunk-jdk8/ws/connect/basic-auth-extension/build/reports/spotbugs/main.xml> with 0 unique warnings and 0 duplicates.
[FINDBUGS] Successfully parsed file <https://builds.apache.org/job/kafka-trunk-jdk8/ws/connect/file/build/reports/spotbugs/main.xml> with 0 unique warnings and 0 duplicates.
[FINDBUGS] Successfully parsed file <https://builds.apache.org/job/kafka-trunk-jdk8/ws/connect/json/build/reports/spotbugs/main.xml> with 0 unique warnings and 0 duplicates.
[FINDBUGS] Successfully parsed file <https://builds.apache.org/job/kafka-trunk-jdk8/ws/connect/runtime/build/reports/spotbugs/main.xml> with 0 unique warnings and 0 duplicates.
[FINDBUGS] Successfully parsed file <https://builds.apache.org/job/kafka-trunk-jdk8/ws/connect/transforms/build/reports/spotbugs/main.xml> with 0 unique warnings and 0 duplicates.
[FINDBUGS] Successfully parsed file <https://builds.apache.org/job/kafka-trunk-jdk8/ws/core/build/reports/spotbugs/main.xml> with 0 unique warnings and 0 duplicates.
[FINDBUGS] Successfully parsed file <https://builds.apache.org/job/kafka-trunk-jdk8/ws/examples/build/reports/spotbugs/main.xml> with 0 unique warnings and 0 duplicates.
[FINDBUGS] Successfully parsed file <https://builds.apache.org/job/kafka-trunk-jdk8/ws/generator/build/reports/spotbugs/main.xml> with 0 unique warnings and 0 duplicates.
[FINDBUGS] Successfully parsed file <https://builds.apache.org/job/kafka-trunk-jdk8/ws/jmh-benchmarks/build/reports/spotbugs/main.xml> with 0 unique warnings and 0 duplicates.
[FINDBUGS] Successfully parsed file <https://builds.apache.org/job/kafka-trunk-jdk8/ws/log4j-appender/build/reports/spotbugs/main.xml> with 0 unique warnings and 0 duplicates.
[FINDBUGS] Successfully parsed file <https://builds.apache.org/job/kafka-trunk-jdk8/ws/streams/build/reports/spotbugs/main.xml> with 0 unique warnings and 0 duplicates.
[FINDBUGS] Successfully parsed file <https://builds.apache.org/job/kafka-trunk-jdk8/ws/streams/examples/build/reports/spotbugs/main.xml> with 0 unique warnings and 0 duplicates.
[FINDBUGS] Successfully parsed file <https://builds.apache.org/job/kafka-trunk-jdk8/ws/streams/streams-scala/build/reports/spotbugs/main.xml> with 0 unique warnings and 0 duplicates.
[FINDBUGS] Successfully parsed file <https://builds.apache.org/job/kafka-trunk-jdk8/ws/streams/test-utils/build/reports/spotbugs/main.xml> with 0 unique warnings and 0 duplicates.
[FINDBUGS] Successfully parsed file <https://builds.apache.org/job/kafka-trunk-jdk8/ws/tools/build/reports/spotbugs/main.xml> with 0 unique warnings and 0 duplicates.
Setting GRADLE_4_8_1_HOME=/home/jenkins/tools/gradle/4.8.1
No credentials specified
Setting GRADLE_4_8_1_HOME=/home/jenkins/tools/gradle/4.8.1
<Git Blamer> Using GitBlamer to create author and commit information for all warnings.
<Git Blamer> GIT_COMMIT=ebb80f568da59cf60c76170176584bcb34d88ecb, workspace=<https://builds.apache.org/job/kafka-trunk-jdk8/ws/>
[FINDBUGS] Computing warning deltas based on reference build #3778
Recording test results
Setting GRADLE_4_8_1_HOME=/home/jenkins/tools/gradle/4.8.1
Setting GRADLE_4_8_1_HOME=/home/jenkins/tools/gradle/4.8.1
Not sending mail to unregistered user ismael@juma.me.uk
Jenkins build is back to normal : kafka-trunk-jdk8 #3781
Posted by Apache Jenkins Server <je...@builds.apache.org>.
See <https://builds.apache.org/job/kafka-trunk-jdk8/3781/display/redirect?page=changes>
Build failed in Jenkins: kafka-trunk-jdk8 #3780
Posted by Apache Jenkins Server <je...@builds.apache.org>.
See <https://builds.apache.org/job/kafka-trunk-jdk8/3780/display/redirect?page=changes>
Changes:
[cshapi] KAFKA-8644; The Kafka protocol generator should allow null defaults for
------------------------------------------
[...truncated 2.55 MB...]
org.apache.kafka.connect.transforms.ReplaceFieldTest > withSchema PASSED
org.apache.kafka.connect.transforms.ReplaceFieldTest > schemaless STARTED
org.apache.kafka.connect.transforms.ReplaceFieldTest > schemaless PASSED
org.apache.kafka.connect.transforms.HoistFieldTest > withSchema STARTED
org.apache.kafka.connect.transforms.HoistFieldTest > withSchema PASSED
org.apache.kafka.connect.transforms.HoistFieldTest > schemaless STARTED
org.apache.kafka.connect.transforms.HoistFieldTest > schemaless PASSED
org.apache.kafka.connect.transforms.MaskFieldTest > withSchema STARTED
org.apache.kafka.connect.transforms.MaskFieldTest > withSchema PASSED
org.apache.kafka.connect.transforms.MaskFieldTest > schemaless STARTED
org.apache.kafka.connect.transforms.MaskFieldTest > schemaless PASSED
org.apache.kafka.connect.transforms.SetSchemaMetadataTest > schemaNameUpdate STARTED
org.apache.kafka.connect.transforms.SetSchemaMetadataTest > schemaNameUpdate PASSED
org.apache.kafka.connect.transforms.SetSchemaMetadataTest > schemaNameAndVersionUpdateWithStruct STARTED
org.apache.kafka.connect.transforms.SetSchemaMetadataTest > schemaNameAndVersionUpdateWithStruct PASSED
org.apache.kafka.connect.transforms.SetSchemaMetadataTest > updateSchemaOfStruct STARTED
org.apache.kafka.connect.transforms.SetSchemaMetadataTest > updateSchemaOfStruct PASSED
org.apache.kafka.connect.transforms.SetSchemaMetadataTest > schemaNameAndVersionUpdate STARTED
org.apache.kafka.connect.transforms.SetSchemaMetadataTest > schemaNameAndVersionUpdate PASSED
org.apache.kafka.connect.transforms.SetSchemaMetadataTest > updateSchemaOfNull STARTED
org.apache.kafka.connect.transforms.SetSchemaMetadataTest > updateSchemaOfNull PASSED
org.apache.kafka.connect.transforms.SetSchemaMetadataTest > schemaVersionUpdate STARTED
org.apache.kafka.connect.transforms.SetSchemaMetadataTest > schemaVersionUpdate PASSED
org.apache.kafka.connect.transforms.SetSchemaMetadataTest > updateSchemaOfNonStruct STARTED
org.apache.kafka.connect.transforms.SetSchemaMetadataTest > updateSchemaOfNonStruct PASSED
org.apache.kafka.connect.transforms.TimestampRouterTest > defaultConfiguration STARTED
org.apache.kafka.connect.transforms.TimestampRouterTest > defaultConfiguration PASSED
org.apache.kafka.connect.transforms.FlattenTest > testKey STARTED
org.apache.kafka.connect.transforms.FlattenTest > testKey PASSED
org.apache.kafka.connect.transforms.FlattenTest > testOptionalAndDefaultValuesNested STARTED
org.apache.kafka.connect.transforms.FlattenTest > testOptionalAndDefaultValuesNested PASSED
org.apache.kafka.connect.transforms.FlattenTest > topLevelMapRequired STARTED
org.apache.kafka.connect.transforms.FlattenTest > topLevelMapRequired PASSED
org.apache.kafka.connect.transforms.FlattenTest > topLevelStructRequired STARTED
org.apache.kafka.connect.transforms.FlattenTest > topLevelStructRequired PASSED
org.apache.kafka.connect.transforms.FlattenTest > testOptionalFieldStruct STARTED
org.apache.kafka.connect.transforms.FlattenTest > testOptionalFieldStruct PASSED
org.apache.kafka.connect.transforms.FlattenTest > testNestedMapWithDelimiter STARTED
org.apache.kafka.connect.transforms.FlattenTest > testNestedMapWithDelimiter PASSED
org.apache.kafka.connect.transforms.FlattenTest > testOptionalFieldMap STARTED
org.apache.kafka.connect.transforms.FlattenTest > testOptionalFieldMap PASSED
org.apache.kafka.connect.transforms.FlattenTest > testUnsupportedTypeInMap STARTED
org.apache.kafka.connect.transforms.FlattenTest > testUnsupportedTypeInMap PASSED
org.apache.kafka.connect.transforms.FlattenTest > testNestedStruct STARTED
org.apache.kafka.connect.transforms.FlattenTest > testNestedStruct PASSED
org.apache.kafka.connect.transforms.ValueToKeyTest > withSchema STARTED
org.apache.kafka.connect.transforms.ValueToKeyTest > withSchema PASSED
org.apache.kafka.connect.transforms.ValueToKeyTest > schemaless STARTED
org.apache.kafka.connect.transforms.ValueToKeyTest > schemaless PASSED
org.apache.kafka.connect.transforms.TimestampConverterTest > testSchemalessFieldConversion STARTED
org.apache.kafka.connect.transforms.TimestampConverterTest > testSchemalessFieldConversion PASSED
org.apache.kafka.connect.transforms.TimestampConverterTest > testConfigInvalidTargetType STARTED
org.apache.kafka.connect.transforms.TimestampConverterTest > testConfigInvalidTargetType PASSED
org.apache.kafka.connect.transforms.TimestampConverterTest > testSchemalessStringToTimestamp STARTED
org.apache.kafka.connect.transforms.TimestampConverterTest > testSchemalessStringToTimestamp PASSED
org.apache.kafka.connect.transforms.TimestampConverterTest > testKey STARTED
org.apache.kafka.connect.transforms.TimestampConverterTest > testKey PASSED
org.apache.kafka.connect.transforms.TimestampConverterTest > testSchemalessDateToTimestamp STARTED
org.apache.kafka.connect.transforms.TimestampConverterTest > testSchemalessDateToTimestamp PASSED
org.apache.kafka.connect.transforms.TimestampConverterTest > testSchemalessTimestampToString STARTED
org.apache.kafka.connect.transforms.TimestampConverterTest > testSchemalessTimestampToString PASSED
org.apache.kafka.connect.transforms.TimestampConverterTest > testSchemalessTimeToTimestamp STARTED
org.apache.kafka.connect.transforms.TimestampConverterTest > testSchemalessTimeToTimestamp PASSED
org.apache.kafka.connect.transforms.TimestampConverterTest > testWithSchemaTimestampToDate STARTED
org.apache.kafka.connect.transforms.TimestampConverterTest > testWithSchemaTimestampToDate PASSED
org.apache.kafka.connect.transforms.TimestampConverterTest > testWithSchemaTimestampToTime STARTED
org.apache.kafka.connect.transforms.TimestampConverterTest > testWithSchemaTimestampToTime PASSED
org.apache.kafka.connect.transforms.TimestampConverterTest > testWithSchemaTimestampToUnix STARTED
org.apache.kafka.connect.transforms.TimestampConverterTest > testWithSchemaTimestampToUnix PASSED
org.apache.kafka.connect.transforms.TimestampConverterTest > testWithSchemaUnixToTimestamp STARTED
org.apache.kafka.connect.transforms.TimestampConverterTest > testWithSchemaUnixToTimestamp PASSED
org.apache.kafka.connect.transforms.TimestampConverterTest > testSchemalessIdentity STARTED
org.apache.kafka.connect.transforms.TimestampConverterTest > testSchemalessIdentity PASSED
org.apache.kafka.connect.transforms.TimestampConverterTest > testWithSchemaFieldConversion STARTED
org.apache.kafka.connect.transforms.TimestampConverterTest > testWithSchemaFieldConversion PASSED
org.apache.kafka.connect.transforms.TimestampConverterTest > testWithSchemaDateToTimestamp STARTED
org.apache.kafka.connect.transforms.TimestampConverterTest > testWithSchemaDateToTimestamp PASSED
org.apache.kafka.connect.transforms.TimestampConverterTest > testWithSchemaIdentity STARTED
org.apache.kafka.connect.transforms.TimestampConverterTest > testWithSchemaIdentity PASSED
org.apache.kafka.connect.transforms.TimestampConverterTest > testSchemalessTimestampToDate STARTED
org.apache.kafka.connect.transforms.TimestampConverterTest > testSchemalessTimestampToDate PASSED
org.apache.kafka.connect.transforms.TimestampConverterTest > testSchemalessTimestampToTime STARTED
org.apache.kafka.connect.transforms.TimestampConverterTest > testSchemalessTimestampToTime PASSED
org.apache.kafka.connect.transforms.TimestampConverterTest > testSchemalessTimestampToUnix STARTED
org.apache.kafka.connect.transforms.TimestampConverterTest > testSchemalessTimestampToUnix PASSED
org.apache.kafka.connect.transforms.TimestampConverterTest > testConfigMissingFormat STARTED
org.apache.kafka.connect.transforms.TimestampConverterTest > testConfigMissingFormat PASSED
org.apache.kafka.connect.transforms.TimestampConverterTest > testConfigNoTargetType STARTED
org.apache.kafka.connect.transforms.TimestampConverterTest > testConfigNoTargetType PASSED
org.apache.kafka.connect.transforms.TimestampConverterTest > testWithSchemaStringToTimestamp STARTED
org.apache.kafka.connect.transforms.TimestampConverterTest > testWithSchemaStringToTimestamp PASSED
org.apache.kafka.connect.transforms.TimestampConverterTest > testWithSchemaTimeToTimestamp STARTED
org.apache.kafka.connect.transforms.TimestampConverterTest > testWithSchemaTimeToTimestamp PASSED
org.apache.kafka.connect.transforms.TimestampConverterTest > testSchemalessUnixToTimestamp STARTED
org.apache.kafka.connect.transforms.TimestampConverterTest > testSchemalessUnixToTimestamp PASSED
org.apache.kafka.connect.transforms.TimestampConverterTest > testWithSchemaTimestampToString STARTED
org.apache.kafka.connect.transforms.TimestampConverterTest > testWithSchemaTimestampToString PASSED
org.apache.kafka.connect.transforms.TimestampConverterTest > testConfigInvalidFormat STARTED
org.apache.kafka.connect.transforms.TimestampConverterTest > testConfigInvalidFormat PASSED
FAILURE: Build failed with an exception.
* What went wrong:
Execution failed for task ':connect:runtime:test'.
> There were failing tests. See the report at: file://<https://builds.apache.org/job/kafka-trunk-jdk8/ws/connect/runtime/build/reports/tests/test/index.html>
* Try:
Run with --stacktrace option to get the stack trace. Run with --info or --debug option to get more log output. Run with --scan to get full insights.
* Get more help at https://help.gradle.org
Deprecated Gradle features were used in this build, making it incompatible with Gradle 6.0.
Use '--warning-mode all' to show the individual deprecation warnings.
See https://docs.gradle.org/5.4.1/userguide/command_line_interface.html#sec:command_line_warnings
BUILD FAILED in 3h 15m 58s
178 actionable tasks: 152 executed, 26 up-to-date
Build step 'Execute shell' marked build as failure
[FINDBUGS] Collecting findbugs analysis files...
Setting GRADLE_4_8_1_HOME=/home/jenkins/tools/gradle/4.8.1
[FINDBUGS] Searching for all files in <https://builds.apache.org/job/kafka-trunk-jdk8/ws/> that match the pattern **/build/reports/*bugs/*.xml
[FINDBUGS] Parsing 17 files in <https://builds.apache.org/job/kafka-trunk-jdk8/ws/>
[FINDBUGS] Successfully parsed file <https://builds.apache.org/job/kafka-trunk-jdk8/ws/clients/build/reports/spotbugs/main.xml> with 0 unique warnings and 0 duplicates.
[FINDBUGS] Successfully parsed file <https://builds.apache.org/job/kafka-trunk-jdk8/ws/connect/api/build/reports/spotbugs/main.xml> with 0 unique warnings and 0 duplicates.
[FINDBUGS] Successfully parsed file <https://builds.apache.org/job/kafka-trunk-jdk8/ws/connect/basic-auth-extension/build/reports/spotbugs/main.xml> with 0 unique warnings and 0 duplicates.
[FINDBUGS] Successfully parsed file <https://builds.apache.org/job/kafka-trunk-jdk8/ws/connect/file/build/reports/spotbugs/main.xml> with 0 unique warnings and 0 duplicates.
[FINDBUGS] Successfully parsed file <https://builds.apache.org/job/kafka-trunk-jdk8/ws/connect/json/build/reports/spotbugs/main.xml> with 0 unique warnings and 0 duplicates.
[FINDBUGS] Successfully parsed file <https://builds.apache.org/job/kafka-trunk-jdk8/ws/connect/runtime/build/reports/spotbugs/main.xml> with 0 unique warnings and 0 duplicates.
[FINDBUGS] Successfully parsed file <https://builds.apache.org/job/kafka-trunk-jdk8/ws/connect/transforms/build/reports/spotbugs/main.xml> with 0 unique warnings and 0 duplicates.
[FINDBUGS] Successfully parsed file <https://builds.apache.org/job/kafka-trunk-jdk8/ws/core/build/reports/spotbugs/main.xml> with 0 unique warnings and 0 duplicates.
[FINDBUGS] Successfully parsed file <https://builds.apache.org/job/kafka-trunk-jdk8/ws/examples/build/reports/spotbugs/main.xml> with 0 unique warnings and 0 duplicates.
[FINDBUGS] Successfully parsed file <https://builds.apache.org/job/kafka-trunk-jdk8/ws/generator/build/reports/spotbugs/main.xml> with 0 unique warnings and 0 duplicates.
[FINDBUGS] Successfully parsed file <https://builds.apache.org/job/kafka-trunk-jdk8/ws/jmh-benchmarks/build/reports/spotbugs/main.xml> with 0 unique warnings and 0 duplicates.
[FINDBUGS] Successfully parsed file <https://builds.apache.org/job/kafka-trunk-jdk8/ws/log4j-appender/build/reports/spotbugs/main.xml> with 0 unique warnings and 0 duplicates.
[FINDBUGS] Successfully parsed file <https://builds.apache.org/job/kafka-trunk-jdk8/ws/streams/build/reports/spotbugs/main.xml> with 0 unique warnings and 0 duplicates.
[FINDBUGS] Successfully parsed file <https://builds.apache.org/job/kafka-trunk-jdk8/ws/streams/examples/build/reports/spotbugs/main.xml> with 0 unique warnings and 0 duplicates.
[FINDBUGS] Successfully parsed file <https://builds.apache.org/job/kafka-trunk-jdk8/ws/streams/streams-scala/build/reports/spotbugs/main.xml> with 0 unique warnings and 0 duplicates.
[FINDBUGS] Successfully parsed file <https://builds.apache.org/job/kafka-trunk-jdk8/ws/streams/test-utils/build/reports/spotbugs/main.xml> with 0 unique warnings and 0 duplicates.
[FINDBUGS] Successfully parsed file <https://builds.apache.org/job/kafka-trunk-jdk8/ws/tools/build/reports/spotbugs/main.xml> with 0 unique warnings and 0 duplicates.
Setting GRADLE_4_8_1_HOME=/home/jenkins/tools/gradle/4.8.1
No credentials specified
Setting GRADLE_4_8_1_HOME=/home/jenkins/tools/gradle/4.8.1
<Git Blamer> Using GitBlamer to create author and commit information for all warnings.
<Git Blamer> GIT_COMMIT=d70fe5ed2d25af432ec6ce02ccfeaa40bcd2f295, workspace=<https://builds.apache.org/job/kafka-trunk-jdk8/ws/>
[FINDBUGS] Computing warning deltas based on reference build #3778
Recording test results
Setting GRADLE_4_8_1_HOME=/home/jenkins/tools/gradle/4.8.1
Setting GRADLE_4_8_1_HOME=/home/jenkins/tools/gradle/4.8.1
Not sending mail to unregistered user cshapi@gmail.com
Not sending mail to unregistered user ismael@juma.me.uk