You are viewing a plain text version of this content. The canonical link for it is here.
Posted to dev@kafka.apache.org by Apache Jenkins Server <je...@builds.apache.org> on 2020/05/19 17:27:31 UTC
Build failed in Jenkins: kafka-trunk-jdk11 #1475
See <https://builds.apache.org/job/kafka-trunk-jdk11/1475/display/redirect?page=changes>
Changes:
[github] MINOR: Small fixes in the documentation (#8623)
[github] MINOR: Update stream documentation (#8622)
------------------------------------------
[...truncated 3.09 MB...]
org.apache.kafka.streams.TopologyTestDriverTest > shouldThrowIfInMemoryBuiltInStoreIsAccessedWithUntypedMethod[Eos enabled = false] PASSED
org.apache.kafka.streams.TopologyTestDriverTest > shouldProcessFromSourcesThatMatchMultiplePattern[Eos enabled = false] STARTED
org.apache.kafka.streams.TopologyTestDriverTest > shouldProcessFromSourcesThatMatchMultiplePattern[Eos enabled = false] PASSED
org.apache.kafka.streams.TopologyTestDriverTest > shouldPopulateGlobalStore[Eos enabled = false] STARTED
org.apache.kafka.streams.TopologyTestDriverTest > shouldPopulateGlobalStore[Eos enabled = false] PASSED
org.apache.kafka.streams.TopologyTestDriverTest > shouldThrowIfPersistentBuiltInStoreIsAccessedWithUntypedMethod[Eos enabled = false] STARTED
org.apache.kafka.streams.TopologyTestDriverTest > shouldThrowIfPersistentBuiltInStoreIsAccessedWithUntypedMethod[Eos enabled = false] PASSED
org.apache.kafka.streams.TopologyTestDriverTest > shouldAllowPrePopulatingStatesStoresWithCachingEnabled[Eos enabled = false] STARTED
org.apache.kafka.streams.TopologyTestDriverTest > shouldAllowPrePopulatingStatesStoresWithCachingEnabled[Eos enabled = false] PASSED
org.apache.kafka.streams.TopologyTestDriverTest > shouldReturnCorrectPersistentStoreTypeOnly[Eos enabled = false] STARTED
org.apache.kafka.streams.TopologyTestDriverTest > shouldReturnCorrectPersistentStoreTypeOnly[Eos enabled = false] PASSED
org.apache.kafka.streams.TopologyTestDriverTest > shouldRespectTaskIdling[Eos enabled = false] STARTED
org.apache.kafka.streams.TopologyTestDriverTest > shouldRespectTaskIdling[Eos enabled = false] PASSED
org.apache.kafka.streams.TopologyTestDriverTest > shouldUseSourceSpecificDeserializers[Eos enabled = false] STARTED
org.apache.kafka.streams.TopologyTestDriverTest > shouldUseSourceSpecificDeserializers[Eos enabled = false] PASSED
org.apache.kafka.streams.TopologyTestDriverTest > shouldReturnAllStores[Eos enabled = false] STARTED
org.apache.kafka.streams.TopologyTestDriverTest > shouldReturnAllStores[Eos enabled = false] PASSED
org.apache.kafka.streams.TopologyTestDriverTest > shouldNotCreateStateDirectoryForStatelessTopology[Eos enabled = false] STARTED
org.apache.kafka.streams.TopologyTestDriverTest > shouldNotCreateStateDirectoryForStatelessTopology[Eos enabled = false] PASSED
org.apache.kafka.streams.TopologyTestDriverTest > shouldApplyGlobalUpdatesCorrectlyInRecursiveTopologies[Eos enabled = false] STARTED
org.apache.kafka.streams.TopologyTestDriverTest > shouldApplyGlobalUpdatesCorrectlyInRecursiveTopologies[Eos enabled = false] PASSED
org.apache.kafka.streams.TopologyTestDriverTest > shouldReturnAllStoresNames[Eos enabled = false] STARTED
org.apache.kafka.streams.TopologyTestDriverTest > shouldReturnAllStoresNames[Eos enabled = false] PASSED
org.apache.kafka.streams.TopologyTestDriverTest > shouldProcessConsumerRecordList[Eos enabled = false] STARTED
org.apache.kafka.streams.TopologyTestDriverTest > shouldProcessConsumerRecordList[Eos enabled = false] PASSED
org.apache.kafka.streams.TopologyTestDriverTest > shouldUseSinkSpecificSerializers[Eos enabled = false] STARTED
org.apache.kafka.streams.TopologyTestDriverTest > shouldUseSinkSpecificSerializers[Eos enabled = false] PASSED
org.apache.kafka.streams.TopologyTestDriverTest > shouldFlushStoreForFirstInput[Eos enabled = false] STARTED
org.apache.kafka.streams.TopologyTestDriverTest > shouldFlushStoreForFirstInput[Eos enabled = false] PASSED
org.apache.kafka.streams.TopologyTestDriverTest > shouldProcessFromSourceThatMatchPattern[Eos enabled = false] STARTED
org.apache.kafka.streams.TopologyTestDriverTest > shouldProcessFromSourceThatMatchPattern[Eos enabled = false] PASSED
org.apache.kafka.streams.TopologyTestDriverTest > shouldCaptureSinkTopicNamesIfWrittenInto[Eos enabled = false] STARTED
org.apache.kafka.streams.TopologyTestDriverTest > shouldCaptureSinkTopicNamesIfWrittenInto[Eos enabled = false] PASSED
org.apache.kafka.streams.TopologyTestDriverTest > shouldUpdateStoreForNewKey[Eos enabled = false] STARTED
org.apache.kafka.streams.TopologyTestDriverTest > shouldUpdateStoreForNewKey[Eos enabled = false] PASSED
org.apache.kafka.streams.TopologyTestDriverTest > shouldSendRecordViaCorrectSourceTopicDeprecated[Eos enabled = false] STARTED
org.apache.kafka.streams.TopologyTestDriverTest > shouldSendRecordViaCorrectSourceTopicDeprecated[Eos enabled = false] PASSED
org.apache.kafka.streams.TopologyTestDriverTest > shouldPunctuateOnWallClockTime[Eos enabled = false] STARTED
org.apache.kafka.streams.TopologyTestDriverTest > shouldPunctuateOnWallClockTime[Eos enabled = false] PASSED
org.apache.kafka.streams.TopologyTestDriverTest > shouldSetRecordMetadata[Eos enabled = false] STARTED
org.apache.kafka.streams.TopologyTestDriverTest > shouldSetRecordMetadata[Eos enabled = false] PASSED
org.apache.kafka.streams.TopologyTestDriverTest > shouldNotUpdateStoreForLargerValue[Eos enabled = false] STARTED
org.apache.kafka.streams.TopologyTestDriverTest > shouldNotUpdateStoreForLargerValue[Eos enabled = false] PASSED
org.apache.kafka.streams.TopologyTestDriverTest > shouldReturnCorrectInMemoryStoreTypeOnly[Eos enabled = false] STARTED
org.apache.kafka.streams.TopologyTestDriverTest > shouldReturnCorrectInMemoryStoreTypeOnly[Eos enabled = false] PASSED
org.apache.kafka.streams.TopologyTestDriverTest > shouldThrowForMissingTime[Eos enabled = false] STARTED
org.apache.kafka.streams.TopologyTestDriverTest > shouldThrowForMissingTime[Eos enabled = false] PASSED
org.apache.kafka.streams.TopologyTestDriverTest > shouldCaptureInternalTopicNamesIfWrittenInto[Eos enabled = false] STARTED
org.apache.kafka.streams.TopologyTestDriverTest > shouldCaptureInternalTopicNamesIfWrittenInto[Eos enabled = false] PASSED
org.apache.kafka.streams.TopologyTestDriverTest > shouldPunctuateOnWallClockTimeDeprecated[Eos enabled = false] STARTED
org.apache.kafka.streams.TopologyTestDriverTest > shouldPunctuateOnWallClockTimeDeprecated[Eos enabled = false] PASSED
org.apache.kafka.streams.TopologyTestDriverTest > shouldProcessRecordForTopic[Eos enabled = false] STARTED
org.apache.kafka.streams.TopologyTestDriverTest > shouldProcessRecordForTopic[Eos enabled = false] PASSED
org.apache.kafka.streams.TopologyTestDriverTest > shouldForwardRecordsFromSubtopologyToSubtopology[Eos enabled = false] STARTED
org.apache.kafka.streams.TopologyTestDriverTest > shouldForwardRecordsFromSubtopologyToSubtopology[Eos enabled = false] PASSED
org.apache.kafka.streams.TopologyTestDriverTest > shouldNotUpdateStoreForSmallerValue[Eos enabled = false] STARTED
org.apache.kafka.streams.TopologyTestDriverTest > shouldNotUpdateStoreForSmallerValue[Eos enabled = false] PASSED
org.apache.kafka.streams.TopologyTestDriverTest > shouldCreateStateDirectoryForStatefulTopology[Eos enabled = false] STARTED
org.apache.kafka.streams.TopologyTestDriverTest > shouldCreateStateDirectoryForStatefulTopology[Eos enabled = false] PASSED
org.apache.kafka.streams.TopologyTestDriverTest > shouldPunctuateIfWallClockTimeAdvances[Eos enabled = false] STARTED
org.apache.kafka.streams.TopologyTestDriverTest > shouldPunctuateIfWallClockTimeAdvances[Eos enabled = false] PASSED
> Task :streams:upgrade-system-tests-0101:spotbugsMain NO-SOURCE
> Task :streams:upgrade-system-tests-0101:test
> Task :streams:upgrade-system-tests-0102:compileJava NO-SOURCE
> Task :streams:upgrade-system-tests-0102:processResources NO-SOURCE
> Task :streams:upgrade-system-tests-0102:classes UP-TO-DATE
> Task :streams:upgrade-system-tests-0102:checkstyleMain NO-SOURCE
> Task :streams:upgrade-system-tests-0102:compileTestJava
> Task :streams:upgrade-system-tests-0102:processTestResources NO-SOURCE
> Task :streams:upgrade-system-tests-0102:testClasses
> Task :streams:upgrade-system-tests-0102:checkstyleTest
> Task :streams:upgrade-system-tests-0102:spotbugsMain NO-SOURCE
> Task :streams:upgrade-system-tests-0102:test
> Task :streams:upgrade-system-tests-0110:compileJava NO-SOURCE
> Task :streams:upgrade-system-tests-0110:processResources NO-SOURCE
> Task :streams:upgrade-system-tests-0110:classes UP-TO-DATE
> Task :streams:upgrade-system-tests-0110:checkstyleMain NO-SOURCE
> Task :streams:upgrade-system-tests-0110:compileTestJava
> Task :streams:upgrade-system-tests-0110:processTestResources NO-SOURCE
> Task :streams:upgrade-system-tests-0110:testClasses
> Task :streams:upgrade-system-tests-0110:checkstyleTest
> Task :streams:upgrade-system-tests-0110:spotbugsMain NO-SOURCE
> Task :streams:upgrade-system-tests-0110:test
> Task :streams:upgrade-system-tests-10:compileJava NO-SOURCE
> Task :streams:upgrade-system-tests-10:processResources NO-SOURCE
> Task :streams:upgrade-system-tests-10:classes UP-TO-DATE
> Task :streams:upgrade-system-tests-10:checkstyleMain NO-SOURCE
> Task :streams:upgrade-system-tests-10:compileTestJava
> Task :streams:upgrade-system-tests-10:processTestResources NO-SOURCE
> Task :streams:upgrade-system-tests-10:testClasses
> Task :streams:upgrade-system-tests-10:checkstyleTest
> Task :streams:upgrade-system-tests-10:spotbugsMain NO-SOURCE
> Task :streams:upgrade-system-tests-10:test
> Task :streams:upgrade-system-tests-11:compileJava NO-SOURCE
> Task :streams:upgrade-system-tests-11:processResources NO-SOURCE
> Task :streams:upgrade-system-tests-11:classes UP-TO-DATE
> Task :streams:upgrade-system-tests-11:checkstyleMain NO-SOURCE
> Task :streams:upgrade-system-tests-11:compileTestJava
> Task :streams:upgrade-system-tests-11:processTestResources NO-SOURCE
> Task :streams:upgrade-system-tests-11:testClasses
> Task :streams:upgrade-system-tests-11:checkstyleTest
> Task :streams:upgrade-system-tests-11:spotbugsMain NO-SOURCE
> Task :streams:upgrade-system-tests-11:test
> Task :streams:upgrade-system-tests-20:compileJava NO-SOURCE
> Task :streams:upgrade-system-tests-20:processResources NO-SOURCE
> Task :streams:upgrade-system-tests-20:classes UP-TO-DATE
> Task :streams:upgrade-system-tests-20:checkstyleMain NO-SOURCE
> Task :streams:upgrade-system-tests-20:compileTestJava
> Task :streams:upgrade-system-tests-20:processTestResources NO-SOURCE
> Task :streams:upgrade-system-tests-20:testClasses
> Task :streams:upgrade-system-tests-20:checkstyleTest
> Task :streams:upgrade-system-tests-20:spotbugsMain NO-SOURCE
> Task :streams:upgrade-system-tests-20:test
> Task :streams:upgrade-system-tests-21:compileJava NO-SOURCE
> Task :streams:upgrade-system-tests-21:processResources NO-SOURCE
> Task :streams:upgrade-system-tests-21:classes UP-TO-DATE
> Task :streams:upgrade-system-tests-21:checkstyleMain NO-SOURCE
> Task :streams:upgrade-system-tests-21:compileTestJava
> Task :streams:upgrade-system-tests-21:processTestResources NO-SOURCE
> Task :streams:upgrade-system-tests-21:testClasses
> Task :streams:upgrade-system-tests-21:checkstyleTest
> Task :streams:upgrade-system-tests-21:spotbugsMain NO-SOURCE
> Task :streams:upgrade-system-tests-21:test
> Task :streams:upgrade-system-tests-22:compileJava NO-SOURCE
> Task :streams:upgrade-system-tests-22:processResources NO-SOURCE
> Task :streams:upgrade-system-tests-22:classes UP-TO-DATE
> Task :streams:upgrade-system-tests-22:checkstyleMain NO-SOURCE
> Task :streams:upgrade-system-tests-22:compileTestJava
> Task :streams:upgrade-system-tests-22:processTestResources NO-SOURCE
> Task :streams:upgrade-system-tests-22:testClasses
> Task :streams:upgrade-system-tests-22:checkstyleTest
> Task :streams:upgrade-system-tests-22:spotbugsMain NO-SOURCE
> Task :streams:upgrade-system-tests-22:test
> Task :streams:upgrade-system-tests-23:compileJava NO-SOURCE
> Task :streams:upgrade-system-tests-23:processResources NO-SOURCE
> Task :streams:upgrade-system-tests-23:classes UP-TO-DATE
> Task :streams:upgrade-system-tests-23:checkstyleMain NO-SOURCE
> Task :streams:upgrade-system-tests-23:compileTestJava
> Task :streams:upgrade-system-tests-23:processTestResources NO-SOURCE
> Task :streams:upgrade-system-tests-23:testClasses
> Task :streams:upgrade-system-tests-23:checkstyleTest
> Task :streams:upgrade-system-tests-23:spotbugsMain NO-SOURCE
> Task :streams:upgrade-system-tests-23:test
> Task :streams:upgrade-system-tests-24:compileJava NO-SOURCE
> Task :streams:upgrade-system-tests-24:processResources NO-SOURCE
> Task :streams:upgrade-system-tests-24:classes UP-TO-DATE
> Task :streams:upgrade-system-tests-24:checkstyleMain NO-SOURCE
> Task :streams:upgrade-system-tests-24:compileTestJava
> Task :streams:upgrade-system-tests-24:processTestResources NO-SOURCE
> Task :streams:upgrade-system-tests-24:testClasses
> Task :streams:upgrade-system-tests-24:checkstyleTest
> Task :streams:upgrade-system-tests-24:spotbugsMain NO-SOURCE
> Task :streams:upgrade-system-tests-24:test
> Task :streams:upgrade-system-tests-25:compileJava NO-SOURCE
> Task :streams:upgrade-system-tests-25:processResources NO-SOURCE
> Task :streams:upgrade-system-tests-25:classes UP-TO-DATE
> Task :streams:upgrade-system-tests-25:checkstyleMain NO-SOURCE
> Task :streams:upgrade-system-tests-25:compileTestJava
> Task :streams:upgrade-system-tests-25:processTestResources NO-SOURCE
> Task :streams:upgrade-system-tests-25:testClasses
> Task :streams:upgrade-system-tests-25:checkstyleTest
> Task :streams:upgrade-system-tests-25:spotbugsMain NO-SOURCE
> Task :streams:upgrade-system-tests-25:test
FAILURE: Build failed with an exception.
* What went wrong:
Execution failed for task ':streams:test'.
> There were failing tests. See the report at: file://<https://builds.apache.org/job/kafka-trunk-jdk11/ws/streams/build/reports/tests/test/index.html>
* Try:
Run with --stacktrace option to get the stack trace. Run with --info or --debug option to get more log output. Run with --scan to get full insights.
* Get more help at https://help.gradle.org
Deprecated Gradle features were used in this build, making it incompatible with Gradle 7.0.
Use '--warning-mode all' to show the individual deprecation warnings.
See https://docs.gradle.org/6.4.1/userguide/command_line_interface.html#sec:command_line_warnings
BUILD FAILED in 2h 0m 49s
215 actionable tasks: 183 executed, 32 up-to-date
Build step 'Execute shell' marked build as failure
Recording test results
ERROR: No tool found matching GRADLE_4_10_2_HOME
Setting GRADLE_4_10_3_HOME=/home/jenkins/tools/gradle/4.10.3
ERROR: No tool found matching GRADLE_4_10_2_HOME
Setting GRADLE_4_10_3_HOME=/home/jenkins/tools/gradle/4.10.3
Not sending mail to unregistered user noreply@github.com
Jenkins build is back to normal : kafka-trunk-jdk11 #1488
Posted by Apache Jenkins Server <je...@builds.apache.org>.
See <https://builds.apache.org/job/kafka-trunk-jdk11/1488/display/redirect?page=changes>
Build failed in Jenkins: kafka-trunk-jdk11 #1487
Posted by Apache Jenkins Server <je...@builds.apache.org>.
See <https://builds.apache.org/job/kafka-trunk-jdk11/1487/display/redirect?page=changes>
Changes:
[github] KAFKA-9780: Deprecate commit records without record metadata (#8379)
------------------------------------------
[...truncated 2.11 MB...]
org.apache.kafka.streams.integration.RegexSourceIntegrationTest > testMultipleConsumersCanReadFromPartitionedTopic STARTED
org.apache.kafka.streams.integration.RegexSourceIntegrationTest > testMultipleConsumersCanReadFromPartitionedTopic PASSED
org.apache.kafka.streams.integration.RegexSourceIntegrationTest > testRegexMatchesTopicsAWhenDeleted STARTED
org.apache.kafka.streams.integration.RegexSourceIntegrationTest > testRegexMatchesTopicsAWhenDeleted PASSED
org.apache.kafka.streams.integration.RegexSourceIntegrationTest > testNoMessagesSentExceptionFromOverlappingPatterns STARTED
org.apache.kafka.streams.integration.RegexSourceIntegrationTest > testNoMessagesSentExceptionFromOverlappingPatterns PASSED
org.apache.kafka.streams.integration.RegexSourceIntegrationTest > shouldAddStateStoreToRegexDefinedSource STARTED
org.apache.kafka.streams.integration.RegexSourceIntegrationTest > shouldAddStateStoreToRegexDefinedSource PASSED
org.apache.kafka.streams.integration.InternalTopicIntegrationTest > shouldCompactTopicsForKeyValueStoreChangelogs STARTED
org.apache.kafka.streams.integration.InternalTopicIntegrationTest > shouldCompactTopicsForKeyValueStoreChangelogs PASSED
org.apache.kafka.streams.integration.InternalTopicIntegrationTest > shouldCompactAndDeleteTopicsForWindowStoreChangelogs STARTED
org.apache.kafka.streams.integration.InternalTopicIntegrationTest > shouldCompactAndDeleteTopicsForWindowStoreChangelogs PASSED
org.apache.kafka.streams.integration.EosBetaUpgradeIntegrationTest > shouldUpgradeFromEosAlphaToEosBeta[false] PASSED
org.apache.kafka.streams.integration.EosBetaUpgradeIntegrationTest > shouldUpgradeFromEosAlphaToEosBeta[true] STARTED
org.apache.kafka.streams.integration.SmokeTestDriverIntegrationTest > shouldWorkWithRebalance STARTED
Exception: java.lang.AssertionError thrown from the UncaughtExceptionHandler in thread "appDir2-StreamThread-1"
Exception: java.lang.AssertionError thrown from the UncaughtExceptionHandler in thread "appDir1-StreamThread-1"
Exception: java.lang.AssertionError thrown from the UncaughtExceptionHandler in thread "appDir2-StreamThread-1"
org.apache.kafka.streams.integration.SmokeTestDriverIntegrationTest > shouldWorkWithRebalance PASSED
org.apache.kafka.streams.integration.StreamStreamJoinIntegrationTest > testInnerRepartitioned[caching enabled = true] STARTED
org.apache.kafka.streams.integration.StreamStreamJoinIntegrationTest > testInnerRepartitioned[caching enabled = true] PASSED
org.apache.kafka.streams.integration.StreamStreamJoinIntegrationTest > testOuterRepartitioned[caching enabled = true] STARTED
org.apache.kafka.streams.integration.StreamStreamJoinIntegrationTest > testOuterRepartitioned[caching enabled = true] PASSED
org.apache.kafka.streams.integration.StreamStreamJoinIntegrationTest > shouldNotAccessJoinStoresWhenGivingName[caching enabled = true] STARTED
org.apache.kafka.streams.integration.StreamStreamJoinIntegrationTest > shouldNotAccessJoinStoresWhenGivingName[caching enabled = true] PASSED
org.apache.kafka.streams.integration.StreamStreamJoinIntegrationTest > testInner[caching enabled = true] STARTED
org.apache.kafka.streams.integration.StreamStreamJoinIntegrationTest > testInner[caching enabled = true] PASSED
org.apache.kafka.streams.integration.StreamStreamJoinIntegrationTest > testOuter[caching enabled = true] STARTED
org.apache.kafka.streams.integration.StreamStreamJoinIntegrationTest > testOuter[caching enabled = true] PASSED
org.apache.kafka.streams.integration.StreamStreamJoinIntegrationTest > testLeft[caching enabled = true] STARTED
org.apache.kafka.streams.integration.StreamStreamJoinIntegrationTest > testLeft[caching enabled = true] PASSED
org.apache.kafka.streams.integration.StreamStreamJoinIntegrationTest > testMultiInner[caching enabled = true] STARTED
org.apache.kafka.streams.integration.StreamStreamJoinIntegrationTest > testMultiInner[caching enabled = true] PASSED
org.apache.kafka.streams.integration.StreamStreamJoinIntegrationTest > testLeftRepartitioned[caching enabled = true] STARTED
org.apache.kafka.streams.integration.StreamStreamJoinIntegrationTest > testLeftRepartitioned[caching enabled = true] PASSED
org.apache.kafka.streams.integration.StreamStreamJoinIntegrationTest > testInnerRepartitioned[caching enabled = false] STARTED
org.apache.kafka.streams.integration.StreamStreamJoinIntegrationTest > testInnerRepartitioned[caching enabled = false] PASSED
org.apache.kafka.streams.integration.StreamStreamJoinIntegrationTest > testOuterRepartitioned[caching enabled = false] STARTED
org.apache.kafka.streams.integration.StreamStreamJoinIntegrationTest > testOuterRepartitioned[caching enabled = false] PASSED
org.apache.kafka.streams.integration.StreamStreamJoinIntegrationTest > shouldNotAccessJoinStoresWhenGivingName[caching enabled = false] STARTED
org.apache.kafka.streams.integration.StreamStreamJoinIntegrationTest > shouldNotAccessJoinStoresWhenGivingName[caching enabled = false] PASSED
org.apache.kafka.streams.integration.StreamStreamJoinIntegrationTest > testInner[caching enabled = false] STARTED
org.apache.kafka.streams.integration.EosBetaUpgradeIntegrationTest.shouldUpgradeFromEosAlphaToEosBeta[true] failed, log available in /home/jenkins/jenkins-slave/workspace/kafka-trunk-jdk11/streams/build/reports/testOutput/org.apache.kafka.streams.integration.EosBetaUpgradeIntegrationTest.shouldUpgradeFromEosAlphaToEosBeta[true].test.stdout
org.apache.kafka.streams.integration.EosBetaUpgradeIntegrationTest > shouldUpgradeFromEosAlphaToEosBeta[true] FAILED
java.lang.AssertionError: Did not receive all 20 records from topic multiPartitionOutputTopic within 60000 ms
Expected: is a value equal to or greater than <20>
but: <0> was less than <20>
at org.hamcrest.MatcherAssert.assertThat(MatcherAssert.java:20)
at org.apache.kafka.streams.integration.utils.IntegrationTestUtils.lambda$waitUntilMinKeyValueRecordsReceived$1(IntegrationTestUtils.java:563)
at org.apache.kafka.test.TestUtils.retryOnExceptionWithTimeout(TestUtils.java:429)
at org.apache.kafka.test.TestUtils.retryOnExceptionWithTimeout(TestUtils.java:397)
at org.apache.kafka.streams.integration.utils.IntegrationTestUtils.waitUntilMinKeyValueRecordsReceived(IntegrationTestUtils.java:559)
at org.apache.kafka.streams.integration.utils.IntegrationTestUtils.waitUntilMinKeyValueRecordsReceived(IntegrationTestUtils.java:530)
at org.apache.kafka.streams.integration.EosBetaUpgradeIntegrationTest.readResult(EosBetaUpgradeIntegrationTest.java:973)
at org.apache.kafka.streams.integration.EosBetaUpgradeIntegrationTest.verifyCommitted(EosBetaUpgradeIntegrationTest.java:961)
at org.apache.kafka.streams.integration.EosBetaUpgradeIntegrationTest.shouldUpgradeFromEosAlphaToEosBeta(EosBetaUpgradeIntegrationTest.java:759)
org.apache.kafka.streams.integration.StreamStreamJoinIntegrationTest > testInner[caching enabled = false] PASSED
org.apache.kafka.streams.integration.StreamStreamJoinIntegrationTest > testOuter[caching enabled = false] STARTED
org.apache.kafka.streams.integration.StreamStreamJoinIntegrationTest > testOuter[caching enabled = false] PASSED
org.apache.kafka.streams.integration.StreamStreamJoinIntegrationTest > testLeft[caching enabled = false] STARTED
org.apache.kafka.streams.integration.StreamStreamJoinIntegrationTest > testLeft[caching enabled = false] PASSED
org.apache.kafka.streams.integration.StreamStreamJoinIntegrationTest > testMultiInner[caching enabled = false] STARTED
org.apache.kafka.streams.integration.KStreamTransformIntegrationTest > shouldFlatTransform STARTED
org.apache.kafka.streams.integration.KStreamTransformIntegrationTest > shouldFlatTransform PASSED
org.apache.kafka.streams.integration.KStreamTransformIntegrationTest > shouldFlatTransformValuesWithValueTransformerWithoutKey STARTED
org.apache.kafka.streams.integration.StreamStreamJoinIntegrationTest > testMultiInner[caching enabled = false] PASSED
org.apache.kafka.streams.integration.StreamStreamJoinIntegrationTest > testLeftRepartitioned[caching enabled = false] STARTED
org.apache.kafka.streams.integration.KStreamTransformIntegrationTest > shouldFlatTransformValuesWithValueTransformerWithoutKey PASSED
org.apache.kafka.streams.integration.KStreamTransformIntegrationTest > shouldFlatTransformValuesWithKey STARTED
org.apache.kafka.streams.integration.KStreamTransformIntegrationTest > shouldFlatTransformValuesWithKey PASSED
org.apache.kafka.streams.integration.KStreamTransformIntegrationTest > shouldTransform STARTED
org.apache.kafka.streams.integration.KStreamTransformIntegrationTest > shouldTransform PASSED
org.apache.kafka.streams.integration.KStreamTransformIntegrationTest > shouldTransformValuesWithValueTransformerWithKey STARTED
org.apache.kafka.streams.integration.StreamStreamJoinIntegrationTest > testLeftRepartitioned[caching enabled = false] PASSED
org.apache.kafka.streams.integration.EOSUncleanShutdownIntegrationTest > shouldWorkWithUncleanShutdownWipeOutStateStore[exactly_once] STARTED
org.apache.kafka.streams.integration.KStreamTransformIntegrationTest > shouldTransformValuesWithValueTransformerWithKey PASSED
org.apache.kafka.streams.integration.KStreamTransformIntegrationTest > shouldTransformValuesWithValueTransformerWithoutKey STARTED
org.apache.kafka.streams.integration.KStreamTransformIntegrationTest > shouldTransformValuesWithValueTransformerWithoutKey PASSED
org.apache.kafka.streams.integration.FineGrainedAutoResetIntegrationTest > shouldOnlyReadRecordsWhereEarliestSpecifiedWithNoCommittedOffsetsWithGlobalAutoOffsetResetLatest STARTED
org.apache.kafka.streams.integration.FineGrainedAutoResetIntegrationTest > shouldOnlyReadRecordsWhereEarliestSpecifiedWithNoCommittedOffsetsWithGlobalAutoOffsetResetLatest PASSED
org.apache.kafka.streams.integration.FineGrainedAutoResetIntegrationTest > shouldThrowExceptionOverlappingPattern STARTED
org.apache.kafka.streams.integration.FineGrainedAutoResetIntegrationTest > shouldThrowExceptionOverlappingPattern PASSED
org.apache.kafka.streams.integration.FineGrainedAutoResetIntegrationTest > shouldThrowExceptionOverlappingTopic STARTED
org.apache.kafka.streams.integration.FineGrainedAutoResetIntegrationTest > shouldThrowExceptionOverlappingTopic PASSED
org.apache.kafka.streams.integration.FineGrainedAutoResetIntegrationTest > shouldOnlyReadRecordsWhereEarliestSpecifiedWithInvalidCommittedOffsets STARTED
org.apache.kafka.streams.integration.EOSUncleanShutdownIntegrationTest > shouldWorkWithUncleanShutdownWipeOutStateStore[exactly_once] PASSED
org.apache.kafka.streams.integration.EOSUncleanShutdownIntegrationTest > shouldWorkWithUncleanShutdownWipeOutStateStore[exactly_once_beta] STARTED
org.apache.kafka.streams.integration.EOSUncleanShutdownIntegrationTest > shouldWorkWithUncleanShutdownWipeOutStateStore[exactly_once_beta] PASSED
org.apache.kafka.streams.integration.FineGrainedAutoResetIntegrationTest > shouldOnlyReadRecordsWhereEarliestSpecifiedWithInvalidCommittedOffsets PASSED
org.apache.kafka.streams.integration.FineGrainedAutoResetIntegrationTest > shouldOnlyReadRecordsWhereEarliestSpecifiedWithNoCommittedOffsetsWithDefaultGlobalAutoOffsetResetEarliest STARTED
org.apache.kafka.streams.integration.GlobalKTableIntegrationTest > shouldGetToRunningWithOnlyGlobalTopology STARTED
org.apache.kafka.streams.integration.GlobalKTableIntegrationTest > shouldGetToRunningWithOnlyGlobalTopology PASSED
org.apache.kafka.streams.integration.GlobalKTableIntegrationTest > shouldKStreamGlobalKTableLeftJoin STARTED
org.apache.kafka.streams.integration.FineGrainedAutoResetIntegrationTest > shouldOnlyReadRecordsWhereEarliestSpecifiedWithNoCommittedOffsetsWithDefaultGlobalAutoOffsetResetEarliest PASSED
org.apache.kafka.streams.integration.FineGrainedAutoResetIntegrationTest > shouldThrowStreamsExceptionNoResetSpecified STARTED
org.apache.kafka.streams.integration.FineGrainedAutoResetIntegrationTest > shouldThrowStreamsExceptionNoResetSpecified PASSED
org.apache.kafka.streams.integration.GlobalKTableIntegrationTest > shouldKStreamGlobalKTableLeftJoin PASSED
org.apache.kafka.streams.integration.GlobalKTableIntegrationTest > shouldRestoreGlobalInMemoryKTableOnRestart STARTED
FATAL: command execution failed
java.io.EOFException
at java.io.ObjectInputStream$PeekInputStream.readFully(ObjectInputStream.java:2681)
at java.io.ObjectInputStream$BlockDataInputStream.readShort(ObjectInputStream.java:3156)
at java.io.ObjectInputStream.readStreamHeader(ObjectInputStream.java:862)
at java.io.ObjectInputStream.<init>(ObjectInputStream.java:358)
at hudson.remoting.ObjectInputStreamEx.<init>(ObjectInputStreamEx.java:49)
at hudson.remoting.Command.readFrom(Command.java:140)
at hudson.remoting.Command.readFrom(Command.java:126)
at hudson.remoting.AbstractSynchronousByteArrayCommandTransport.read(AbstractSynchronousByteArrayCommandTransport.java:36)
at hudson.remoting.SynchronousCommandTransport$ReaderThread.run(SynchronousCommandTransport.java:63)
Caused: java.io.IOException: Unexpected termination of the channel
at hudson.remoting.SynchronousCommandTransport$ReaderThread.run(SynchronousCommandTransport.java:77)
Caused: java.io.IOException: Backing channel 'H30' is disconnected.
at hudson.remoting.RemoteInvocationHandler.channelOrFail(RemoteInvocationHandler.java:214)
at hudson.remoting.RemoteInvocationHandler.invoke(RemoteInvocationHandler.java:283)
at com.sun.proxy.$Proxy141.isAlive(Unknown Source)
at hudson.Launcher$RemoteLauncher$ProcImpl.isAlive(Launcher.java:1150)
at hudson.Launcher$RemoteLauncher$ProcImpl.join(Launcher.java:1142)
at hudson.tasks.CommandInterpreter.join(CommandInterpreter.java:155)
at hudson.tasks.CommandInterpreter.perform(CommandInterpreter.java:109)
at hudson.tasks.CommandInterpreter.perform(CommandInterpreter.java:66)
at hudson.tasks.BuildStepMonitor$1.perform(BuildStepMonitor.java:20)
at hudson.model.AbstractBuild$AbstractBuildExecution.perform(AbstractBuild.java:741)
at hudson.model.Build$BuildExecution.build(Build.java:206)
at hudson.model.Build$BuildExecution.doRun(Build.java:163)
at hudson.model.AbstractBuild$AbstractBuildExecution.run(AbstractBuild.java:504)
at hudson.model.Run.execute(Run.java:1815)
at hudson.model.FreeStyleBuild.run(FreeStyleBuild.java:43)
at hudson.model.ResourceController.execute(ResourceController.java:97)
at hudson.model.Executor.run(Executor.java:429)
FATAL: Unable to delete script file /tmp/jenkins6711273375852689163.sh
java.io.EOFException
at java.io.ObjectInputStream$PeekInputStream.readFully(ObjectInputStream.java:2681)
at java.io.ObjectInputStream$BlockDataInputStream.readShort(ObjectInputStream.java:3156)
at java.io.ObjectInputStream.readStreamHeader(ObjectInputStream.java:862)
at java.io.ObjectInputStream.<init>(ObjectInputStream.java:358)
at hudson.remoting.ObjectInputStreamEx.<init>(ObjectInputStreamEx.java:49)
at hudson.remoting.Command.readFrom(Command.java:140)
at hudson.remoting.Command.readFrom(Command.java:126)
at hudson.remoting.AbstractSynchronousByteArrayCommandTransport.read(AbstractSynchronousByteArrayCommandTransport.java:36)
at hudson.remoting.SynchronousCommandTransport$ReaderThread.run(SynchronousCommandTransport.java:63)
Caused: java.io.IOException: Unexpected termination of the channel
at hudson.remoting.SynchronousCommandTransport$ReaderThread.run(SynchronousCommandTransport.java:77)
Caused: hudson.remoting.ChannelClosedException: Channel "unknown": Remote call on H30 failed. The channel is closing down or has closed down
at hudson.remoting.Channel.call(Channel.java:950)
at hudson.FilePath.act(FilePath.java:1072)
at hudson.FilePath.act(FilePath.java:1061)
at hudson.FilePath.delete(FilePath.java:1542)
at hudson.tasks.CommandInterpreter.perform(CommandInterpreter.java:123)
at hudson.tasks.CommandInterpreter.perform(CommandInterpreter.java:66)
at hudson.tasks.BuildStepMonitor$1.perform(BuildStepMonitor.java:20)
at hudson.model.AbstractBuild$AbstractBuildExecution.perform(AbstractBuild.java:741)
at hudson.model.Build$BuildExecution.build(Build.java:206)
at hudson.model.Build$BuildExecution.doRun(Build.java:163)
at hudson.model.AbstractBuild$AbstractBuildExecution.run(AbstractBuild.java:504)
at hudson.model.Run.execute(Run.java:1815)
at hudson.model.FreeStyleBuild.run(FreeStyleBuild.java:43)
at hudson.model.ResourceController.execute(ResourceController.java:97)
at hudson.model.Executor.run(Executor.java:429)
Build step 'Execute shell' marked build as failure
ERROR: Step ?Publish JUnit test result report? failed: no workspace for kafka-trunk-jdk11 #1487
ERROR: H30 is offline; cannot locate JDK 11 (latest)
ERROR: No tool found matching GRADLE_4_10_2_HOME
ERROR: H30 is offline; cannot locate Gradle 4.10.3
Setting GRADLE_4_10_3_HOME=/home/jenkins/tools/gradle/4.10.3
Not sending mail to unregistered user noreply@github.com
Build failed in Jenkins: kafka-trunk-jdk11 #1486
Posted by Apache Jenkins Server <je...@builds.apache.org>.
See <https://builds.apache.org/job/kafka-trunk-jdk11/1486/display/redirect?page=changes>
Changes:
[github] MINOR: Deploy VerifiableClient in constructor to avoid test timeouts
------------------------------------------
[...truncated 3.10 MB...]
org.apache.kafka.streams.TestTopicsTest > testEmptyTopic PASSED
org.apache.kafka.streams.TestTopicsTest > testStartTimestamp STARTED
org.apache.kafka.streams.TestTopicsTest > testStartTimestamp PASSED
org.apache.kafka.streams.TestTopicsTest > testNegativeAdvance STARTED
org.apache.kafka.streams.TestTopicsTest > testNegativeAdvance PASSED
org.apache.kafka.streams.TestTopicsTest > shouldNotAllowToCreateWithNullDriver STARTED
org.apache.kafka.streams.TestTopicsTest > shouldNotAllowToCreateWithNullDriver PASSED
org.apache.kafka.streams.TestTopicsTest > testDuration STARTED
org.apache.kafka.streams.TestTopicsTest > testDuration PASSED
org.apache.kafka.streams.TestTopicsTest > testOutputToString STARTED
org.apache.kafka.streams.TestTopicsTest > testOutputToString PASSED
org.apache.kafka.streams.TestTopicsTest > testValue STARTED
org.apache.kafka.streams.TestTopicsTest > testValue PASSED
org.apache.kafka.streams.TestTopicsTest > testTimestampAutoAdvance STARTED
org.apache.kafka.streams.TestTopicsTest > testTimestampAutoAdvance PASSED
org.apache.kafka.streams.TestTopicsTest > testOutputWrongSerde STARTED
org.apache.kafka.streams.TestTopicsTest > testOutputWrongSerde PASSED
org.apache.kafka.streams.TestTopicsTest > shouldNotAllowToCreateOutputTopicWithNullTopicName STARTED
org.apache.kafka.streams.TestTopicsTest > shouldNotAllowToCreateOutputTopicWithNullTopicName PASSED
org.apache.kafka.streams.TestTopicsTest > testWrongSerde STARTED
org.apache.kafka.streams.TestTopicsTest > testWrongSerde PASSED
org.apache.kafka.streams.TestTopicsTest > testKeyValuesToMapWithNull STARTED
org.apache.kafka.streams.TestTopicsTest > testKeyValuesToMapWithNull PASSED
org.apache.kafka.streams.TestTopicsTest > testNonExistingOutputTopic STARTED
org.apache.kafka.streams.TestTopicsTest > testNonExistingOutputTopic PASSED
org.apache.kafka.streams.TestTopicsTest > testMultipleTopics STARTED
org.apache.kafka.streams.TestTopicsTest > testMultipleTopics PASSED
org.apache.kafka.streams.TestTopicsTest > testKeyValueList STARTED
org.apache.kafka.streams.TestTopicsTest > testKeyValueList PASSED
org.apache.kafka.streams.TestTopicsTest > shouldNotAllowToCreateOutputWithNullDriver STARTED
org.apache.kafka.streams.TestTopicsTest > shouldNotAllowToCreateOutputWithNullDriver PASSED
org.apache.kafka.streams.TestTopicsTest > testValueList STARTED
org.apache.kafka.streams.TestTopicsTest > testValueList PASSED
org.apache.kafka.streams.TestTopicsTest > testRecordList STARTED
org.apache.kafka.streams.TestTopicsTest > testRecordList PASSED
org.apache.kafka.streams.TestTopicsTest > testNonExistingInputTopic STARTED
org.apache.kafka.streams.TestTopicsTest > testNonExistingInputTopic PASSED
org.apache.kafka.streams.TestTopicsTest > testKeyValuesToMap STARTED
org.apache.kafka.streams.TestTopicsTest > testKeyValuesToMap PASSED
org.apache.kafka.streams.TestTopicsTest > testRecordsToList STARTED
org.apache.kafka.streams.TestTopicsTest > testRecordsToList PASSED
org.apache.kafka.streams.TestTopicsTest > testKeyValueListDuration STARTED
org.apache.kafka.streams.TestTopicsTest > testKeyValueListDuration PASSED
org.apache.kafka.streams.TestTopicsTest > testInputToString STARTED
org.apache.kafka.streams.TestTopicsTest > testInputToString PASSED
org.apache.kafka.streams.TestTopicsTest > testTimestamp STARTED
org.apache.kafka.streams.TestTopicsTest > testTimestamp PASSED
org.apache.kafka.streams.TestTopicsTest > testWithHeaders STARTED
org.apache.kafka.streams.TestTopicsTest > testWithHeaders PASSED
org.apache.kafka.streams.TestTopicsTest > testKeyValue STARTED
org.apache.kafka.streams.TestTopicsTest > testKeyValue PASSED
org.apache.kafka.streams.TestTopicsTest > shouldNotAllowToCreateTopicWithNullTopicName STARTED
org.apache.kafka.streams.TestTopicsTest > shouldNotAllowToCreateTopicWithNullTopicName PASSED
> Task :streams:upgrade-system-tests-0100:classes UP-TO-DATE
> Task :streams:upgrade-system-tests-0100:checkstyleMain NO-SOURCE
> Task :streams:upgrade-system-tests-0100:compileTestJava
> Task :streams:upgrade-system-tests-0100:processTestResources NO-SOURCE
> Task :streams:upgrade-system-tests-0100:testClasses
> Task :streams:upgrade-system-tests-0100:checkstyleTest
> Task :streams:upgrade-system-tests-0100:spotbugsMain NO-SOURCE
> Task :streams:upgrade-system-tests-0100:test
> Task :streams:upgrade-system-tests-0101:compileJava NO-SOURCE
> Task :streams:upgrade-system-tests-0101:processResources NO-SOURCE
> Task :streams:upgrade-system-tests-0101:classes UP-TO-DATE
> Task :streams:upgrade-system-tests-0101:checkstyleMain NO-SOURCE
> Task :streams:upgrade-system-tests-0101:compileTestJava
> Task :streams:upgrade-system-tests-0101:processTestResources NO-SOURCE
> Task :streams:upgrade-system-tests-0101:testClasses
> Task :streams:upgrade-system-tests-0101:checkstyleTest
> Task :streams:upgrade-system-tests-0101:spotbugsMain NO-SOURCE
> Task :streams:upgrade-system-tests-0101:test
> Task :streams:upgrade-system-tests-0102:compileJava NO-SOURCE
> Task :streams:upgrade-system-tests-0102:processResources NO-SOURCE
> Task :streams:upgrade-system-tests-0102:classes UP-TO-DATE
> Task :streams:upgrade-system-tests-0102:checkstyleMain NO-SOURCE
> Task :streams:upgrade-system-tests-0102:compileTestJava
> Task :streams:upgrade-system-tests-0102:processTestResources NO-SOURCE
> Task :streams:upgrade-system-tests-0102:testClasses
> Task :streams:upgrade-system-tests-0102:checkstyleTest
> Task :streams:upgrade-system-tests-0102:spotbugsMain NO-SOURCE
> Task :streams:upgrade-system-tests-0102:test
> Task :streams:upgrade-system-tests-0110:compileJava NO-SOURCE
> Task :streams:upgrade-system-tests-0110:processResources NO-SOURCE
> Task :streams:upgrade-system-tests-0110:classes UP-TO-DATE
> Task :streams:upgrade-system-tests-0110:checkstyleMain NO-SOURCE
> Task :streams:upgrade-system-tests-0110:compileTestJava
> Task :streams:upgrade-system-tests-0110:processTestResources NO-SOURCE
> Task :streams:upgrade-system-tests-0110:testClasses
> Task :streams:upgrade-system-tests-0110:checkstyleTest
> Task :streams:upgrade-system-tests-0110:spotbugsMain NO-SOURCE
> Task :streams:upgrade-system-tests-0110:test
> Task :streams:upgrade-system-tests-10:compileJava NO-SOURCE
> Task :streams:upgrade-system-tests-10:processResources NO-SOURCE
> Task :streams:upgrade-system-tests-10:classes UP-TO-DATE
> Task :streams:upgrade-system-tests-10:checkstyleMain NO-SOURCE
> Task :streams:upgrade-system-tests-10:compileTestJava
> Task :streams:upgrade-system-tests-10:processTestResources NO-SOURCE
> Task :streams:upgrade-system-tests-10:testClasses
> Task :streams:upgrade-system-tests-10:checkstyleTest
> Task :streams:upgrade-system-tests-10:spotbugsMain NO-SOURCE
> Task :streams:upgrade-system-tests-10:test
> Task :streams:upgrade-system-tests-11:compileJava NO-SOURCE
> Task :streams:upgrade-system-tests-11:processResources NO-SOURCE
> Task :streams:upgrade-system-tests-11:classes UP-TO-DATE
> Task :streams:upgrade-system-tests-11:checkstyleMain NO-SOURCE
> Task :streams:upgrade-system-tests-11:compileTestJava
> Task :streams:upgrade-system-tests-11:processTestResources NO-SOURCE
> Task :streams:upgrade-system-tests-11:testClasses
> Task :streams:upgrade-system-tests-11:checkstyleTest
> Task :streams:upgrade-system-tests-11:spotbugsMain NO-SOURCE
> Task :streams:upgrade-system-tests-11:test
> Task :streams:upgrade-system-tests-20:compileJava NO-SOURCE
> Task :streams:upgrade-system-tests-20:processResources NO-SOURCE
> Task :streams:upgrade-system-tests-20:classes UP-TO-DATE
> Task :streams:upgrade-system-tests-20:checkstyleMain NO-SOURCE
> Task :streams:upgrade-system-tests-20:compileTestJava
> Task :streams:upgrade-system-tests-20:processTestResources NO-SOURCE
> Task :streams:upgrade-system-tests-20:testClasses
> Task :streams:upgrade-system-tests-20:checkstyleTest
> Task :streams:upgrade-system-tests-20:spotbugsMain NO-SOURCE
> Task :streams:upgrade-system-tests-20:test
> Task :streams:upgrade-system-tests-21:compileJava NO-SOURCE
> Task :streams:upgrade-system-tests-21:processResources NO-SOURCE
> Task :streams:upgrade-system-tests-21:classes UP-TO-DATE
> Task :streams:upgrade-system-tests-21:checkstyleMain NO-SOURCE
> Task :streams:upgrade-system-tests-21:compileTestJava
> Task :streams:upgrade-system-tests-21:processTestResources NO-SOURCE
> Task :streams:upgrade-system-tests-21:testClasses
> Task :streams:upgrade-system-tests-21:checkstyleTest
> Task :streams:upgrade-system-tests-21:spotbugsMain NO-SOURCE
> Task :streams:upgrade-system-tests-21:test
> Task :streams:upgrade-system-tests-22:compileJava NO-SOURCE
> Task :streams:upgrade-system-tests-22:processResources NO-SOURCE
> Task :streams:upgrade-system-tests-22:classes UP-TO-DATE
> Task :streams:upgrade-system-tests-22:checkstyleMain NO-SOURCE
> Task :streams:upgrade-system-tests-22:compileTestJava
> Task :streams:upgrade-system-tests-22:processTestResources NO-SOURCE
> Task :streams:upgrade-system-tests-22:testClasses
> Task :streams:upgrade-system-tests-22:checkstyleTest
> Task :streams:upgrade-system-tests-22:spotbugsMain NO-SOURCE
> Task :streams:upgrade-system-tests-22:test
> Task :streams:upgrade-system-tests-23:compileJava NO-SOURCE
> Task :streams:upgrade-system-tests-23:processResources NO-SOURCE
> Task :streams:upgrade-system-tests-23:classes UP-TO-DATE
> Task :streams:upgrade-system-tests-23:checkstyleMain NO-SOURCE
> Task :streams:upgrade-system-tests-23:compileTestJava
> Task :streams:upgrade-system-tests-23:processTestResources NO-SOURCE
> Task :streams:upgrade-system-tests-23:testClasses
> Task :streams:upgrade-system-tests-23:checkstyleTest
> Task :streams:upgrade-system-tests-23:spotbugsMain NO-SOURCE
> Task :streams:upgrade-system-tests-23:test
> Task :streams:upgrade-system-tests-24:compileJava NO-SOURCE
> Task :streams:upgrade-system-tests-24:processResources NO-SOURCE
> Task :streams:upgrade-system-tests-24:classes UP-TO-DATE
> Task :streams:upgrade-system-tests-24:checkstyleMain NO-SOURCE
> Task :streams:upgrade-system-tests-24:compileTestJava
> Task :streams:upgrade-system-tests-24:processTestResources NO-SOURCE
> Task :streams:upgrade-system-tests-24:testClasses
> Task :streams:upgrade-system-tests-24:checkstyleTest
> Task :streams:upgrade-system-tests-24:spotbugsMain NO-SOURCE
> Task :streams:upgrade-system-tests-24:test
> Task :streams:upgrade-system-tests-25:compileJava NO-SOURCE
> Task :streams:upgrade-system-tests-25:processResources NO-SOURCE
> Task :streams:upgrade-system-tests-25:classes UP-TO-DATE
> Task :streams:upgrade-system-tests-25:checkstyleMain NO-SOURCE
> Task :streams:upgrade-system-tests-25:compileTestJava
> Task :streams:upgrade-system-tests-25:processTestResources NO-SOURCE
> Task :streams:upgrade-system-tests-25:testClasses
> Task :streams:upgrade-system-tests-25:checkstyleTest
> Task :streams:upgrade-system-tests-25:spotbugsMain NO-SOURCE
> Task :streams:upgrade-system-tests-25:test
FAILURE: Build failed with an exception.
* What went wrong:
Execution failed for task ':streams:test'.
> There were failing tests. See the report at: file://<https://builds.apache.org/job/kafka-trunk-jdk11/ws/streams/build/reports/tests/test/index.html>
* Try:
Run with --stacktrace option to get the stack trace. Run with --info or --debug option to get more log output. Run with --scan to get full insights.
* Get more help at https://help.gradle.org
Deprecated Gradle features were used in this build, making it incompatible with Gradle 7.0.
Use '--warning-mode all' to show the individual deprecation warnings.
See https://docs.gradle.org/6.4.1/userguide/command_line_interface.html#sec:command_line_warnings
BUILD FAILED in 1h 57m 24s
215 actionable tasks: 183 executed, 32 up-to-date
Build step 'Execute shell' marked build as failure
Recording test results
ERROR: No tool found matching GRADLE_4_10_2_HOME
Setting GRADLE_4_10_3_HOME=/home/jenkins/tools/gradle/4.10.3
ERROR: No tool found matching GRADLE_4_10_2_HOME
Setting GRADLE_4_10_3_HOME=/home/jenkins/tools/gradle/4.10.3
Not sending mail to unregistered user noreply@github.com
Build failed in Jenkins: kafka-trunk-jdk11 #1485
Posted by Apache Jenkins Server <je...@builds.apache.org>.
See <https://builds.apache.org/job/kafka-trunk-jdk11/1485/display/redirect?page=changes>
Changes:
[github] MINOR: Correct MirrorMaker2 integration test configs for Connect
[github] MINOR: Added unit tests for ConnectionQuotas (#8650)
------------------------------------------
[...truncated 1.58 MB...]
kafka.utils.json.JsonValueTest > testJsonObjectApply STARTED
kafka.utils.json.JsonValueTest > testJsonObjectApply PASSED
kafka.utils.json.JsonValueTest > testDecodeBoolean STARTED
kafka.utils.json.JsonValueTest > testDecodeBoolean PASSED
kafka.utils.PasswordEncoderTest > testEncoderConfigChange STARTED
kafka.utils.PasswordEncoderTest > testEncoderConfigChange PASSED
kafka.utils.PasswordEncoderTest > testEncodeDecodeAlgorithms STARTED
kafka.utils.PasswordEncoderTest > testEncodeDecodeAlgorithms PASSED
kafka.utils.PasswordEncoderTest > testEncodeDecode STARTED
kafka.utils.PasswordEncoderTest > testEncodeDecode PASSED
kafka.utils.timer.TimerTest > testAlreadyExpiredTask STARTED
kafka.utils.timer.TimerTest > testAlreadyExpiredTask PASSED
kafka.utils.timer.TimerTest > testTaskExpiration STARTED
kafka.admin.DeleteTopicTest > testDeleteTopicAlreadyMarkedAsDeleted PASSED
kafka.admin.DeleteTopicTest > testIncreasePartitionCountDuringDeleteTopic STARTED
kafka.utils.timer.TimerTest > testTaskExpiration PASSED
kafka.utils.ReplicationUtilsTest > testUpdateLeaderAndIsr STARTED
kafka.utils.ReplicationUtilsTest > testUpdateLeaderAndIsr PASSED
kafka.utils.SchedulerTest > testMockSchedulerNonPeriodicTask STARTED
kafka.utils.SchedulerTest > testMockSchedulerNonPeriodicTask PASSED
kafka.utils.SchedulerTest > testUnscheduleProducerTask STARTED
kafka.utils.SchedulerTest > testUnscheduleProducerTask PASSED
kafka.utils.SchedulerTest > testMockSchedulerPeriodicTask STARTED
kafka.utils.SchedulerTest > testMockSchedulerPeriodicTask PASSED
kafka.utils.SchedulerTest > testNonPeriodicTask STARTED
kafka.utils.SchedulerTest > testNonPeriodicTask PASSED
kafka.utils.SchedulerTest > testRestart STARTED
kafka.utils.SchedulerTest > testRestart PASSED
kafka.utils.SchedulerTest > testReentrantTaskInMockScheduler STARTED
kafka.utils.SchedulerTest > testReentrantTaskInMockScheduler PASSED
kafka.utils.SchedulerTest > testMockSchedulerLocking STARTED
kafka.utils.SchedulerTest > testMockSchedulerLocking PASSED
kafka.utils.SchedulerTest > testPeriodicTask STARTED
kafka.utils.SchedulerTest > testPeriodicTask PASSED
kafka.utils.CommandLineUtilsTest > testParseEmptyArg STARTED
kafka.utils.CommandLineUtilsTest > testParseEmptyArg PASSED
kafka.utils.CommandLineUtilsTest > testMaybeMergeOptionsOverwriteExisting STARTED
kafka.utils.CommandLineUtilsTest > testMaybeMergeOptionsOverwriteExisting PASSED
kafka.utils.CommandLineUtilsTest > testParseSingleArg STARTED
kafka.utils.CommandLineUtilsTest > testParseSingleArg PASSED
kafka.utils.CommandLineUtilsTest > testParseArgs STARTED
kafka.utils.CommandLineUtilsTest > testParseArgs PASSED
kafka.utils.CommandLineUtilsTest > testParseArgsWithMultipleDelimiters STARTED
kafka.utils.CommandLineUtilsTest > testParseArgsWithMultipleDelimiters PASSED
kafka.utils.CommandLineUtilsTest > testMaybeMergeOptionsDefaultValueIfNotExist STARTED
kafka.utils.CommandLineUtilsTest > testMaybeMergeOptionsDefaultValueIfNotExist PASSED
kafka.utils.CommandLineUtilsTest > testParseEmptyArgWithNoDelimiter STARTED
kafka.utils.CommandLineUtilsTest > testParseEmptyArgWithNoDelimiter PASSED
kafka.utils.CommandLineUtilsTest > testMaybeMergeOptionsDefaultOverwriteExisting STARTED
kafka.utils.CommandLineUtilsTest > testMaybeMergeOptionsDefaultOverwriteExisting PASSED
kafka.utils.CommandLineUtilsTest > testParseEmptyArgAsValid STARTED
kafka.utils.CommandLineUtilsTest > testParseEmptyArgAsValid PASSED
kafka.utils.CommandLineUtilsTest > testMaybeMergeOptionsNotOverwriteExisting STARTED
kafka.utils.CommandLineUtilsTest > testMaybeMergeOptionsNotOverwriteExisting PASSED
kafka.server.checkpoints.OffsetCheckpointFileTest > shouldReturnEmptyMapForEmptyFile STARTED
kafka.server.checkpoints.OffsetCheckpointFileTest > shouldReturnEmptyMapForEmptyFile PASSED
kafka.server.checkpoints.OffsetCheckpointFileTest > shouldThrowIfVersionIsNotRecognised STARTED
kafka.server.checkpoints.OffsetCheckpointFileTest > shouldThrowIfVersionIsNotRecognised PASSED
kafka.server.checkpoints.OffsetCheckpointFileTest > testLazyOffsetCheckpointFileInvalidLogDir STARTED
kafka.server.checkpoints.OffsetCheckpointFileTest > testLazyOffsetCheckpointFileInvalidLogDir PASSED
kafka.server.checkpoints.OffsetCheckpointFileTest > shouldPersistAndOverwriteAndReloadFile STARTED
kafka.server.checkpoints.OffsetCheckpointFileTest > shouldPersistAndOverwriteAndReloadFile PASSED
kafka.server.checkpoints.OffsetCheckpointFileTest > shouldHandleMultipleLines STARTED
kafka.server.checkpoints.OffsetCheckpointFileTest > shouldHandleMultipleLines PASSED
kafka.server.checkpoints.OffsetCheckpointFileTest > testLazyOffsetCheckpoint STARTED
kafka.server.checkpoints.OffsetCheckpointFileTest > testLazyOffsetCheckpoint PASSED
kafka.server.epoch.OffsetsForLeaderEpochTest > shouldGetEpochsFromReplica STARTED
kafka.server.epoch.OffsetsForLeaderEpochTest > shouldGetEpochsFromReplica PASSED
kafka.server.epoch.OffsetsForLeaderEpochTest > shouldReturnUnknownTopicOrPartitionIfThrown STARTED
kafka.server.epoch.OffsetsForLeaderEpochTest > shouldReturnUnknownTopicOrPartitionIfThrown PASSED
kafka.server.epoch.OffsetsForLeaderEpochTest > shouldReturnNoLeaderForPartitionIfThrown STARTED
kafka.server.epoch.OffsetsForLeaderEpochTest > shouldReturnNoLeaderForPartitionIfThrown PASSED
kafka.server.epoch.EpochDrivenReplicationProtocolAcceptanceTest > shouldSurviveFastLeaderChange STARTED
kafka.admin.DeleteTopicTest > testIncreasePartitionCountDuringDeleteTopic PASSED
kafka.admin.DeleteTopicTest > testPartitionReassignmentDuringDeleteTopic STARTED
kafka.admin.DeleteTopicTest > testPartitionReassignmentDuringDeleteTopic PASSED
kafka.admin.DeleteTopicTest > testDeleteNonExistingTopic STARTED
kafka.admin.DeleteTopicTest > testDeleteNonExistingTopic PASSED
kafka.admin.DeleteTopicTest > testRecreateTopicAfterDeletion STARTED
kafka.admin.DeleteTopicTest > testRecreateTopicAfterDeletion PASSED
kafka.admin.DeleteTopicTest > testDisableDeleteTopic STARTED
kafka.admin.DeleteTopicTest > testDisableDeleteTopic PASSED
kafka.admin.DeleteTopicTest > testAddPartitionDuringDeleteTopic STARTED
kafka.admin.DeleteTopicTest > testAddPartitionDuringDeleteTopic PASSED
kafka.admin.DeleteTopicTest > testDeleteTopicWithAllAliveReplicas STARTED
kafka.admin.DeleteTopicTest > testDeleteTopicWithAllAliveReplicas PASSED
kafka.admin.DeleteTopicTest > testDeleteTopicDuringAddPartition STARTED
kafka.server.epoch.EpochDrivenReplicationProtocolAcceptanceTest > shouldSurviveFastLeaderChange PASSED
kafka.server.epoch.EpochDrivenReplicationProtocolAcceptanceTest > offsetsShouldNotGoBackwards STARTED
kafka.admin.DeleteTopicTest > testDeleteTopicDuringAddPartition PASSED
kafka.admin.DeleteTopicTest > testDeletingPartiallyDeletedTopic STARTED
FATAL: command execution failed
java.io.EOFException
at java.io.ObjectInputStream$PeekInputStream.readFully(ObjectInputStream.java:2681)
at java.io.ObjectInputStream$BlockDataInputStream.readShort(ObjectInputStream.java:3156)
at java.io.ObjectInputStream.readStreamHeader(ObjectInputStream.java:862)
at java.io.ObjectInputStream.<init>(ObjectInputStream.java:358)
at hudson.remoting.ObjectInputStreamEx.<init>(ObjectInputStreamEx.java:49)
at hudson.remoting.Command.readFrom(Command.java:140)
at hudson.remoting.Command.readFrom(Command.java:126)
at hudson.remoting.AbstractSynchronousByteArrayCommandTransport.read(AbstractSynchronousByteArrayCommandTransport.java:36)
at hudson.remoting.SynchronousCommandTransport$ReaderThread.run(SynchronousCommandTransport.java:63)
Caused: java.io.IOException: Unexpected termination of the channel
at hudson.remoting.SynchronousCommandTransport$ReaderThread.run(SynchronousCommandTransport.java:77)
Caused: hudson.remoting.ChannelClosedException: Channel "unknown": Remote call on H28 failed. The channel is closing down or has closed down
at hudson.remoting.Channel.call(Channel.java:950)
at hudson.remoting.RemoteInvocationHandler.invoke(RemoteInvocationHandler.java:283)
at com.sun.proxy.$Proxy141.isAlive(Unknown Source)
at hudson.Launcher$RemoteLauncher$ProcImpl.isAlive(Launcher.java:1150)
at hudson.Launcher$RemoteLauncher$ProcImpl.join(Launcher.java:1142)
at hudson.tasks.CommandInterpreter.join(CommandInterpreter.java:155)
at hudson.tasks.CommandInterpreter.perform(CommandInterpreter.java:109)
at hudson.tasks.CommandInterpreter.perform(CommandInterpreter.java:66)
at hudson.tasks.BuildStepMonitor$1.perform(BuildStepMonitor.java:20)
at hudson.model.AbstractBuild$AbstractBuildExecution.perform(AbstractBuild.java:741)
at hudson.model.Build$BuildExecution.build(Build.java:206)
at hudson.model.Build$BuildExecution.doRun(Build.java:163)
at hudson.model.AbstractBuild$AbstractBuildExecution.run(AbstractBuild.java:504)
at hudson.model.Run.execute(Run.java:1815)
at hudson.model.FreeStyleBuild.run(FreeStyleBuild.java:43)
at hudson.model.ResourceController.execute(ResourceController.java:97)
at hudson.model.Executor.run(Executor.java:429)
FATAL: Unable to delete script file /tmp/jenkins377799336173170870.sh
java.io.EOFException
at java.io.ObjectInputStream$PeekInputStream.readFully(ObjectInputStream.java:2681)
at java.io.ObjectInputStream$BlockDataInputStream.readShort(ObjectInputStream.java:3156)
at java.io.ObjectInputStream.readStreamHeader(ObjectInputStream.java:862)
at java.io.ObjectInputStream.<init>(ObjectInputStream.java:358)
at hudson.remoting.ObjectInputStreamEx.<init>(ObjectInputStreamEx.java:49)
at hudson.remoting.Command.readFrom(Command.java:140)
at hudson.remoting.Command.readFrom(Command.java:126)
at hudson.remoting.AbstractSynchronousByteArrayCommandTransport.read(AbstractSynchronousByteArrayCommandTransport.java:36)
at hudson.remoting.SynchronousCommandTransport$ReaderThread.run(SynchronousCommandTransport.java:63)
Caused: java.io.IOException: Unexpected termination of the channel
at hudson.remoting.SynchronousCommandTransport$ReaderThread.run(SynchronousCommandTransport.java:77)
Caused: hudson.remoting.ChannelClosedException: Channel "unknown": Remote call on H28 failed. The channel is closing down or has closed down
at hudson.remoting.Channel.call(Channel.java:950)
at hudson.FilePath.act(FilePath.java:1072)
at hudson.FilePath.act(FilePath.java:1061)
at hudson.FilePath.delete(FilePath.java:1542)
at hudson.tasks.CommandInterpreter.perform(CommandInterpreter.java:123)
at hudson.tasks.CommandInterpreter.perform(CommandInterpreter.java:66)
at hudson.tasks.BuildStepMonitor$1.perform(BuildStepMonitor.java:20)
at hudson.model.AbstractBuild$AbstractBuildExecution.perform(AbstractBuild.java:741)
at hudson.model.Build$BuildExecution.build(Build.java:206)
at hudson.model.Build$BuildExecution.doRun(Build.java:163)
at hudson.model.AbstractBuild$AbstractBuildExecution.run(AbstractBuild.java:504)
at hudson.model.Run.execute(Run.java:1815)
at hudson.model.FreeStyleBuild.run(FreeStyleBuild.java:43)
at hudson.model.ResourceController.execute(ResourceController.java:97)
at hudson.model.Executor.run(Executor.java:429)
Build step 'Execute shell' marked build as failure
ERROR: Step ?Publish JUnit test result report? failed: no workspace for kafka-trunk-jdk11 #1485
ERROR: H28 is offline; cannot locate JDK 11 (latest)
ERROR: No tool found matching GRADLE_4_10_2_HOME
ERROR: H28 is offline; cannot locate Gradle 4.10.3
Setting GRADLE_4_10_3_HOME=/home/jenkins/tools/gradle/4.10.3
Not sending mail to unregistered user noreply@github.com
Build failed in Jenkins: kafka-trunk-jdk11 #1484
Posted by Apache Jenkins Server <je...@builds.apache.org>.
See <https://builds.apache.org/job/kafka-trunk-jdk11/1484/display/redirect?page=changes>
Changes:
[github] KAFKA-9950: Construct new ConfigDef for MirrorTaskConfig before defining
[github] KAFKA-9855 - return cached Structs for Schemas with no fields (#8472)
------------------------------------------
Started by an SCM change
Started by an SCM change
Running as SYSTEM
[EnvInject] - Loading node environment variables.
Building remotely on H32 (ubuntu) in workspace /home/jenkins/jenkins-slave/workspace/kafka-trunk-jdk11
[WS-CLEANUP] Deleting project workspace...
[WS-CLEANUP] Deferred wipeout is used...
[WS-CLEANUP] Done
No credentials specified
Cloning the remote Git repository
Cloning repository https://github.com/apache/kafka.git
> git init /home/jenkins/jenkins-slave/workspace/kafka-trunk-jdk11 # timeout=10
Fetching upstream changes from https://github.com/apache/kafka.git
> git --version # timeout=10
> git fetch --tags --progress -- https://github.com/apache/kafka.git +refs/heads/*:refs/remotes/origin/*
> git config remote.origin.url https://github.com/apache/kafka.git # timeout=10
> git config --add remote.origin.fetch +refs/heads/*:refs/remotes/origin/* # timeout=10
> git config remote.origin.url https://github.com/apache/kafka.git # timeout=10
Fetching upstream changes from https://github.com/apache/kafka.git
> git fetch --tags --progress -- https://github.com/apache/kafka.git +refs/heads/*:refs/remotes/origin/*
> git rev-parse refs/remotes/origin/trunk^{commit} # timeout=10
> git rev-parse refs/remotes/origin/origin/trunk^{commit} # timeout=10
Checking out Revision aa1b3c1107f53638ec2a4a6c2f06a4626545fad3 (refs/remotes/origin/trunk)
> git config core.sparsecheckout # timeout=10
> git checkout -f aa1b3c1107f53638ec2a4a6c2f06a4626545fad3
Commit message: "KAFKA-9855 - return cached Structs for Schemas with no fields (#8472)"
> git rev-list --no-walk 82f5efabc9249e0accf530a6a82afc2f32e65ec6 # timeout=10
ERROR: No tool found matching GRADLE_4_10_2_HOME
Setting GRADLE_4_10_3_HOME=/home/jenkins/tools/gradle/4.10.3
[kafka-trunk-jdk11] $ /bin/bash -xe /tmp/jenkins7564565232869140222.sh
+ rm -rf /home/jenkins/jenkins-slave/workspace/kafka-trunk-jdk11/.gradle
ERROR: No tool found matching GRADLE_4_10_2_HOME
Setting GRADLE_4_10_3_HOME=/home/jenkins/tools/gradle/4.10.3
[kafka-trunk-jdk11] $ /bin/bash -xe /tmp/jenkins7886955468109536163.sh
+ export GRADLE_OPTS=-Xmx1024m
+ GRADLE_OPTS=-Xmx1024m
+ ./gradlew --no-daemon --continue -PmaxParallelForks=2 -PtestLoggingEvents=started,passed,skipped,failed -PxmlFindBugsReport=true clean test -PscalaVersion=2.12
To honour the JVM settings for this build a new JVM will be forked. Please consider using the daemon: https://docs.gradle.org/6.4.1/userguide/gradle_daemon.html.
Daemon will be stopped at the end of the build stopping after processing
> Configure project :
Building project 'core' with Scala version 2.12.11
Building project 'streams-scala' with Scala version 2.12.11
> Task :clean
> Task :clients:clean UP-TO-DATE
> Task :connect:clean UP-TO-DATE
> Task :core:clean UP-TO-DATE
> Task :examples:clean UP-TO-DATE
> Task :generator:clean UP-TO-DATE
> Task :jmh-benchmarks:clean UP-TO-DATE
> Task :log4j-appender:clean UP-TO-DATE
> Task :streams:clean UP-TO-DATE
> Task :tools:clean UP-TO-DATE
> Task :connect:api:clean UP-TO-DATE
> Task :connect:basic-auth-extension:clean UP-TO-DATE
> Task :connect:file:clean UP-TO-DATE
> Task :connect:json:clean UP-TO-DATE
> Task :connect:mirror:clean UP-TO-DATE
> Task :connect:mirror-client:clean UP-TO-DATE
> Task :connect:runtime:clean UP-TO-DATE
> Task :connect:transforms:clean UP-TO-DATE
> Task :streams:examples:clean UP-TO-DATE
> Task :streams:streams-scala:clean UP-TO-DATE
> Task :streams:test-utils:clean UP-TO-DATE
> Task :streams:upgrade-system-tests-0100:clean UP-TO-DATE
> Task :streams:upgrade-system-tests-0101:clean UP-TO-DATE
> Task :streams:upgrade-system-tests-0102:clean UP-TO-DATE
> Task :streams:upgrade-system-tests-0110:clean UP-TO-DATE
> Task :streams:upgrade-system-tests-10:clean UP-TO-DATE
> Task :streams:upgrade-system-tests-11:clean UP-TO-DATE
> Task :streams:upgrade-system-tests-20:clean UP-TO-DATE
> Task :streams:upgrade-system-tests-21:clean UP-TO-DATE
> Task :streams:upgrade-system-tests-22:clean UP-TO-DATE
> Task :streams:upgrade-system-tests-23:clean UP-TO-DATE
> Task :streams:upgrade-system-tests-24:clean UP-TO-DATE
> Task :streams:upgrade-system-tests-25:clean UP-TO-DATE
> Task :compileJava NO-SOURCE
> Task :processResources NO-SOURCE
> Task :classes UP-TO-DATE
> Task :rat
Rat report: /home/jenkins/jenkins-slave/workspace/kafka-trunk-jdk11/build/rat/rat-report.html
> Task :compileTestJava NO-SOURCE
> Task :processTestResources NO-SOURCE
> Task :testClasses UP-TO-DATE
> Task :test NO-SOURCE
> Task :generator:compileJava
> Task :generator:processResources NO-SOURCE
> Task :generator:classes
> Task :clients:processMessages
MessageGenerator: processed 103 Kafka message JSON files(s).
> Task :clients:compileJava
> Task :clients:processResources
> Task :clients:classes
> Task :clients:checkstyleMain
> Task :clients:processTestMessages
MessageGenerator: processed 1 Kafka message JSON files(s).
> Task :clients:compileTestJava
> Task :clients:processTestResources
> Task :clients:testClasses
> Task :clients:checkstyleTest
> Task :connect:compileJava NO-SOURCE
> Task :connect:processResources NO-SOURCE
> Task :connect:classes UP-TO-DATE
> Task :connect:checkstyleMain NO-SOURCE
> Task :connect:compileTestJava NO-SOURCE
> Task :connect:processTestResources NO-SOURCE
> Task :connect:testClasses UP-TO-DATE
> Task :connect:checkstyleTest NO-SOURCE
> Task :connect:spotbugsMain NO-SOURCE
> Task :connect:test NO-SOURCE
> Task :clients:determineCommitId UP-TO-DATE
> Task :clients:createVersionFile
> Task :clients:jar
> Task :core:compileJava
> Task :clients:spotbugsMain
> Task :core:compileScala
[Warn] /home/jenkins/jenkins-slave/workspace/kafka-trunk-jdk11/core/src/main/scala/kafka/coordinator/group/MemberMetadata.scala:31: private object MemberMetadata in package group is never used
[Warn] /home/jenkins/jenkins-slave/workspace/kafka-trunk-jdk11/core/src/main/scala/kafka/network/RequestChannel.scala:110: parameter value nn in method body is never used
[Warn] /home/jenkins/jenkins-slave/workspace/kafka-trunk-jdk11/core/src/main/scala/kafka/utils/NotNothing.scala:40: parameter value n in method notNothingEvidence is never used
[Warn] /home/jenkins/jenkins-slave/workspace/kafka-trunk-jdk11/core/src/main/scala/kafka/utils/json/DecodeJson.scala:88: higher-kinded type should be enabled
by making the implicit value scala.language.higherKinds visible.
This can be achieved by adding the import clause 'import scala.language.higherKinds'
or by setting the compiler option -language:higherKinds.
See the Scaladoc for value scala.language.higherKinds for a discussion
why the feature should be explicitly enabled.
[Warn] /home/jenkins/jenkins-slave/workspace/kafka-trunk-jdk11/core/src/main/scala/kafka/utils/json/DecodeJson.scala:94: higher-kinded type should be enabled
by making the implicit value scala.language.higherKinds visible.
[Warn] /home/jenkins/jenkins-slave/workspace/kafka-trunk-jdk11/core/src/main/scala/kafka/admin/ConfigCommand.scala:350: method alterConfigs in trait Admin is deprecated: see corresponding Javadoc for more information.
[Warn] /home/jenkins/jenkins-slave/workspace/kafka-trunk-jdk11/core/src/main/scala/kafka/security/authorizer/AuthorizerUtils.scala:40: class AuthorizerWrapper in package authorizer is deprecated (since Since 2.5): Use kafka.security.authorizer.AclAuthorizer
[Warn] /home/jenkins/jenkins-slave/workspace/kafka-trunk-jdk11/core/src/main/scala/kafka/tools/ConsoleConsumer.scala:581: method checksum in class ConsumerRecord is deprecated: see corresponding Javadoc for more information.
[Warn] /home/jenkins/jenkins-slave/workspace/kafka-trunk-jdk11/core/src/main/scala/kafka/tools/MirrorMaker.scala:195: class BaseConsumerRecord in package consumer is deprecated (since 0.11.0.0): This class has been deprecated and will be removed in a future release. Please use org.apache.kafka.clients.consumer.ConsumerRecord instead.
[Warn] /home/jenkins/jenkins-slave/workspace/kafka-trunk-jdk11/core/src/main/scala/kafka/tools/MirrorMaker.scala:196: class BaseConsumerRecord in package consumer is deprecated (since 0.11.0.0): This class has been deprecated and will be removed in a future release. Please use org.apache.kafka.clients.consumer.ConsumerRecord instead.
[Warn] /home/jenkins/jenkins-slave/workspace/kafka-trunk-jdk11/core/src/main/scala/kafka/tools/MirrorMaker.scala:418: class BaseConsumerRecord in package consumer is deprecated (since 0.11.0.0): This class has been deprecated and will be removed in a future release. Please use org.apache.kafka.clients.consumer.ConsumerRecord instead.
[Warn] /home/jenkins/jenkins-slave/workspace/kafka-trunk-jdk11/core/src/main/scala/kafka/tools/MirrorMaker.scala:423: class BaseConsumerRecord in package consumer is deprecated (since 0.11.0.0): This class has been deprecated and will be removed in a future release. Please use org.apache.kafka.clients.consumer.ConsumerRecord instead.
FATAL: command execution failed
java.io.EOFException
at java.io.ObjectInputStream$PeekInputStream.readFully(ObjectInputStream.java:2681)
at java.io.ObjectInputStream$BlockDataInputStream.readShort(ObjectInputStream.java:3156)
at java.io.ObjectInputStream.readStreamHeader(ObjectInputStream.java:862)
at java.io.ObjectInputStream.<init>(ObjectInputStream.java:358)
at hudson.remoting.ObjectInputStreamEx.<init>(ObjectInputStreamEx.java:49)
at hudson.remoting.Command.readFrom(Command.java:140)
at hudson.remoting.Command.readFrom(Command.java:126)
at hudson.remoting.AbstractSynchronousByteArrayCommandTransport.read(AbstractSynchronousByteArrayCommandTransport.java:36)
at hudson.remoting.SynchronousCommandTransport$ReaderThread.run(SynchronousCommandTransport.java:63)
Caused: java.io.IOException: Unexpected termination of the channel
at hudson.remoting.SynchronousCommandTransport$ReaderThread.run(SynchronousCommandTransport.java:77)
Caused: java.io.IOException: Backing channel 'H32' is disconnected.
at hudson.remoting.RemoteInvocationHandler.channelOrFail(RemoteInvocationHandler.java:214)
at hudson.remoting.RemoteInvocationHandler.invoke(RemoteInvocationHandler.java:283)
at com.sun.proxy.$Proxy141.isAlive(Unknown Source)
at hudson.Launcher$RemoteLauncher$ProcImpl.isAlive(Launcher.java:1150)
at hudson.Launcher$RemoteLauncher$ProcImpl.join(Launcher.java:1142)
at hudson.tasks.CommandInterpreter.join(CommandInterpreter.java:155)
at hudson.tasks.CommandInterpreter.perform(CommandInterpreter.java:109)
at hudson.tasks.CommandInterpreter.perform(CommandInterpreter.java:66)
at hudson.tasks.BuildStepMonitor$1.perform(BuildStepMonitor.java:20)
at hudson.model.AbstractBuild$AbstractBuildExecution.perform(AbstractBuild.java:741)
at hudson.model.Build$BuildExecution.build(Build.java:206)
at hudson.model.Build$BuildExecution.doRun(Build.java:163)
at hudson.model.AbstractBuild$AbstractBuildExecution.run(AbstractBuild.java:504)
at hudson.model.Run.execute(Run.java:1815)
at hudson.model.FreeStyleBuild.run(FreeStyleBuild.java:43)
at hudson.model.ResourceController.execute(ResourceController.java:97)
at hudson.model.Executor.run(Executor.java:429)
FATAL: Unable to delete script file /tmp/jenkins7886955468109536163.sh
java.io.EOFException
at java.io.ObjectInputStream$PeekInputStream.readFully(ObjectInputStream.java:2681)
at java.io.ObjectInputStream$BlockDataInputStream.readShort(ObjectInputStream.java:3156)
at java.io.ObjectInputStream.readStreamHeader(ObjectInputStream.java:862)
at java.io.ObjectInputStream.<init>(ObjectInputStream.java:358)
at hudson.remoting.ObjectInputStreamEx.<init>(ObjectInputStreamEx.java:49)
at hudson.remoting.Command.readFrom(Command.java:140)
at hudson.remoting.Command.readFrom(Command.java:126)
at hudson.remoting.AbstractSynchronousByteArrayCommandTransport.read(AbstractSynchronousByteArrayCommandTransport.java:36)
at hudson.remoting.SynchronousCommandTransport$ReaderThread.run(SynchronousCommandTransport.java:63)
Caused: java.io.IOException: Unexpected termination of the channel
at hudson.remoting.SynchronousCommandTransport$ReaderThread.run(SynchronousCommandTransport.java:77)
Caused: hudson.remoting.ChannelClosedException: Channel "unknown": Remote call on H32 failed. The channel is closing down or has closed down
at hudson.remoting.Channel.call(Channel.java:950)
at hudson.FilePath.act(FilePath.java:1072)
at hudson.FilePath.act(FilePath.java:1061)
at hudson.FilePath.delete(FilePath.java:1542)
at hudson.tasks.CommandInterpreter.perform(CommandInterpreter.java:123)
at hudson.tasks.CommandInterpreter.perform(CommandInterpreter.java:66)
at hudson.tasks.BuildStepMonitor$1.perform(BuildStepMonitor.java:20)
at hudson.model.AbstractBuild$AbstractBuildExecution.perform(AbstractBuild.java:741)
at hudson.model.Build$BuildExecution.build(Build.java:206)
at hudson.model.Build$BuildExecution.doRun(Build.java:163)
at hudson.model.AbstractBuild$AbstractBuildExecution.run(AbstractBuild.java:504)
at hudson.model.Run.execute(Run.java:1815)
at hudson.model.FreeStyleBuild.run(FreeStyleBuild.java:43)
at hudson.model.ResourceController.execute(ResourceController.java:97)
at hudson.model.Executor.run(Executor.java:429)
Build step 'Execute shell' marked build as failure
ERROR: Step ?Publish JUnit test result report? failed: no workspace for kafka-trunk-jdk11 #1484
ERROR: H32 is offline; cannot locate JDK 11 (latest)
ERROR: No tool found matching GRADLE_4_10_2_HOME
ERROR: H32 is offline; cannot locate Gradle 4.10.3
Setting GRADLE_4_10_3_HOME=/home/jenkins/tools/gradle/4.10.3
Not sending mail to unregistered user noreply@github.com
Build failed in Jenkins: kafka-trunk-jdk11 #1483
Posted by Apache Jenkins Server <je...@builds.apache.org>.
See <https://builds.apache.org/job/kafka-trunk-jdk11/1483/display/redirect?page=changes>
Changes:
[github] KAFKA-9409: Supplement immutability of ClusterConfigState class in
[github] KAFKA-8869: Remove task configs for deleted connectors from config
------------------------------------------
[...truncated 4.68 MB...]
kafka.admin.ConfigCommandTest > shouldFailIfUnrecognisedEntityType STARTED
kafka.admin.ConfigCommandTest > shouldFailIfUnrecognisedEntityType PASSED
kafka.admin.ConfigCommandTest > testUserClientQuotaOptsUsingZookeeper STARTED
kafka.admin.ConfigCommandTest > testUserClientQuotaOptsUsingZookeeper PASSED
kafka.admin.ConfigCommandTest > shouldFailIfShortBrokerEntityTypeIsNotAnIntegerUsingZookeeper STARTED
kafka.admin.ConfigCommandTest > shouldFailIfShortBrokerEntityTypeIsNotAnIntegerUsingZookeeper PASSED
kafka.admin.ConfigCommandTest > shouldAddBrokerQuotaConfig STARTED
kafka.admin.ConfigCommandTest > shouldAddBrokerQuotaConfig PASSED
kafka.admin.ConfigCommandTest > shouldParseArgumentsForClientsEntityTypeUsingZookeeper STARTED
kafka.admin.ConfigCommandTest > shouldParseArgumentsForClientsEntityTypeUsingZookeeper PASSED
kafka.admin.ConfigCommandTest > shouldNotUpdateConfigIfNonExistingConfigIsDeletedUsingZookeper STARTED
kafka.admin.ConfigCommandTest > shouldNotUpdateConfigIfNonExistingConfigIsDeletedUsingZookeper PASSED
kafka.admin.ConfigCommandTest > shouldNotUpdateBrokerConfigIfMalformedEntityName STARTED
kafka.admin.ConfigCommandTest > shouldNotUpdateBrokerConfigIfMalformedEntityName PASSED
kafka.admin.ConfigCommandTest > shouldRaiseInvalidConfigurationExceptionWhenAddingInvalidBrokerLoggerConfig STARTED
kafka.admin.ConfigCommandTest > shouldRaiseInvalidConfigurationExceptionWhenAddingInvalidBrokerLoggerConfig PASSED
kafka.admin.ConfigCommandTest > testOptionEntityTypeNamesUsingZookeeper STARTED
kafka.admin.ConfigCommandTest > testOptionEntityTypeNamesUsingZookeeper PASSED
kafka.admin.ConfigCommandTest > shouldDescribeConfigSynonyms STARTED
kafka.admin.ConfigCommandTest > shouldDescribeConfigSynonyms PASSED
kafka.admin.ConfigCommandTest > shouldParseArgumentsForUsersEntityTypeUsingZookeeper STARTED
kafka.admin.ConfigCommandTest > shouldParseArgumentsForUsersEntityTypeUsingZookeeper PASSED
kafka.admin.ConfigCommandTest > testEntityDefaultOptionWithAlterBrokerLoggerIsNotAllowed STARTED
kafka.admin.ConfigCommandTest > testEntityDefaultOptionWithAlterBrokerLoggerIsNotAllowed PASSED
kafka.admin.ConfigCommandTest > shouldNotUpdateBrokerConfigIfMalformedConfig STARTED
kafka.admin.ConfigCommandTest > shouldNotUpdateBrokerConfigIfMalformedConfig PASSED
kafka.admin.ConfigCommandTest > testParseConfigsToBeAddedForAddConfigFile STARTED
kafka.admin.ConfigCommandTest > testParseConfigsToBeAddedForAddConfigFile PASSED
kafka.admin.ConfigCommandTest > shouldParseArgumentsForBrokerLoggersEntityType STARTED
kafka.admin.ConfigCommandTest > shouldParseArgumentsForBrokerLoggersEntityType PASSED
kafka.admin.ConfigCommandTest > shouldNotUpdateConfigIfNonExistingConfigIsDeleted STARTED
kafka.admin.ConfigCommandTest > shouldNotUpdateConfigIfNonExistingConfigIsDeleted PASSED
kafka.admin.ConfigCommandTest > shouldFailIfShortBrokerEntityTypeIsNotAnInteger STARTED
kafka.admin.ConfigCommandTest > shouldFailIfShortBrokerEntityTypeIsNotAnInteger PASSED
kafka.admin.ConfigCommandTest > testDescribeAllBrokerConfig STARTED
kafka.admin.ConfigCommandTest > testDescribeAllBrokerConfig PASSED
kafka.admin.ConfigCommandTest > shouldExitWithNonZeroStatusOnBrokerCommandError STARTED
kafka.admin.ConfigCommandTest > shouldExitWithNonZeroStatusOnBrokerCommandError PASSED
kafka.admin.ConfigCommandTest > shouldParseArgumentsForBrokersEntityType STARTED
kafka.admin.ConfigCommandTest > shouldParseArgumentsForBrokersEntityType PASSED
kafka.admin.ConfigCommandTest > testDynamicBrokerConfigUpdateUsingZooKeeper STARTED
kafka.admin.ConfigCommandTest > testDynamicBrokerConfigUpdateUsingZooKeeper PASSED
kafka.admin.ConfigCommandTest > testNoSpecifiedEntityOptionWithDescribeBrokersInZKIsAllowed STARTED
kafka.admin.ConfigCommandTest > testNoSpecifiedEntityOptionWithDescribeBrokersInZKIsAllowed PASSED
kafka.admin.ConfigCommandTest > testQuotaDescribeEntities STARTED
kafka.admin.ConfigCommandTest > testQuotaDescribeEntities PASSED
kafka.admin.ConfigCommandTest > shouldParseArgumentsForClientsEntityType STARTED
kafka.admin.ConfigCommandTest > shouldParseArgumentsForClientsEntityType PASSED
kafka.admin.ConfigCommandTest > testDescribeAllBrokerConfigBootstrapServerRequired STARTED
kafka.admin.ConfigCommandTest > testDescribeAllBrokerConfigBootstrapServerRequired PASSED
kafka.admin.ConfigCommandTest > shouldAlterTopicConfigFile STARTED
kafka.admin.ConfigCommandTest > shouldAlterTopicConfigFile PASSED
kafka.admin.ConfigCommandTest > shouldExitWithNonZeroStatusOnArgError STARTED
kafka.admin.ConfigCommandTest > shouldExitWithNonZeroStatusOnArgError PASSED
kafka.admin.ConfigCommandTest > shouldAddTopicConfigUsingZookeeper STARTED
kafka.admin.ConfigCommandTest > shouldAddTopicConfigUsingZookeeper PASSED
kafka.admin.TopicCommandWithAdminClientTest > testAlterPartitionCount STARTED
kafka.admin.AclCommandTest > testProducerConsumerCliWithAdminAPI PASSED
kafka.admin.AclCommandTest > testAclsOnPrefixedResourcesWithAuthorizer STARTED
kafka.admin.AclCommandTest > testAclsOnPrefixedResourcesWithAuthorizer PASSED
kafka.admin.AclCommandTest > testProducerConsumerCliWithAuthorizer STARTED
kafka.admin.TopicCommandWithAdminClientTest > testAlterPartitionCount PASSED
kafka.admin.TopicCommandWithAdminClientTest > testCreateWithDefaultReplication STARTED
kafka.admin.TopicCommandWithAdminClientTest > testCreateWithDefaultReplication PASSED
kafka.admin.TopicCommandWithAdminClientTest > testDescribeAtMinIsrPartitions STARTED
kafka.admin.TopicCommandWithAdminClientTest > testDescribeAtMinIsrPartitions PASSED
kafka.admin.TopicCommandWithAdminClientTest > testParseAssignmentDuplicateEntries STARTED
kafka.admin.AclCommandTest > testProducerConsumerCliWithAuthorizer PASSED
kafka.admin.AclCommandTest > testAclCliWithAdminAPI STARTED
kafka.admin.TopicCommandWithAdminClientTest > testParseAssignmentDuplicateEntries PASSED
kafka.admin.TopicCommandWithAdminClientTest > testCreateWithNegativeReplicationFactor STARTED
kafka.admin.TopicCommandWithAdminClientTest > testCreateWithNegativeReplicationFactor PASSED
kafka.admin.TopicCommandWithAdminClientTest > testCreateWithInvalidReplicationFactor STARTED
kafka.admin.AclCommandTest > testAclCliWithAdminAPI PASSED
kafka.admin.LeaderElectionCommandTest > testAllTopicPartition STARTED
kafka.admin.TopicCommandWithAdminClientTest > testCreateWithInvalidReplicationFactor PASSED
kafka.admin.TopicCommandWithAdminClientTest > testCreateIfItAlreadyExists STARTED
kafka.admin.TopicCommandWithAdminClientTest > testCreateIfItAlreadyExists PASSED
kafka.admin.TopicCommandWithAdminClientTest > testListTopicsWithExcludeInternal STARTED
kafka.admin.TopicCommandWithAdminClientTest > testListTopicsWithExcludeInternal PASSED
kafka.admin.TopicCommandWithAdminClientTest > testDescribeUnderReplicatedPartitionsWhenReassignmentIsInProgress STARTED
kafka.admin.LeaderElectionCommandTest > testAllTopicPartition PASSED
kafka.admin.LeaderElectionCommandTest > testTopicWithoutPartition STARTED
kafka.admin.LeaderElectionCommandTest > testTopicWithoutPartition PASSED
kafka.admin.LeaderElectionCommandTest > testPathToJsonFile STARTED
kafka.admin.TopicCommandWithAdminClientTest > testDescribeUnderReplicatedPartitionsWhenReassignmentIsInProgress PASSED
kafka.admin.TopicCommandWithAdminClientTest > testCreateWithNegativePartitionCount STARTED
kafka.admin.TopicCommandWithAdminClientTest > testCreateWithNegativePartitionCount PASSED
kafka.admin.TopicCommandWithAdminClientTest > testAlterWhenTopicDoesntExist STARTED
kafka.admin.TopicCommandWithAdminClientTest > testAlterWhenTopicDoesntExist PASSED
kafka.admin.TopicCommandWithAdminClientTest > testParseAssignmentPartitionsOfDifferentSize STARTED
FATAL: command execution failed
java.io.EOFException
at java.io.ObjectInputStream$PeekInputStream.readFully(ObjectInputStream.java:2681)
at java.io.ObjectInputStream$BlockDataInputStream.readShort(ObjectInputStream.java:3156)
at java.io.ObjectInputStream.readStreamHeader(ObjectInputStream.java:862)
at java.io.ObjectInputStream.<init>(ObjectInputStream.java:358)
at hudson.remoting.ObjectInputStreamEx.<init>(ObjectInputStreamEx.java:49)
at hudson.remoting.Command.readFrom(Command.java:140)
at hudson.remoting.Command.readFrom(Command.java:126)
at hudson.remoting.AbstractSynchronousByteArrayCommandTransport.read(AbstractSynchronousByteArrayCommandTransport.java:36)
at hudson.remoting.SynchronousCommandTransport$ReaderThread.run(SynchronousCommandTransport.java:63)
Caused: java.io.IOException: Unexpected termination of the channel
at hudson.remoting.SynchronousCommandTransport$ReaderThread.run(SynchronousCommandTransport.java:77)
Caused: java.io.IOException: Backing channel 'H28' is disconnected.
at hudson.remoting.RemoteInvocationHandler.channelOrFail(RemoteInvocationHandler.java:214)
at hudson.remoting.RemoteInvocationHandler.invoke(RemoteInvocationHandler.java:283)
at com.sun.proxy.$Proxy141.isAlive(Unknown Source)
at hudson.Launcher$RemoteLauncher$ProcImpl.isAlive(Launcher.java:1150)
at hudson.Launcher$RemoteLauncher$ProcImpl.join(Launcher.java:1142)
at hudson.tasks.CommandInterpreter.join(CommandInterpreter.java:155)
at hudson.tasks.CommandInterpreter.perform(CommandInterpreter.java:109)
at hudson.tasks.CommandInterpreter.perform(CommandInterpreter.java:66)
at hudson.tasks.BuildStepMonitor$1.perform(BuildStepMonitor.java:20)
at hudson.model.AbstractBuild$AbstractBuildExecution.perform(AbstractBuild.java:741)
at hudson.model.Build$BuildExecution.build(Build.java:206)
at hudson.model.Build$BuildExecution.doRun(Build.java:163)
at hudson.model.AbstractBuild$AbstractBuildExecution.run(AbstractBuild.java:504)
at hudson.model.Run.execute(Run.java:1815)
at hudson.model.FreeStyleBuild.run(FreeStyleBuild.java:43)
at hudson.model.ResourceController.execute(ResourceController.java:97)
at hudson.model.Executor.run(Executor.java:429)
FATAL: Unable to delete script file /tmp/jenkins7829781621374919472.sh
java.io.EOFException
at java.io.ObjectInputStream$PeekInputStream.readFully(ObjectInputStream.java:2681)
at java.io.ObjectInputStream$BlockDataInputStream.readShort(ObjectInputStream.java:3156)
at java.io.ObjectInputStream.readStreamHeader(ObjectInputStream.java:862)
at java.io.ObjectInputStream.<init>(ObjectInputStream.java:358)
at hudson.remoting.ObjectInputStreamEx.<init>(ObjectInputStreamEx.java:49)
at hudson.remoting.Command.readFrom(Command.java:140)
at hudson.remoting.Command.readFrom(Command.java:126)
at hudson.remoting.AbstractSynchronousByteArrayCommandTransport.read(AbstractSynchronousByteArrayCommandTransport.java:36)
at hudson.remoting.SynchronousCommandTransport$ReaderThread.run(SynchronousCommandTransport.java:63)
Caused: java.io.IOException: Unexpected termination of the channel
at hudson.remoting.SynchronousCommandTransport$ReaderThread.run(SynchronousCommandTransport.java:77)
Caused: hudson.remoting.ChannelClosedException: Channel "unknown": Remote call on H28 failed. The channel is closing down or has closed down
at hudson.remoting.Channel.call(Channel.java:950)
at hudson.FilePath.act(FilePath.java:1072)
at hudson.FilePath.act(FilePath.java:1061)
at hudson.FilePath.delete(FilePath.java:1542)
at hudson.tasks.CommandInterpreter.perform(CommandInterpreter.java:123)
at hudson.tasks.CommandInterpreter.perform(CommandInterpreter.java:66)
at hudson.tasks.BuildStepMonitor$1.perform(BuildStepMonitor.java:20)
at hudson.model.AbstractBuild$AbstractBuildExecution.perform(AbstractBuild.java:741)
at hudson.model.Build$BuildExecution.build(Build.java:206)
at hudson.model.Build$BuildExecution.doRun(Build.java:163)
at hudson.model.AbstractBuild$AbstractBuildExecution.run(AbstractBuild.java:504)
at hudson.model.Run.execute(Run.java:1815)
at hudson.model.FreeStyleBuild.run(FreeStyleBuild.java:43)
at hudson.model.ResourceController.execute(ResourceController.java:97)
at hudson.model.Executor.run(Executor.java:429)
Build step 'Execute shell' marked build as failure
ERROR: Step ?Publish JUnit test result report? failed: no workspace for kafka-trunk-jdk11 #1483
ERROR: H28 is offline; cannot locate JDK 11 (latest)
ERROR: No tool found matching GRADLE_4_10_2_HOME
ERROR: H28 is offline; cannot locate Gradle 4.10.3
Setting GRADLE_4_10_3_HOME=/home/jenkins/tools/gradle/4.10.3
Not sending mail to unregistered user noreply@github.com
Build failed in Jenkins: kafka-trunk-jdk11 #1482
Posted by Apache Jenkins Server <je...@builds.apache.org>.
See <https://builds.apache.org/job/kafka-trunk-jdk11/1482/display/redirect?page=changes>
Changes:
[github] MINOR: Increase gradle daemon’s heap size to 2g (#8700)
------------------------------------------
[...truncated 1.40 MB...]
org.apache.kafka.common.security.auth.DefaultKafkaPrincipalBuilderTest > testPrincipalWithSslPrincipalMapper STARTED
org.apache.kafka.common.security.auth.DefaultKafkaPrincipalBuilderTest > testPrincipalWithSslPrincipalMapper PASSED
org.apache.kafka.common.security.auth.DefaultKafkaPrincipalBuilderTest > testPrincipalIfSSLPeerIsNotAuthenticated STARTED
org.apache.kafka.common.security.auth.DefaultKafkaPrincipalBuilderTest > testPrincipalIfSSLPeerIsNotAuthenticated PASSED
org.apache.kafka.common.security.auth.DefaultKafkaPrincipalBuilderTest > testPrincipalBuilderGssapi STARTED
org.apache.kafka.common.security.auth.DefaultKafkaPrincipalBuilderTest > testPrincipalBuilderGssapi PASSED
org.apache.kafka.common.security.auth.DefaultKafkaPrincipalBuilderTest > testUseSessionPeerPrincipalForSsl STARTED
org.apache.kafka.common.security.auth.DefaultKafkaPrincipalBuilderTest > testUseSessionPeerPrincipalForSsl PASSED
org.apache.kafka.common.security.auth.DefaultKafkaPrincipalBuilderTest > testUseOldPrincipalBuilderForSslIfProvided STARTED
org.apache.kafka.common.security.auth.DefaultKafkaPrincipalBuilderTest > testUseOldPrincipalBuilderForSslIfProvided PASSED
org.apache.kafka.common.security.auth.DefaultKafkaPrincipalBuilderTest > testReturnAnonymousPrincipalForPlaintext STARTED
org.apache.kafka.common.security.auth.DefaultKafkaPrincipalBuilderTest > testReturnAnonymousPrincipalForPlaintext PASSED
org.apache.kafka.common.security.ssl.SslFactoryTest > testKeyStoreTrustStoreValidation[tlsProtocol=TLSv1.2] STARTED
org.apache.kafka.common.security.ssl.SslFactoryTest > testKeyStoreTrustStoreValidation[tlsProtocol=TLSv1.2] PASSED
org.apache.kafka.common.security.ssl.SslFactoryTest > testReconfiguration[tlsProtocol=TLSv1.2] STARTED
org.apache.kafka.common.security.ssl.SslFactoryTest > testReconfiguration[tlsProtocol=TLSv1.2] PASSED
org.apache.kafka.common.security.ssl.SslFactoryTest > testReconfigurationWithoutTruststore[tlsProtocol=TLSv1.2] STARTED
org.apache.kafka.common.security.ssl.SslFactoryTest > testReconfigurationWithoutTruststore[tlsProtocol=TLSv1.2] PASSED
org.apache.kafka.common.security.ssl.SslFactoryTest > testSslFactoryWithoutPasswordConfiguration[tlsProtocol=TLSv1.2] STARTED
org.apache.kafka.common.security.ssl.SslFactoryTest > testSslFactoryWithoutPasswordConfiguration[tlsProtocol=TLSv1.2] PASSED
org.apache.kafka.common.security.ssl.SslFactoryTest > testReconfigurationWithoutKeystore[tlsProtocol=TLSv1.2] STARTED
org.apache.kafka.common.security.ssl.SslFactoryTest > testReconfigurationWithoutKeystore[tlsProtocol=TLSv1.2] PASSED
org.apache.kafka.common.security.ssl.SslFactoryTest > testKeystoreVerifiableUsingTruststore[tlsProtocol=TLSv1.2] STARTED
org.apache.kafka.common.security.ssl.SslFactoryTest > testKeystoreVerifiableUsingTruststore[tlsProtocol=TLSv1.2] PASSED
org.apache.kafka.common.security.ssl.SslFactoryTest > testServerSpecifiedSslEngineFactoryUsed[tlsProtocol=TLSv1.2] STARTED
org.apache.kafka.common.security.ssl.SslFactoryTest > testServerSpecifiedSslEngineFactoryUsed[tlsProtocol=TLSv1.2] PASSED
org.apache.kafka.common.security.ssl.SslFactoryTest > testUntrustedKeyStoreValidationFails[tlsProtocol=TLSv1.2] STARTED
org.apache.kafka.common.security.ssl.SslFactoryTest > testUntrustedKeyStoreValidationFails[tlsProtocol=TLSv1.2] PASSED
org.apache.kafka.common.security.ssl.SslFactoryTest > testSslFactoryWithIncorrectProviderClassConfiguration[tlsProtocol=TLSv1.2] STARTED
org.apache.kafka.common.security.ssl.SslFactoryTest > testSslFactoryWithIncorrectProviderClassConfiguration[tlsProtocol=TLSv1.2] PASSED
org.apache.kafka.common.security.ssl.SslFactoryTest > testCertificateEntriesValidation[tlsProtocol=TLSv1.2] STARTED
org.apache.kafka.common.security.ssl.SslFactoryTest > testCertificateEntriesValidation[tlsProtocol=TLSv1.2] PASSED
org.apache.kafka.common.security.ssl.SslFactoryTest > testInvalidSslEngineFactory[tlsProtocol=TLSv1.2] STARTED
org.apache.kafka.common.security.ssl.SslFactoryTest > testInvalidSslEngineFactory[tlsProtocol=TLSv1.2] PASSED
org.apache.kafka.common.security.ssl.SslFactoryTest > testSslFactoryWithCustomKeyManagerConfiguration[tlsProtocol=TLSv1.2] STARTED
org.apache.kafka.common.security.ssl.SslFactoryTest > testSslFactoryWithCustomKeyManagerConfiguration[tlsProtocol=TLSv1.2] PASSED
org.apache.kafka.common.security.ssl.SslFactoryTest > testClientMode[tlsProtocol=TLSv1.2] STARTED
org.apache.kafka.common.security.ssl.SslFactoryTest > testClientMode[tlsProtocol=TLSv1.2] PASSED
org.apache.kafka.common.security.ssl.SslFactoryTest > testSslFactoryConfiguration[tlsProtocol=TLSv1.2] STARTED
org.apache.kafka.common.security.ssl.SslFactoryTest > testSslFactoryConfiguration[tlsProtocol=TLSv1.2] PASSED
org.apache.kafka.common.security.ssl.SslFactoryTest > testClientSpecifiedSslEngineFactoryUsed[tlsProtocol=TLSv1.2] STARTED
org.apache.kafka.common.security.ssl.SslFactoryTest > testClientSpecifiedSslEngineFactoryUsed[tlsProtocol=TLSv1.2] PASSED
org.apache.kafka.common.security.ssl.SslFactoryTest > testEngineFactoryClosed[tlsProtocol=TLSv1.2] STARTED
org.apache.kafka.common.security.ssl.SslFactoryTest > testEngineFactoryClosed[tlsProtocol=TLSv1.2] PASSED
org.apache.kafka.common.security.ssl.SslFactoryTest > testSslFactoryWithoutProviderClassConfiguration[tlsProtocol=TLSv1.2] STARTED
org.apache.kafka.common.security.ssl.SslFactoryTest > testSslFactoryWithoutProviderClassConfiguration[tlsProtocol=TLSv1.2] PASSED
org.apache.kafka.common.security.ssl.SslFactoryTest > testKeyStoreTrustStoreValidation[tlsProtocol=TLSv1.3] STARTED
org.apache.kafka.common.security.ssl.SslFactoryTest > testKeyStoreTrustStoreValidation[tlsProtocol=TLSv1.3] PASSED
org.apache.kafka.common.security.ssl.SslFactoryTest > testReconfiguration[tlsProtocol=TLSv1.3] STARTED
org.apache.kafka.common.security.ssl.SslFactoryTest > testReconfiguration[tlsProtocol=TLSv1.3] PASSED
org.apache.kafka.common.security.ssl.SslFactoryTest > testReconfigurationWithoutTruststore[tlsProtocol=TLSv1.3] STARTED
org.apache.kafka.common.security.ssl.SslFactoryTest > testReconfigurationWithoutTruststore[tlsProtocol=TLSv1.3] PASSED
org.apache.kafka.common.security.ssl.SslFactoryTest > testSslFactoryWithoutPasswordConfiguration[tlsProtocol=TLSv1.3] STARTED
org.apache.kafka.common.security.ssl.SslFactoryTest > testSslFactoryWithoutPasswordConfiguration[tlsProtocol=TLSv1.3] PASSED
org.apache.kafka.common.security.ssl.SslFactoryTest > testReconfigurationWithoutKeystore[tlsProtocol=TLSv1.3] STARTED
org.apache.kafka.common.security.ssl.SslFactoryTest > testReconfigurationWithoutKeystore[tlsProtocol=TLSv1.3] PASSED
org.apache.kafka.common.security.ssl.SslFactoryTest > testKeystoreVerifiableUsingTruststore[tlsProtocol=TLSv1.3] STARTED
org.apache.kafka.common.security.ssl.SslFactoryTest > testKeystoreVerifiableUsingTruststore[tlsProtocol=TLSv1.3] PASSED
org.apache.kafka.common.security.ssl.SslFactoryTest > testServerSpecifiedSslEngineFactoryUsed[tlsProtocol=TLSv1.3] STARTED
org.apache.kafka.common.security.ssl.SslFactoryTest > testServerSpecifiedSslEngineFactoryUsed[tlsProtocol=TLSv1.3] PASSED
org.apache.kafka.common.security.ssl.SslFactoryTest > testUntrustedKeyStoreValidationFails[tlsProtocol=TLSv1.3] STARTED
org.apache.kafka.common.security.ssl.SslFactoryTest > testUntrustedKeyStoreValidationFails[tlsProtocol=TLSv1.3] PASSED
org.apache.kafka.common.security.ssl.SslFactoryTest > testSslFactoryWithIncorrectProviderClassConfiguration[tlsProtocol=TLSv1.3] STARTED
org.apache.kafka.common.security.ssl.SslFactoryTest > testSslFactoryWithIncorrectProviderClassConfiguration[tlsProtocol=TLSv1.3] PASSED
org.apache.kafka.common.security.ssl.SslFactoryTest > testCertificateEntriesValidation[tlsProtocol=TLSv1.3] STARTED
org.apache.kafka.common.security.ssl.SslFactoryTest > testCertificateEntriesValidation[tlsProtocol=TLSv1.3] PASSED
org.apache.kafka.common.security.ssl.SslFactoryTest > testInvalidSslEngineFactory[tlsProtocol=TLSv1.3] STARTED
org.apache.kafka.common.security.ssl.SslFactoryTest > testInvalidSslEngineFactory[tlsProtocol=TLSv1.3] PASSED
org.apache.kafka.common.security.ssl.SslFactoryTest > testSslFactoryWithCustomKeyManagerConfiguration[tlsProtocol=TLSv1.3] STARTED
org.apache.kafka.common.security.ssl.SslFactoryTest > testSslFactoryWithCustomKeyManagerConfiguration[tlsProtocol=TLSv1.3] PASSED
org.apache.kafka.common.security.ssl.SslFactoryTest > testClientMode[tlsProtocol=TLSv1.3] STARTED
org.apache.kafka.common.security.ssl.SslFactoryTest > testClientMode[tlsProtocol=TLSv1.3] PASSED
org.apache.kafka.common.security.ssl.SslFactoryTest > testSslFactoryConfiguration[tlsProtocol=TLSv1.3] STARTED
org.apache.kafka.common.security.ssl.SslFactoryTest > testSslFactoryConfiguration[tlsProtocol=TLSv1.3] PASSED
org.apache.kafka.common.security.ssl.SslFactoryTest > testClientSpecifiedSslEngineFactoryUsed[tlsProtocol=TLSv1.3] STARTED
org.apache.kafka.common.security.ssl.SslFactoryTest > testClientSpecifiedSslEngineFactoryUsed[tlsProtocol=TLSv1.3] PASSED
org.apache.kafka.common.security.ssl.SslFactoryTest > testEngineFactoryClosed[tlsProtocol=TLSv1.3] STARTED
org.apache.kafka.common.security.ssl.SslFactoryTest > testEngineFactoryClosed[tlsProtocol=TLSv1.3] PASSED
org.apache.kafka.common.security.ssl.SslFactoryTest > testSslFactoryWithoutProviderClassConfiguration[tlsProtocol=TLSv1.3] STARTED
org.apache.kafka.common.security.ssl.SslFactoryTest > testSslFactoryWithoutProviderClassConfiguration[tlsProtocol=TLSv1.3] PASSED
org.apache.kafka.common.resource.ResourceTypeTest > testCode STARTED
org.apache.kafka.common.resource.ResourceTypeTest > testCode PASSED
org.apache.kafka.common.resource.ResourceTypeTest > testName STARTED
org.apache.kafka.common.resource.ResourceTypeTest > testName PASSED
org.apache.kafka.common.resource.ResourceTypeTest > testExhaustive STARTED
org.apache.kafka.common.resource.ResourceTypeTest > testExhaustive PASSED
org.apache.kafka.common.resource.ResourceTypeTest > testIsUnknown STARTED
org.apache.kafka.common.resource.ResourceTypeTest > testIsUnknown PASSED
> Task :core:processResources NO-SOURCE
> Task :core:classes
> Task :core:checkstyleMain
> Task :core:compileTestJava NO-SOURCE
> Task :core:compileTestScala
[Warn] /home/jenkins/jenkins-slave/workspace/kafka-trunk-jdk11/core/src/test/scala/unit/kafka/server/BaseRequestTest.scala:90: parameter value nn in method receive is never used
FATAL: command execution failed
java.io.EOFException
at java.io.ObjectInputStream$PeekInputStream.readFully(ObjectInputStream.java:2681)
at java.io.ObjectInputStream$BlockDataInputStream.readShort(ObjectInputStream.java:3156)
at java.io.ObjectInputStream.readStreamHeader(ObjectInputStream.java:862)
at java.io.ObjectInputStream.<init>(ObjectInputStream.java:358)
at hudson.remoting.ObjectInputStreamEx.<init>(ObjectInputStreamEx.java:49)
at hudson.remoting.Command.readFrom(Command.java:140)
at hudson.remoting.Command.readFrom(Command.java:126)
at hudson.remoting.AbstractSynchronousByteArrayCommandTransport.read(AbstractSynchronousByteArrayCommandTransport.java:36)
at hudson.remoting.SynchronousCommandTransport$ReaderThread.run(SynchronousCommandTransport.java:63)
Caused: java.io.IOException: Unexpected termination of the channel
at hudson.remoting.SynchronousCommandTransport$ReaderThread.run(SynchronousCommandTransport.java:77)
Caused: java.io.IOException: Backing channel 'H30' is disconnected.
at hudson.remoting.RemoteInvocationHandler.channelOrFail(RemoteInvocationHandler.java:214)
at hudson.remoting.RemoteInvocationHandler.invoke(RemoteInvocationHandler.java:283)
at com.sun.proxy.$Proxy141.isAlive(Unknown Source)
at hudson.Launcher$RemoteLauncher$ProcImpl.isAlive(Launcher.java:1150)
at hudson.Launcher$RemoteLauncher$ProcImpl.join(Launcher.java:1142)
at hudson.tasks.CommandInterpreter.join(CommandInterpreter.java:155)
at hudson.tasks.CommandInterpreter.perform(CommandInterpreter.java:109)
at hudson.tasks.CommandInterpreter.perform(CommandInterpreter.java:66)
at hudson.tasks.BuildStepMonitor$1.perform(BuildStepMonitor.java:20)
at hudson.model.AbstractBuild$AbstractBuildExecution.perform(AbstractBuild.java:741)
at hudson.model.Build$BuildExecution.build(Build.java:206)
at hudson.model.Build$BuildExecution.doRun(Build.java:163)
at hudson.model.AbstractBuild$AbstractBuildExecution.run(AbstractBuild.java:504)
at hudson.model.Run.execute(Run.java:1815)
at hudson.model.FreeStyleBuild.run(FreeStyleBuild.java:43)
at hudson.model.ResourceController.execute(ResourceController.java:97)
at hudson.model.Executor.run(Executor.java:429)
FATAL: Unable to delete script file /tmp/jenkins5296410377489973678.sh
java.io.EOFException
at java.io.ObjectInputStream$PeekInputStream.readFully(ObjectInputStream.java:2681)
at java.io.ObjectInputStream$BlockDataInputStream.readShort(ObjectInputStream.java:3156)
at java.io.ObjectInputStream.readStreamHeader(ObjectInputStream.java:862)
at java.io.ObjectInputStream.<init>(ObjectInputStream.java:358)
at hudson.remoting.ObjectInputStreamEx.<init>(ObjectInputStreamEx.java:49)
at hudson.remoting.Command.readFrom(Command.java:140)
at hudson.remoting.Command.readFrom(Command.java:126)
at hudson.remoting.AbstractSynchronousByteArrayCommandTransport.read(AbstractSynchronousByteArrayCommandTransport.java:36)
at hudson.remoting.SynchronousCommandTransport$ReaderThread.run(SynchronousCommandTransport.java:63)
Caused: java.io.IOException: Unexpected termination of the channel
at hudson.remoting.SynchronousCommandTransport$ReaderThread.run(SynchronousCommandTransport.java:77)
Caused: hudson.remoting.ChannelClosedException: Channel "unknown": Remote call on H30 failed. The channel is closing down or has closed down
at hudson.remoting.Channel.call(Channel.java:950)
at hudson.FilePath.act(FilePath.java:1072)
at hudson.FilePath.act(FilePath.java:1061)
at hudson.FilePath.delete(FilePath.java:1542)
at hudson.tasks.CommandInterpreter.perform(CommandInterpreter.java:123)
at hudson.tasks.CommandInterpreter.perform(CommandInterpreter.java:66)
at hudson.tasks.BuildStepMonitor$1.perform(BuildStepMonitor.java:20)
at hudson.model.AbstractBuild$AbstractBuildExecution.perform(AbstractBuild.java:741)
at hudson.model.Build$BuildExecution.build(Build.java:206)
at hudson.model.Build$BuildExecution.doRun(Build.java:163)
at hudson.model.AbstractBuild$AbstractBuildExecution.run(AbstractBuild.java:504)
at hudson.model.Run.execute(Run.java:1815)
at hudson.model.FreeStyleBuild.run(FreeStyleBuild.java:43)
at hudson.model.ResourceController.execute(ResourceController.java:97)
at hudson.model.Executor.run(Executor.java:429)
Build step 'Execute shell' marked build as failure
ERROR: Step ?Publish JUnit test result report? failed: no workspace for kafka-trunk-jdk11 #1482
ERROR: H30 is offline; cannot locate JDK 11 (latest)
ERROR: No tool found matching GRADLE_4_10_2_HOME
ERROR: H30 is offline; cannot locate Gradle 4.10.3
Setting GRADLE_4_10_3_HOME=/home/jenkins/tools/gradle/4.10.3
Not sending mail to unregistered user noreply@github.com
Build failed in Jenkins: kafka-trunk-jdk11 #1481
Posted by Apache Jenkins Server <je...@builds.apache.org>.
See <https://builds.apache.org/job/kafka-trunk-jdk11/1481/display/redirect?page=changes>
Changes:
[github] KAFKA-9603: Do not turn on bulk loading for segmented stores on stand-by
------------------------------------------
[...truncated 1.40 MB...]
org.apache.kafka.clients.consumer.KafkaConsumerTest > testAssignOnEmptyTopicPartition PASSED
org.apache.kafka.clients.consumer.KafkaConsumerTest > testFetchStableOffsetThrowInCommitted STARTED
org.apache.kafka.clients.consumer.KafkaConsumerTest > testFetchStableOffsetThrowInCommitted PASSED
org.apache.kafka.clients.consumer.KafkaConsumerTest > testUnsubscribeShouldTriggerPartitionsLostWithNoGeneration STARTED
org.apache.kafka.clients.consumer.KafkaConsumerTest > testUnsubscribeShouldTriggerPartitionsLostWithNoGeneration PASSED
org.apache.kafka.clients.consumer.KafkaConsumerTest > testSubscriptionOnNullTopic STARTED
org.apache.kafka.clients.consumer.KafkaConsumerTest > testSubscriptionOnNullTopic PASSED
org.apache.kafka.clients.consumer.KafkaConsumerTest > testSubscription STARTED
org.apache.kafka.clients.consumer.KafkaConsumerTest > testSubscription PASSED
org.apache.kafka.clients.consumer.KafkaConsumerTest > testInterceptorConstructorClose STARTED
org.apache.kafka.clients.consumer.KafkaConsumerTest > testInterceptorConstructorClose PASSED
org.apache.kafka.clients.consumer.KafkaConsumerTest > testSubscriptionOnEmptyTopic STARTED
org.apache.kafka.clients.consumer.KafkaConsumerTest > testSubscriptionOnEmptyTopic PASSED
org.apache.kafka.clients.consumer.KafkaConsumerTest > testWakeupWithFetchDataAvailable STARTED
org.apache.kafka.clients.consumer.KafkaConsumerTest > testWakeupWithFetchDataAvailable PASSED
org.apache.kafka.clients.consumer.KafkaConsumerTest > testReturnRecordsDuringRebalance STARTED
org.apache.kafka.clients.consumer.KafkaConsumerTest > testReturnRecordsDuringRebalance PASSED
org.apache.kafka.clients.consumer.KafkaConsumerTest > testLeaveGroupTimeout STARTED
org.apache.kafka.clients.consumer.KafkaConsumerTest > testLeaveGroupTimeout PASSED
org.apache.kafka.clients.consumer.KafkaConsumerTest > testFetchStableOffsetThrowInPoll STARTED
org.apache.kafka.clients.consumer.KafkaConsumerTest > testFetchStableOffsetThrowInPoll PASSED
org.apache.kafka.clients.consumer.KafkaConsumerTest > testPartitionsForAuthenticationFailure STARTED
org.apache.kafka.clients.consumer.KafkaConsumerTest > testPartitionsForAuthenticationFailure PASSED
org.apache.kafka.clients.consumer.KafkaConsumerTest > testSubscriptionOnNullTopicCollection STARTED
org.apache.kafka.clients.consumer.KafkaConsumerTest > testSubscriptionOnNullTopicCollection PASSED
org.apache.kafka.clients.consumer.KafkaConsumerTest > testCloseWithTimeUnit STARTED
org.apache.kafka.clients.consumer.KafkaConsumerTest > testCloseWithTimeUnit PASSED
org.apache.kafka.clients.CommonClientConfigsTest > testExponentialBackoffDefaults STARTED
org.apache.kafka.clients.CommonClientConfigsTest > testExponentialBackoffDefaults PASSED
org.apache.kafka.clients.FetchSessionHandlerTest > testSessionless STARTED
org.apache.kafka.clients.FetchSessionHandlerTest > testSessionless PASSED
org.apache.kafka.clients.FetchSessionHandlerTest > testVerifyFullFetchResponsePartitions STARTED
org.apache.kafka.clients.FetchSessionHandlerTest > testVerifyFullFetchResponsePartitions PASSED
org.apache.kafka.clients.FetchSessionHandlerTest > testIncrementals STARTED
org.apache.kafka.clients.FetchSessionHandlerTest > testIncrementals PASSED
org.apache.kafka.clients.FetchSessionHandlerTest > testIncrementalPartitionRemoval STARTED
org.apache.kafka.clients.FetchSessionHandlerTest > testIncrementalPartitionRemoval PASSED
org.apache.kafka.clients.FetchSessionHandlerTest > testFindMissing STARTED
org.apache.kafka.clients.FetchSessionHandlerTest > testFindMissing PASSED
org.apache.kafka.clients.FetchSessionHandlerTest > testDoubleBuild STARTED
org.apache.kafka.clients.FetchSessionHandlerTest > testDoubleBuild PASSED
org.apache.kafka.clients.admin.RemoveMembersFromConsumerGroupOptionsTest > testConstructor STARTED
org.apache.kafka.clients.admin.RemoveMembersFromConsumerGroupOptionsTest > testConstructor PASSED
org.apache.kafka.clients.admin.internals.AdminMetadataManagerTest > testAuthenticationFailure STARTED
org.apache.kafka.clients.admin.internals.AdminMetadataManagerTest > testAuthenticationFailure PASSED
org.apache.kafka.clients.admin.internals.AdminMetadataManagerTest > testMetadataReady STARTED
org.apache.kafka.clients.admin.internals.AdminMetadataManagerTest > testMetadataReady PASSED
org.apache.kafka.clients.admin.internals.AdminMetadataManagerTest > testMetadataRefreshBackoff STARTED
org.apache.kafka.clients.admin.internals.AdminMetadataManagerTest > testMetadataRefreshBackoff PASSED
org.apache.kafka.clients.admin.DeleteConsumerGroupOffsetsResultTest > testPartitionMissingInResponseErrorConstructor STARTED
org.apache.kafka.clients.admin.DeleteConsumerGroupOffsetsResultTest > testPartitionMissingInResponseErrorConstructor PASSED
org.apache.kafka.clients.admin.DeleteConsumerGroupOffsetsResultTest > testPartitionLevelErrorConstructor STARTED
org.apache.kafka.clients.admin.DeleteConsumerGroupOffsetsResultTest > testPartitionLevelErrorConstructor PASSED
org.apache.kafka.clients.admin.DeleteConsumerGroupOffsetsResultTest > testTopLevelErrorConstructor STARTED
org.apache.kafka.clients.admin.DeleteConsumerGroupOffsetsResultTest > testTopLevelErrorConstructor PASSED
org.apache.kafka.clients.admin.DeleteConsumerGroupOffsetsResultTest > testNoErrorConstructor STARTED
org.apache.kafka.clients.admin.DeleteConsumerGroupOffsetsResultTest > testNoErrorConstructor PASSED
org.apache.kafka.clients.admin.DeleteConsumerGroupOffsetsResultTest > testPartitionMissingInRequestErrorConstructor STARTED
org.apache.kafka.clients.admin.DeleteConsumerGroupOffsetsResultTest > testPartitionMissingInRequestErrorConstructor PASSED
org.apache.kafka.clients.ClientUtilsTest > testFilterPreferredAddresses STARTED
org.apache.kafka.clients.ClientUtilsTest > testFilterPreferredAddresses PASSED
org.apache.kafka.clients.ClientUtilsTest > testResolveUnknownHostException STARTED
org.apache.kafka.clients.ClientUtilsTest > testResolveUnknownHostException PASSED
org.apache.kafka.clients.ClientUtilsTest > testOnlyBadHostname STARTED
org.apache.kafka.clients.ClientUtilsTest > testOnlyBadHostname PASSED
org.apache.kafka.clients.ClientUtilsTest > testInvalidConfig STARTED
org.apache.kafka.clients.ClientUtilsTest > testInvalidConfig PASSED
org.apache.kafka.clients.ClientUtilsTest > testResolveDnsLookupAllIps STARTED
org.apache.kafka.clients.ClientUtilsTest > testResolveDnsLookupAllIps PASSED
org.apache.kafka.clients.ClientUtilsTest > testResolveDnsLookup STARTED
org.apache.kafka.clients.ClientUtilsTest > testResolveDnsLookup PASSED
org.apache.kafka.clients.ClientUtilsTest > testParseAndValidateAddresses STARTED
org.apache.kafka.clients.ClientUtilsTest > testParseAndValidateAddresses PASSED
org.apache.kafka.clients.ClientUtilsTest > testParseAndValidateAddressesWithReverseLookup STARTED
org.apache.kafka.clients.ClientUtilsTest > testParseAndValidateAddressesWithReverseLookup PASSED
org.apache.kafka.clients.ClientUtilsTest > testNoPort STARTED
org.apache.kafka.clients.ClientUtilsTest > testNoPort PASSED
> Task :core:processResources NO-SOURCE
> Task :core:classes
> Task :core:checkstyleMain
> Task :core:compileTestJava NO-SOURCE
> Task :core:compileTestScala
[Warn] /home/jenkins/jenkins-slave/workspace/kafka-trunk-jdk11/core/src/test/scala/unit/kafka/server/BaseRequestTest.scala:90: parameter value nn in method receive is never used
[Warn] /home/jenkins/jenkins-slave/workspace/kafka-trunk-jdk11/core/src/test/scala/integration/kafka/api/AdminClientWithPoliciesIntegrationTest.scala:127: method alterConfigs in trait Admin is deprecated: see corresponding Javadoc for more information.
[Warn] /home/jenkins/jenkins-slave/workspace/kafka-trunk-jdk11/core/src/test/scala/integration/kafka/api/AdminClientWithPoliciesIntegrationTest.scala:157: method alterConfigs in trait Admin is deprecated: see corresponding Javadoc for more information.
[Warn] /home/jenkins/jenkins-slave/workspace/kafka-trunk-jdk11/core/src/test/scala/integration/kafka/api/AuthorizerIntegrationTest.scala:967: method poll in class KafkaConsumer is deprecated: see corresponding Javadoc for more information.
[Warn] /home/jenkins/jenkins-slave/workspace/kafka-trunk-jdk11/core/src/test/scala/integration/kafka/api/AuthorizerIntegrationTest.scala:1017: method poll in class KafkaConsumer is deprecated: see corresponding Javadoc for more information.
[Warn] /home/jenkins/jenkins-slave/workspace/kafka-trunk-jdk11/core/src/test/scala/integration/kafka/api/AuthorizerIntegrationTest.scala:1046: method poll in class KafkaConsumer is deprecated: see corresponding Javadoc for more information.
[Warn] /home/jenkins/jenkins-slave/workspace/kafka-trunk-jdk11/core/src/test/scala/integration/kafka/api/BaseProducerSendTest.scala:127: method checksum in class RecordMetadata is deprecated: see corresponding Javadoc for more information.
[Warn] /home/jenkins/jenkins-slave/workspace/kafka-trunk-jdk11/core/src/test/scala/integration/kafka/api/ConsumerBounceTest.scala:102: method poll in class KafkaConsumer is deprecated: see corresponding Javadoc for more information.
[Warn] /home/jenkins/jenkins-slave/workspace/kafka-trunk-jdk11/core/src/test/scala/integration/kafka/api/ConsumerBounceTest.scala:392: method poll in class KafkaConsumer is deprecated: see corresponding Javadoc for more information.
[Warn] /home/jenkins/jenkins-slave/workspace/kafka-trunk-jdk11/core/src/test/scala/integration/kafka/api/PlaintextAdminIntegrationTest.scala:2189: method alterConfigs in trait Admin is deprecated: see corresponding Javadoc for more information.
[Warn] /home/jenkins/jenkins-slave/workspace/kafka-trunk-jdk11/core/src/test/scala/integration/kafka/api/PlaintextAdminIntegrationTest.scala:2244: method alterConfigs in trait Admin is deprecated: see corresponding Javadoc for more information.
[Warn] /home/jenkins/jenkins-slave/workspace/kafka-trunk-jdk11/core/src/test/scala/integration/kafka/api/PlaintextAdminIntegrationTest.scala:2276: method alterConfigs in trait Admin is deprecated: see corresponding Javadoc for more information.
[Warn] /home/jenkins/jenkins-slave/workspace/kafka-trunk-jdk11/core/src/test/scala/integration/kafka/api/PlaintextAdminIntegrationTest.scala:2317: method alterConfigs in trait Admin is deprecated: see corresponding Javadoc for more information.
[Warn] /home/jenkins/jenkins-slave/workspace/kafka-trunk-jdk11/core/src/test/scala/integration/kafka/api/PlaintextAdminIntegrationTest.scala:2345: method alterConfigs in trait Admin is deprecated: see corresponding Javadoc for more information.
[Warn] /home/jenkins/jenkins-slave/workspace/kafka-trunk-jdk11/core/src/test/scala/integration/kafka/api/SaslSslAdminIntegrationTest.scala:51: class LegacyAuthorizationAdmin in class SaslSslAdminIntegrationTest is deprecated (since Since 2.5): Use kafka.security.authorizer.AclAuthorizer
[Warn] /home/jenkins/jenkins-slave/workspace/kafka-trunk-jdk11/core/src/test/scala/integration/kafka/server/DynamicBrokerReconfigurationTest.scala:1341: method alterConfigs in trait Admin is deprecated: see corresponding Javadoc for more information.
[Warn] /home/jenkins/jenkins-slave/workspace/kafka-trunk-jdk11/core/src/test/scala/integration/kafka/server/DynamicBrokerReconfigurationTest.scala:1360: method alterConfigs in trait Admin is deprecated: see corresponding Javadoc for more information.
[Warn] /home/jenkins/jenkins-slave/workspace/kafka-trunk-jdk11/core/src/test/scala/integration/kafka/server/DynamicBrokerReconfigurationTest.scala:1377: method alterConfigs in trait Admin is deprecated: see corresponding Javadoc for more information.
[Warn] /home/jenkins/jenkins-slave/workspace/kafka-trunk-jdk11/core/src/test/scala/unit/kafka/integration/UncleanLeaderElectionTest.scala:357: method alterConfigs in trait Admin is deprecated: see corresponding Javadoc for more information.
[Warn] /home/jenkins/jenkins-slave/workspace/kafka-trunk-jdk11/core/src/test/scala/unit/kafka/tools/MirrorMakerTest.scala:35: class BaseConsumerRecord in package consumer is deprecated (since 0.11.0.0): This class has been deprecated and will be removed in a future release. Please use org.apache.kafka.clients.consumer.ConsumerRecord instead.
[Warn] /home/jenkins/jenkins-slave/workspace/kafka-trunk-jdk11/core/src/test/scala/unit/kafka/tools/MirrorMakerTest.scala:50: class BaseConsumerRecord in package consumer is deprecated (since 0.11.0.0): This class has been deprecated and will be removed in a future release. Please use org.apache.kafka.clients.consumer.ConsumerRecord instead.
[Warn] /home/jenkins/jenkins-slave/workspace/kafka-trunk-jdk11/core/src/test/scala/unit/kafka/tools/MirrorMakerTest.scala:67: class BaseConsumerRecord in package consumer is deprecated (since 0.11.0.0): This class has been deprecated and will be removed in a future release. Please use org.apache.kafka.clients.consumer.ConsumerRecord instead.
FATAL: command execution failed
java.io.EOFException
at java.io.ObjectInputStream$PeekInputStream.readFully(ObjectInputStream.java:2681)
at java.io.ObjectInputStream$BlockDataInputStream.readShort(ObjectInputStream.java:3156)
at java.io.ObjectInputStream.readStreamHeader(ObjectInputStream.java:862)
at java.io.ObjectInputStream.<init>(ObjectInputStream.java:358)
at hudson.remoting.ObjectInputStreamEx.<init>(ObjectInputStreamEx.java:49)
at hudson.remoting.Command.readFrom(Command.java:140)
at hudson.remoting.Command.readFrom(Command.java:126)
at hudson.remoting.AbstractSynchronousByteArrayCommandTransport.read(AbstractSynchronousByteArrayCommandTransport.java:36)
at hudson.remoting.SynchronousCommandTransport$ReaderThread.run(SynchronousCommandTransport.java:63)
Caused: java.io.IOException: Unexpected termination of the channel
at hudson.remoting.SynchronousCommandTransport$ReaderThread.run(SynchronousCommandTransport.java:77)
Caused: java.io.IOException: Backing channel 'H29' is disconnected.
at hudson.remoting.RemoteInvocationHandler.channelOrFail(RemoteInvocationHandler.java:214)
at hudson.remoting.RemoteInvocationHandler.invoke(RemoteInvocationHandler.java:283)
at com.sun.proxy.$Proxy141.isAlive(Unknown Source)
at hudson.Launcher$RemoteLauncher$ProcImpl.isAlive(Launcher.java:1150)
at hudson.Launcher$RemoteLauncher$ProcImpl.join(Launcher.java:1142)
at hudson.tasks.CommandInterpreter.join(CommandInterpreter.java:155)
at hudson.tasks.CommandInterpreter.perform(CommandInterpreter.java:109)
at hudson.tasks.CommandInterpreter.perform(CommandInterpreter.java:66)
at hudson.tasks.BuildStepMonitor$1.perform(BuildStepMonitor.java:20)
at hudson.model.AbstractBuild$AbstractBuildExecution.perform(AbstractBuild.java:741)
at hudson.model.Build$BuildExecution.build(Build.java:206)
at hudson.model.Build$BuildExecution.doRun(Build.java:163)
at hudson.model.AbstractBuild$AbstractBuildExecution.run(AbstractBuild.java:504)
at hudson.model.Run.execute(Run.java:1815)
at hudson.model.FreeStyleBuild.run(FreeStyleBuild.java:43)
at hudson.model.ResourceController.execute(ResourceController.java:97)
at hudson.model.Executor.run(Executor.java:429)
FATAL: Unable to delete script file /tmp/jenkins6299772394156194977.sh
java.io.EOFException
at java.io.ObjectInputStream$PeekInputStream.readFully(ObjectInputStream.java:2681)
at java.io.ObjectInputStream$BlockDataInputStream.readShort(ObjectInputStream.java:3156)
at java.io.ObjectInputStream.readStreamHeader(ObjectInputStream.java:862)
at java.io.ObjectInputStream.<init>(ObjectInputStream.java:358)
at hudson.remoting.ObjectInputStreamEx.<init>(ObjectInputStreamEx.java:49)
at hudson.remoting.Command.readFrom(Command.java:140)
at hudson.remoting.Command.readFrom(Command.java:126)
at hudson.remoting.AbstractSynchronousByteArrayCommandTransport.read(AbstractSynchronousByteArrayCommandTransport.java:36)
at hudson.remoting.SynchronousCommandTransport$ReaderThread.run(SynchronousCommandTransport.java:63)
Caused: java.io.IOException: Unexpected termination of the channel
at hudson.remoting.SynchronousCommandTransport$ReaderThread.run(SynchronousCommandTransport.java:77)
Caused: hudson.remoting.ChannelClosedException: Channel "unknown": Remote call on H29 failed. The channel is closing down or has closed down
at hudson.remoting.Channel.call(Channel.java:950)
at hudson.FilePath.act(FilePath.java:1072)
at hudson.FilePath.act(FilePath.java:1061)
at hudson.FilePath.delete(FilePath.java:1542)
at hudson.tasks.CommandInterpreter.perform(CommandInterpreter.java:123)
at hudson.tasks.CommandInterpreter.perform(CommandInterpreter.java:66)
at hudson.tasks.BuildStepMonitor$1.perform(BuildStepMonitor.java:20)
at hudson.model.AbstractBuild$AbstractBuildExecution.perform(AbstractBuild.java:741)
at hudson.model.Build$BuildExecution.build(Build.java:206)
at hudson.model.Build$BuildExecution.doRun(Build.java:163)
at hudson.model.AbstractBuild$AbstractBuildExecution.run(AbstractBuild.java:504)
at hudson.model.Run.execute(Run.java:1815)
at hudson.model.FreeStyleBuild.run(FreeStyleBuild.java:43)
at hudson.model.ResourceController.execute(ResourceController.java:97)
at hudson.model.Executor.run(Executor.java:429)
Build step 'Execute shell' marked build as failure
ERROR: Step ?Publish JUnit test result report? failed: no workspace for kafka-trunk-jdk11 #1481
ERROR: H29 is offline; cannot locate JDK 11 (latest)
ERROR: No tool found matching GRADLE_4_10_2_HOME
ERROR: H29 is offline; cannot locate Gradle 4.10.3
Setting GRADLE_4_10_3_HOME=/home/jenkins/tools/gradle/4.10.3
Not sending mail to unregistered user noreply@github.com
Build failed in Jenkins: kafka-trunk-jdk11 #1480
Posted by Apache Jenkins Server <je...@builds.apache.org>.
See <https://builds.apache.org/job/kafka-trunk-jdk11/1480/display/redirect?page=changes>
Changes:
[github] KAFKA-9859 / kafka-streams-application-reset tool doesn't take into
------------------------------------------
[...truncated 3.04 MB...]
> Task :streams:upgrade-system-tests-11:testClasses
> Task :streams:streams-scala:spotbugsMain
> Task :streams:upgrade-system-tests-11:checkstyleTest
> Task :streams:test-utils:spotbugsMain
> Task :streams:streams-scala:test
org.apache.kafka.streams.scala.kstream.SuppressedTest > Suppressed.untilWindowCloses should produce the correct suppression STARTED
org.apache.kafka.streams.scala.kstream.ProducedTest > Create a Produced should create a Produced with Serdes STARTED
org.apache.kafka.streams.scala.kstream.SuppressedTest > Suppressed.untilWindowCloses should produce the correct suppression PASSED
org.apache.kafka.streams.scala.kstream.ProducedTest > Create a Produced should create a Produced with Serdes PASSED
org.apache.kafka.streams.scala.kstream.SuppressedTest > Suppressed.untilTimeLimit should produce the correct suppression STARTED
org.apache.kafka.streams.scala.kstream.SuppressedTest > Suppressed.untilTimeLimit should produce the correct suppression PASSED
org.apache.kafka.streams.scala.kstream.SuppressedTest > BufferConfig.maxRecords should produce the correct buffer config STARTED
org.apache.kafka.streams.scala.kstream.SuppressedTest > BufferConfig.maxRecords should produce the correct buffer config PASSED
org.apache.kafka.streams.scala.kstream.SuppressedTest > BufferConfig.maxBytes should produce the correct buffer config STARTED
org.apache.kafka.streams.scala.kstream.SuppressedTest > BufferConfig.maxBytes should produce the correct buffer config PASSED
org.apache.kafka.streams.scala.kstream.SuppressedTest > BufferConfig.unbounded should produce the correct buffer config STARTED
org.apache.kafka.streams.scala.kstream.SuppressedTest > BufferConfig.unbounded should produce the correct buffer config PASSED
org.apache.kafka.streams.scala.kstream.SuppressedTest > BufferConfig should support very long chains of factory methods STARTED
org.apache.kafka.streams.scala.kstream.SuppressedTest > BufferConfig should support very long chains of factory methods PASSED
org.apache.kafka.streams.scala.kstream.ProducedTest > Create a Produced with timestampExtractor and resetPolicy should create a Consumed with Serdes, timestampExtractor and resetPolicy STARTED
org.apache.kafka.streams.scala.kstream.ProducedTest > Create a Produced with timestampExtractor and resetPolicy should create a Consumed with Serdes, timestampExtractor and resetPolicy PASSED
org.apache.kafka.streams.scala.kstream.JoinedTest > Create a Joined should create a Joined with Serdes STARTED
org.apache.kafka.streams.scala.kstream.JoinedTest > Create a Joined should create a Joined with Serdes PASSED
org.apache.kafka.streams.scala.kstream.JoinedTest > Create a Joined should create a Joined with Serdes and repartition topic name STARTED
org.apache.kafka.streams.scala.kstream.JoinedTest > Create a Joined should create a Joined with Serdes and repartition topic name PASSED
org.apache.kafka.streams.scala.kstream.MaterializedTest > Create a Materialized should create a Materialized with Serdes STARTED
org.apache.kafka.streams.scala.kstream.MaterializedTest > Create a Materialized should create a Materialized with Serdes PASSED
org.apache.kafka.streams.scala.kstream.ConsumedTest > Create a Consumed should create a Consumed with Serdes STARTED
org.apache.kafka.streams.scala.kstream.MaterializedTest > Create a Materialize with a store name should create a Materialized with Serdes and a store name STARTED
org.apache.kafka.streams.scala.kstream.ConsumedTest > Create a Consumed should create a Consumed with Serdes PASSED
org.apache.kafka.streams.scala.kstream.ConsumedTest > Create a Consumed with timestampExtractor and resetPolicy should create a Consumed with Serdes, timestampExtractor and resetPolicy STARTED
org.apache.kafka.streams.scala.kstream.MaterializedTest > Create a Materialize with a store name should create a Materialized with Serdes and a store name PASSED
org.apache.kafka.streams.scala.kstream.MaterializedTest > Create a Materialize with a window store supplier should create a Materialized with Serdes and a store supplier STARTED
org.apache.kafka.streams.scala.kstream.MaterializedTest > Create a Materialize with a window store supplier should create a Materialized with Serdes and a store supplier PASSED
org.apache.kafka.streams.scala.kstream.MaterializedTest > Create a Materialize with a key value store supplier should create a Materialized with Serdes and a store supplier STARTED
org.apache.kafka.streams.scala.kstream.MaterializedTest > Create a Materialize with a key value store supplier should create a Materialized with Serdes and a store supplier PASSED
org.apache.kafka.streams.scala.kstream.MaterializedTest > Create a Materialize with a session store supplier should create a Materialized with Serdes and a store supplier STARTED
org.apache.kafka.streams.scala.kstream.MaterializedTest > Create a Materialize with a session store supplier should create a Materialized with Serdes and a store supplier PASSED
org.apache.kafka.streams.scala.kstream.GroupedTest > Create a Grouped should create a Grouped with Serdes STARTED
org.apache.kafka.streams.scala.kstream.GroupedTest > Create a Grouped should create a Grouped with Serdes PASSED
org.apache.kafka.streams.scala.kstream.GroupedTest > Create a Grouped with repartition topic name should create a Grouped with Serdes, and repartition topic name STARTED
org.apache.kafka.streams.scala.kstream.GroupedTest > Create a Grouped with repartition topic name should create a Grouped with Serdes, and repartition topic name PASSED
org.apache.kafka.streams.scala.kstream.KTableTest > filter a KTable should filter records satisfying the predicate STARTED
org.apache.kafka.streams.scala.kstream.ConsumedTest > Create a Consumed with timestampExtractor and resetPolicy should create a Consumed with Serdes, timestampExtractor and resetPolicy PASSED
org.apache.kafka.streams.scala.kstream.ConsumedTest > Create a Consumed with timestampExtractor should create a Consumed with Serdes and timestampExtractor STARTED
org.apache.kafka.streams.scala.kstream.ConsumedTest > Create a Consumed with timestampExtractor should create a Consumed with Serdes and timestampExtractor PASSED
org.apache.kafka.streams.scala.kstream.ConsumedTest > Create a Consumed with resetPolicy should create a Consumed with Serdes and resetPolicy STARTED
org.apache.kafka.streams.scala.kstream.ConsumedTest > Create a Consumed with resetPolicy should create a Consumed with Serdes and resetPolicy PASSED
org.apache.kafka.streams.scala.kstream.KStreamTest > filter a KStream should filter records satisfying the predicate STARTED
org.apache.kafka.streams.scala.kstream.KStreamTest > filter a KStream should filter records satisfying the predicate PASSED
org.apache.kafka.streams.scala.kstream.KStreamTest > filterNot a KStream should filter records not satisfying the predicate STARTED
org.apache.kafka.streams.scala.kstream.KStreamTest > filterNot a KStream should filter records not satisfying the predicate PASSED
org.apache.kafka.streams.scala.kstream.KStreamTest > foreach a KStream should run foreach actions on records STARTED
org.apache.kafka.streams.scala.kstream.KStreamTest > foreach a KStream should run foreach actions on records PASSED
org.apache.kafka.streams.scala.kstream.KStreamTest > peek a KStream should run peek actions on records STARTED
org.apache.kafka.streams.scala.kstream.KStreamTest > peek a KStream should run peek actions on records PASSED
org.apache.kafka.streams.scala.kstream.KStreamTest > selectKey a KStream should select a new key STARTED
org.apache.kafka.streams.scala.kstream.KStreamTest > selectKey a KStream should select a new key PASSED
org.apache.kafka.streams.scala.kstream.KStreamTest > join 2 KStreams should join correctly records STARTED
org.apache.kafka.streams.scala.kstream.KTableTest > filter a KTable should filter records satisfying the predicate PASSED
org.apache.kafka.streams.scala.kstream.KTableTest > filterNot a KTable should filter records not satisfying the predicate STARTED
org.apache.kafka.streams.scala.kstream.KStreamTest > join 2 KStreams should join correctly records PASSED
org.apache.kafka.streams.scala.kstream.KStreamTest > transform a KStream should transform correctly records STARTED
org.apache.kafka.streams.scala.kstream.KStreamTest > transform a KStream should transform correctly records PASSED
org.apache.kafka.streams.scala.kstream.KStreamTest > flatTransform a KStream should flatTransform correctly records STARTED
org.apache.kafka.streams.scala.kstream.KStreamTest > flatTransform a KStream should flatTransform correctly records PASSED
org.apache.kafka.streams.scala.kstream.KStreamTest > flatTransformValues a KStream should correctly flatTransform values in records STARTED
org.apache.kafka.streams.scala.kstream.KStreamTest > flatTransformValues a KStream should correctly flatTransform values in records PASSED
org.apache.kafka.streams.scala.kstream.KStreamTest > flatTransformValues with key in a KStream should correctly flatTransformValues in records STARTED
org.apache.kafka.streams.scala.kstream.KStreamTest > flatTransformValues with key in a KStream should correctly flatTransformValues in records PASSED
org.apache.kafka.streams.scala.kstream.KStreamTest > join 2 KStreamToTables should join correctly records STARTED
org.apache.kafka.streams.scala.kstream.KTableTest > filterNot a KTable should filter records not satisfying the predicate PASSED
org.apache.kafka.streams.scala.kstream.KTableTest > join 2 KTables should join correctly records STARTED
org.apache.kafka.streams.scala.kstream.KStreamTest > join 2 KStreamToTables should join correctly records PASSED
org.apache.kafka.streams.scala.TopologyTest > shouldBuildIdenticalTopologyInJavaNScalaJoin STARTED
org.apache.kafka.streams.scala.TopologyTest > shouldBuildIdenticalTopologyInJavaNScalaJoin PASSED
org.apache.kafka.streams.scala.TopologyTest > shouldBuildIdenticalTopologyInJavaNScalaCogroup STARTED
org.apache.kafka.streams.scala.TopologyTest > shouldBuildIdenticalTopologyInJavaNScalaCogroup PASSED
org.apache.kafka.streams.scala.TopologyTest > shouldBuildIdenticalTopologyInJavaNScalaSimple STARTED
org.apache.kafka.streams.scala.TopologyTest > shouldBuildIdenticalTopologyInJavaNScalaSimple PASSED
org.apache.kafka.streams.scala.TopologyTest > shouldBuildIdenticalTopologyInJavaNScalaCogroupSimple STARTED
org.apache.kafka.streams.scala.TopologyTest > shouldBuildIdenticalTopologyInJavaNScalaCogroupSimple PASSED
org.apache.kafka.streams.scala.TopologyTest > shouldBuildIdenticalTopologyInJavaNScalaAggregate STARTED
org.apache.kafka.streams.scala.TopologyTest > shouldBuildIdenticalTopologyInJavaNScalaAggregate PASSED
org.apache.kafka.streams.scala.TopologyTest > shouldBuildIdenticalTopologyInJavaNScalaProperties STARTED
org.apache.kafka.streams.scala.TopologyTest > shouldBuildIdenticalTopologyInJavaNScalaProperties PASSED
org.apache.kafka.streams.scala.TopologyTest > shouldBuildIdenticalTopologyInJavaNScalaTransform STARTED
org.apache.kafka.streams.scala.TopologyTest > shouldBuildIdenticalTopologyInJavaNScalaTransform PASSED
org.apache.kafka.streams.scala.WordCountTest > testShouldCountWordsMaterialized STARTED
org.apache.kafka.streams.scala.kstream.KTableTest > join 2 KTables should join correctly records PASSED
org.apache.kafka.streams.scala.kstream.KTableTest > join 2 KTables with a Materialized should join correctly records and state store STARTED
org.apache.kafka.streams.scala.kstream.KTableTest > join 2 KTables with a Materialized should join correctly records and state store PASSED
org.apache.kafka.streams.scala.kstream.KTableTest > windowed KTable#suppress should correctly suppress results using Suppressed.untilTimeLimit STARTED
FATAL: command execution failed
java.io.EOFException
at java.io.ObjectInputStream$PeekInputStream.readFully(ObjectInputStream.java:2681)
at java.io.ObjectInputStream$BlockDataInputStream.readShort(ObjectInputStream.java:3156)
at java.io.ObjectInputStream.readStreamHeader(ObjectInputStream.java:862)
at java.io.ObjectInputStream.<init>(ObjectInputStream.java:358)
at hudson.remoting.ObjectInputStreamEx.<init>(ObjectInputStreamEx.java:49)
at hudson.remoting.Command.readFrom(Command.java:140)
at hudson.remoting.Command.readFrom(Command.java:126)
at hudson.remoting.AbstractSynchronousByteArrayCommandTransport.read(AbstractSynchronousByteArrayCommandTransport.java:36)
at hudson.remoting.SynchronousCommandTransport$ReaderThread.run(SynchronousCommandTransport.java:63)
Caused: java.io.IOException: Unexpected termination of the channel
at hudson.remoting.SynchronousCommandTransport$ReaderThread.run(SynchronousCommandTransport.java:77)
Caused: java.io.IOException: Backing channel 'H30' is disconnected.
at hudson.remoting.RemoteInvocationHandler.channelOrFail(RemoteInvocationHandler.java:214)
at hudson.remoting.RemoteInvocationHandler.invoke(RemoteInvocationHandler.java:283)
at com.sun.proxy.$Proxy141.isAlive(Unknown Source)
at hudson.Launcher$RemoteLauncher$ProcImpl.isAlive(Launcher.java:1150)
at hudson.Launcher$RemoteLauncher$ProcImpl.join(Launcher.java:1142)
at hudson.tasks.CommandInterpreter.join(CommandInterpreter.java:155)
at hudson.tasks.CommandInterpreter.perform(CommandInterpreter.java:109)
at hudson.tasks.CommandInterpreter.perform(CommandInterpreter.java:66)
at hudson.tasks.BuildStepMonitor$1.perform(BuildStepMonitor.java:20)
at hudson.model.AbstractBuild$AbstractBuildExecution.perform(AbstractBuild.java:741)
at hudson.model.Build$BuildExecution.build(Build.java:206)
at hudson.model.Build$BuildExecution.doRun(Build.java:163)
at hudson.model.AbstractBuild$AbstractBuildExecution.run(AbstractBuild.java:504)
at hudson.model.Run.execute(Run.java:1815)
at hudson.model.FreeStyleBuild.run(FreeStyleBuild.java:43)
at hudson.model.ResourceController.execute(ResourceController.java:97)
at hudson.model.Executor.run(Executor.java:429)
FATAL: Unable to delete script file /tmp/jenkins6264076022663478920.sh
java.io.EOFException
at java.io.ObjectInputStream$PeekInputStream.readFully(ObjectInputStream.java:2681)
at java.io.ObjectInputStream$BlockDataInputStream.readShort(ObjectInputStream.java:3156)
at java.io.ObjectInputStream.readStreamHeader(ObjectInputStream.java:862)
at java.io.ObjectInputStream.<init>(ObjectInputStream.java:358)
at hudson.remoting.ObjectInputStreamEx.<init>(ObjectInputStreamEx.java:49)
at hudson.remoting.Command.readFrom(Command.java:140)
at hudson.remoting.Command.readFrom(Command.java:126)
at hudson.remoting.AbstractSynchronousByteArrayCommandTransport.read(AbstractSynchronousByteArrayCommandTransport.java:36)
at hudson.remoting.SynchronousCommandTransport$ReaderThread.run(SynchronousCommandTransport.java:63)
Caused: java.io.IOException: Unexpected termination of the channel
at hudson.remoting.SynchronousCommandTransport$ReaderThread.run(SynchronousCommandTransport.java:77)
Caused: hudson.remoting.ChannelClosedException: Channel "unknown": Remote call on H30 failed. The channel is closing down or has closed down
at hudson.remoting.Channel.call(Channel.java:950)
at hudson.FilePath.act(FilePath.java:1072)
at hudson.FilePath.act(FilePath.java:1061)
at hudson.FilePath.delete(FilePath.java:1542)
at hudson.tasks.CommandInterpreter.perform(CommandInterpreter.java:123)
at hudson.tasks.CommandInterpreter.perform(CommandInterpreter.java:66)
at hudson.tasks.BuildStepMonitor$1.perform(BuildStepMonitor.java:20)
at hudson.model.AbstractBuild$AbstractBuildExecution.perform(AbstractBuild.java:741)
at hudson.model.Build$BuildExecution.build(Build.java:206)
at hudson.model.Build$BuildExecution.doRun(Build.java:163)
at hudson.model.AbstractBuild$AbstractBuildExecution.run(AbstractBuild.java:504)
at hudson.model.Run.execute(Run.java:1815)
at hudson.model.FreeStyleBuild.run(FreeStyleBuild.java:43)
at hudson.model.ResourceController.execute(ResourceController.java:97)
at hudson.model.Executor.run(Executor.java:429)
Build step 'Execute shell' marked build as failure
ERROR: Step ?Publish JUnit test result report? failed: no workspace for kafka-trunk-jdk11 #1480
ERROR: H30 is offline; cannot locate JDK 11 (latest)
ERROR: No tool found matching GRADLE_4_10_2_HOME
ERROR: H30 is offline; cannot locate Gradle 4.10.3
Setting GRADLE_4_10_3_HOME=/home/jenkins/tools/gradle/4.10.3
Not sending mail to unregistered user noreply@github.com
Build failed in Jenkins: kafka-trunk-jdk11 #1479
Posted by Apache Jenkins Server <je...@builds.apache.org>.
See <https://builds.apache.org/job/kafka-trunk-jdk11/1479/display/redirect?page=changes>
Changes:
[github] MINOR: Fix redundant typos in comments and javadocs (#8693)
------------------------------------------
[...truncated 1.77 MB...]
kafka.controller.ControllerIntegrationTest > testTopicCreation PASSED
kafka.controller.ControllerIntegrationTest > testControllerMoveOnTopicDeletion STARTED
kafka.controller.ControllerIntegrationTest > testControllerMoveOnTopicDeletion PASSED
kafka.controller.ControllerIntegrationTest > testPartitionReassignment STARTED
kafka.controller.ControllerIntegrationTest > testPartitionReassignment PASSED
kafka.controller.ControllerIntegrationTest > testTopicPartitionExpansion STARTED
kafka.controller.ControllerIntegrationTest > testTopicPartitionExpansion PASSED
kafka.controller.ControllerIntegrationTest > testControllerMoveIncrementsControllerEpoch STARTED
kafka.controller.ControllerIntegrationTest > testControllerMoveIncrementsControllerEpoch PASSED
kafka.controller.ControllerIntegrationTest > testLeaderAndIsrWhenEntireIsrOfflineAndUncleanLeaderElectionEnabled STARTED
kafka.controller.ControllerIntegrationTest > testLeaderAndIsrWhenEntireIsrOfflineAndUncleanLeaderElectionEnabled PASSED
kafka.controller.ControllerIntegrationTest > testControllerMoveOnPartitionReassignment STARTED
kafka.controller.ControllerIntegrationTest > testControllerMoveOnPartitionReassignment PASSED
kafka.controller.ControllerIntegrationTest > testControllerMoveOnTopicCreation STARTED
kafka.controller.ControllerIntegrationTest > testControllerMoveOnTopicCreation PASSED
kafka.controller.ControllerIntegrationTest > testControllerRejectControlledShutdownRequestWithStaleBrokerEpoch STARTED
kafka.controller.ControllerIntegrationTest > testControllerRejectControlledShutdownRequestWithStaleBrokerEpoch PASSED
kafka.controller.ControllerIntegrationTest > testBackToBackPreferredReplicaLeaderElections STARTED
kafka.controller.ControllerIntegrationTest > testBackToBackPreferredReplicaLeaderElections PASSED
kafka.controller.ControllerIntegrationTest > testEmptyCluster STARTED
kafka.controller.ControllerIntegrationTest > testEmptyCluster PASSED
kafka.controller.ControllerIntegrationTest > testControllerMoveOnPreferredReplicaElection STARTED
kafka.controller.ControllerIntegrationTest > testControllerMoveOnPreferredReplicaElection PASSED
kafka.controller.ControllerIntegrationTest > testPreferredReplicaLeaderElection STARTED
kafka.controller.ControllerIntegrationTest > testPreferredReplicaLeaderElection PASSED
kafka.controller.ControllerIntegrationTest > testMetadataPropagationOnBrokerChange STARTED
kafka.controller.ControllerIntegrationTest > testMetadataPropagationOnBrokerChange PASSED
kafka.controller.ControllerIntegrationTest > testMetadataPropagationForOfflineReplicas STARTED
kafka.controller.ControllerIntegrationTest > testMetadataPropagationForOfflineReplicas PASSED
kafka.controller.ControllerChannelManagerTest > testStopReplicaRequestWithAlreadyDefinedDeletedPartition STARTED
kafka.controller.ControllerChannelManagerTest > testStopReplicaRequestWithAlreadyDefinedDeletedPartition PASSED
kafka.controller.ControllerChannelManagerTest > testUpdateMetadataInterBrokerProtocolVersion STARTED
kafka.controller.ControllerChannelManagerTest > testUpdateMetadataInterBrokerProtocolVersion PASSED
kafka.controller.ControllerChannelManagerTest > testLeaderAndIsrRequestIsNew STARTED
kafka.controller.ControllerChannelManagerTest > testLeaderAndIsrRequestIsNew PASSED
kafka.controller.ControllerChannelManagerTest > testStopReplicaRequestsWhileTopicQueuedForDeletion STARTED
kafka.controller.ControllerChannelManagerTest > testStopReplicaRequestsWhileTopicQueuedForDeletion PASSED
kafka.controller.ControllerChannelManagerTest > testLeaderAndIsrRequestSentToLiveOrShuttingDownBrokers STARTED
kafka.controller.ControllerChannelManagerTest > testLeaderAndIsrRequestSentToLiveOrShuttingDownBrokers PASSED
kafka.controller.ControllerChannelManagerTest > testStopReplicaInterBrokerProtocolVersion STARTED
kafka.controller.ControllerChannelManagerTest > testStopReplicaInterBrokerProtocolVersion PASSED
kafka.controller.ControllerChannelManagerTest > testStopReplicaSentOnlyToLiveAndShuttingDownBrokers STARTED
kafka.controller.ControllerChannelManagerTest > testStopReplicaSentOnlyToLiveAndShuttingDownBrokers PASSED
kafka.controller.ControllerChannelManagerTest > testStopReplicaGroupsByBroker STARTED
kafka.controller.ControllerChannelManagerTest > testStopReplicaGroupsByBroker PASSED
kafka.controller.ControllerChannelManagerTest > testUpdateMetadataDoesNotIncludePartitionsWithoutLeaderAndIsr STARTED
kafka.controller.ControllerChannelManagerTest > testUpdateMetadataDoesNotIncludePartitionsWithoutLeaderAndIsr PASSED
kafka.controller.ControllerChannelManagerTest > testMixedDeleteAndNotDeleteStopReplicaRequests STARTED
kafka.controller.ControllerChannelManagerTest > testMixedDeleteAndNotDeleteStopReplicaRequests PASSED
kafka.controller.ControllerChannelManagerTest > testLeaderAndIsrInterBrokerProtocolVersion STARTED
kafka.controller.ControllerChannelManagerTest > testLeaderAndIsrInterBrokerProtocolVersion PASSED
kafka.controller.ControllerChannelManagerTest > testUpdateMetadataRequestSent STARTED
kafka.controller.ControllerChannelManagerTest > testUpdateMetadataRequestSent PASSED
kafka.controller.ControllerChannelManagerTest > testUpdateMetadataRequestDuringTopicDeletion STARTED
kafka.controller.ControllerChannelManagerTest > testUpdateMetadataRequestDuringTopicDeletion PASSED
kafka.controller.ControllerChannelManagerTest > testUpdateMetadataIncludesLiveOrShuttingDownBrokers STARTED
kafka.controller.ControllerChannelManagerTest > testUpdateMetadataIncludesLiveOrShuttingDownBrokers PASSED
kafka.controller.ControllerChannelManagerTest > testStopReplicaRequestSent STARTED
kafka.controller.ControllerChannelManagerTest > testStopReplicaRequestSent PASSED
kafka.controller.ControllerChannelManagerTest > testStopReplicaRequestsWhileTopicDeletionStarted STARTED
kafka.controller.ControllerChannelManagerTest > testStopReplicaRequestsWhileTopicDeletionStarted PASSED
kafka.controller.ControllerChannelManagerTest > testLeaderAndIsrRequestSent STARTED
kafka.controller.ControllerChannelManagerTest > testLeaderAndIsrRequestSent PASSED
kafka.controller.ControllerChannelManagerTest > testStopReplicaRequestWithoutDeletePartitionWhileTopicDeletionStarted STARTED
kafka.controller.ControllerChannelManagerTest > testStopReplicaRequestWithoutDeletePartitionWhileTopicDeletionStarted PASSED
unit.kafka.cluster.AssignmentStateTest > testPartitionAssignmentStatus[0] STARTED
unit.kafka.cluster.AssignmentStateTest > testPartitionAssignmentStatus[0] PASSED
unit.kafka.cluster.AssignmentStateTest > testPartitionAssignmentStatus[1] STARTED
unit.kafka.cluster.AssignmentStateTest > testPartitionAssignmentStatus[1] PASSED
unit.kafka.cluster.AssignmentStateTest > testPartitionAssignmentStatus[2] STARTED
unit.kafka.cluster.AssignmentStateTest > testPartitionAssignmentStatus[2] PASSED
unit.kafka.cluster.AssignmentStateTest > testPartitionAssignmentStatus[3] STARTED
unit.kafka.cluster.AssignmentStateTest > testPartitionAssignmentStatus[3] PASSED
unit.kafka.cluster.AssignmentStateTest > testPartitionAssignmentStatus[4] STARTED
unit.kafka.cluster.AssignmentStateTest > testPartitionAssignmentStatus[4] PASSED
unit.kafka.cluster.AssignmentStateTest > testPartitionAssignmentStatus[5] STARTED
unit.kafka.cluster.AssignmentStateTest > testPartitionAssignmentStatus[5] PASSED
unit.kafka.cluster.AssignmentStateTest > testPartitionAssignmentStatus[6] STARTED
unit.kafka.cluster.AssignmentStateTest > testPartitionAssignmentStatus[6] PASSED
unit.kafka.cluster.AssignmentStateTest > testPartitionAssignmentStatus[7] STARTED
unit.kafka.cluster.AssignmentStateTest > testPartitionAssignmentStatus[7] PASSED
unit.kafka.cluster.AssignmentStateTest > testPartitionAssignmentStatus[8] STARTED
unit.kafka.cluster.AssignmentStateTest > testPartitionAssignmentStatus[8] PASSED
ERROR: No tool found matching GRADLE_4_10_2_HOME
ERROR: Could not install GRADLE_4_10_3_HOME
java.lang.NullPointerException
ERROR: No tool found matching GRADLE_4_10_2_HOME
ERROR: Could not install GRADLE_4_10_3_HOME
java.lang.NullPointerException
ERROR: No tool found matching GRADLE_4_10_2_HOME
ERROR: Could not install GRADLE_4_10_3_HOME
java.lang.NullPointerException
ERROR: No tool found matching GRADLE_4_10_2_HOME
ERROR: Could not install GRADLE_4_10_3_HOME
java.lang.NullPointerException
ERROR: No tool found matching GRADLE_4_10_2_HOME
ERROR: Could not install GRADLE_4_10_3_HOME
java.lang.NullPointerException
at hudson.plugins.toolenv.ToolEnvBuildWrapper$1.buildEnvVars(ToolEnvBuildWrapper.java:46)
at hudson.model.AbstractBuild.getEnvironment(AbstractBuild.java:873)
at hudson.plugins.git.GitSCM.getParamExpandedRepos(GitSCM.java:484)
at hudson.plugins.git.GitSCM.compareRemoteRevisionWithImpl(GitSCM.java:693)
at hudson.plugins.git.GitSCM.compareRemoteRevisionWith(GitSCM.java:658)
at hudson.scm.SCM.compareRemoteRevisionWith(SCM.java:400)
at hudson.scm.SCM.poll(SCM.java:417)
at hudson.model.AbstractProject._poll(AbstractProject.java:1390)
at hudson.model.AbstractProject.poll(AbstractProject.java:1293)
at hudson.triggers.SCMTrigger$Runner.runPolling(SCMTrigger.java:603)
at hudson.triggers.SCMTrigger$Runner.run(SCMTrigger.java:649)
at hudson.util.SequentialExecutionQueue$QueueEntry.run(SequentialExecutionQueue.java:119)
at java.util.concurrent.Executors$RunnableAdapter.call(Executors.java:511)
at java.util.concurrent.FutureTask.run(FutureTask.java:266)
at java.util.concurrent.ThreadPoolExecutor.runWorker(ThreadPoolExecutor.java:1149)
at java.util.concurrent.ThreadPoolExecutor$Worker.run(ThreadPoolExecutor.java:624)
at java.lang.Thread.run(Thread.java:748)
ERROR: No tool found matching GRADLE_4_10_2_HOME
ERROR: Could not install GRADLE_4_10_3_HOME
java.lang.NullPointerException
at hudson.plugins.toolenv.ToolEnvBuildWrapper$1.buildEnvVars(ToolEnvBuildWrapper.java:46)
at hudson.model.AbstractBuild.getEnvironment(AbstractBuild.java:873)
at hudson.plugins.git.GitSCM.getParamExpandedRepos(GitSCM.java:484)
at hudson.plugins.git.GitSCM.compareRemoteRevisionWithImpl(GitSCM.java:693)
at hudson.plugins.git.GitSCM.compareRemoteRevisionWith(GitSCM.java:658)
at hudson.scm.SCM.compareRemoteRevisionWith(SCM.java:400)
at hudson.scm.SCM.poll(SCM.java:417)
at hudson.model.AbstractProject._poll(AbstractProject.java:1390)
at hudson.model.AbstractProject.poll(AbstractProject.java:1293)
at hudson.triggers.SCMTrigger$Runner.runPolling(SCMTrigger.java:603)
at hudson.triggers.SCMTrigger$Runner.run(SCMTrigger.java:649)
at hudson.util.SequentialExecutionQueue$QueueEntry.run(SequentialExecutionQueue.java:119)
at java.util.concurrent.Executors$RunnableAdapter.call(Executors.java:511)
at java.util.concurrent.FutureTask.run(FutureTask.java:266)
at java.util.concurrent.ThreadPoolExecutor.runWorker(ThreadPoolExecutor.java:1149)
at java.util.concurrent.ThreadPoolExecutor$Worker.run(ThreadPoolExecutor.java:624)
at java.lang.Thread.run(Thread.java:748)
ERROR: No tool found matching GRADLE_4_10_2_HOME
ERROR: Could not install GRADLE_4_10_3_HOME
java.lang.NullPointerException
at hudson.plugins.toolenv.ToolEnvBuildWrapper$1.buildEnvVars(ToolEnvBuildWrapper.java:46)
at hudson.model.AbstractBuild.getEnvironment(AbstractBuild.java:873)
at hudson.plugins.git.GitSCM.getParamExpandedRepos(GitSCM.java:484)
at hudson.plugins.git.GitSCM.compareRemoteRevisionWithImpl(GitSCM.java:693)
at hudson.plugins.git.GitSCM.compareRemoteRevisionWith(GitSCM.java:658)
at hudson.scm.SCM.compareRemoteRevisionWith(SCM.java:400)
at hudson.scm.SCM.poll(SCM.java:417)
at hudson.model.AbstractProject._poll(AbstractProject.java:1390)
at hudson.model.AbstractProject.poll(AbstractProject.java:1293)
at hudson.triggers.SCMTrigger$Runner.runPolling(SCMTrigger.java:603)
at hudson.triggers.SCMTrigger$Runner.run(SCMTrigger.java:649)
at hudson.util.SequentialExecutionQueue$QueueEntry.run(SequentialExecutionQueue.java:119)
at java.util.concurrent.Executors$RunnableAdapter.call(Executors.java:511)
at java.util.concurrent.FutureTask.run(FutureTask.java:266)
at java.util.concurrent.ThreadPoolExecutor.runWorker(ThreadPoolExecutor.java:1149)
at java.util.concurrent.ThreadPoolExecutor$Worker.run(ThreadPoolExecutor.java:624)
at java.lang.Thread.run(Thread.java:748)
Build timed out (after 480 minutes). Marking the build as failed.
Build was aborted
Recording test results
ERROR: No tool found matching GRADLE_4_10_2_HOME
Setting GRADLE_4_10_3_HOME=/home/jenkins/tools/gradle/4.10.3
kafka.zookeeper.ZooKeeperClientTest > testBlockOnRequestCompletionFromStateChangeHandler SKIPPED
> Task :core:test FAILED
ERROR: No tool found matching GRADLE_4_10_2_HOME
Setting GRADLE_4_10_3_HOME=/home/jenkins/tools/gradle/4.10.3
Not sending mail to unregistered user noreply@github.com
Build failed in Jenkins: kafka-trunk-jdk11 #1478
Posted by Apache Jenkins Server <je...@builds.apache.org>.
See <https://builds.apache.org/job/kafka-trunk-jdk11/1478/display/redirect?page=changes>
Changes:
[github] KAFKA-10010: Should make state store registration idempotent (#8681)
------------------------------------------
[...truncated 1.08 MB...]
org.apache.kafka.common.network.SslTransportLayerTest > testClientAuthenticationRequiredNotProvided[tlsProtocol=TLSv1.3] STARTED
org.apache.kafka.common.network.SslTransportLayerTest > testClientAuthenticationRequiredNotProvided[tlsProtocol=TLSv1.3] PASSED
org.apache.kafka.common.network.SslTransportLayerTest > testGracefulRemoteCloseDuringHandshakeWrite[tlsProtocol=TLSv1.3] STARTED
org.apache.kafka.common.network.SslTransportLayerTest > testGracefulRemoteCloseDuringHandshakeWrite[tlsProtocol=TLSv1.3] PASSED
org.apache.kafka.common.network.SslTransportLayerTest > testClientAuthenticationRequestedNotProvided[tlsProtocol=TLSv1.3] STARTED
org.apache.kafka.common.network.SslTransportLayerTest > testClientAuthenticationRequestedNotProvided[tlsProtocol=TLSv1.3] PASSED
org.apache.kafka.common.network.SslTransportLayerTest > testIOExceptionsDuringHandshakeWrite[tlsProtocol=TLSv1.3] STARTED
org.apache.kafka.common.network.SslTransportLayerTest > testIOExceptionsDuringHandshakeWrite[tlsProtocol=TLSv1.3] PASSED
org.apache.kafka.common.network.SslTransportLayerTest > testInvalidKeystorePassword[tlsProtocol=TLSv1.3] STARTED
org.apache.kafka.common.network.SslTransportLayerTest > testInvalidKeystorePassword[tlsProtocol=TLSv1.3] PASSED
org.apache.kafka.common.network.SslTransportLayerTest > testClientAuthenticationDisabledNotProvided[tlsProtocol=TLSv1.3] STARTED
org.apache.kafka.common.network.SslTransportLayerTest > testClientAuthenticationDisabledNotProvided[tlsProtocol=TLSv1.3] PASSED
org.apache.kafka.common.network.SslTransportLayerTest > testCustomClientSslEngineFactory[tlsProtocol=TLSv1.3] STARTED
org.apache.kafka.common.network.SslTransportLayerTest > testCustomClientSslEngineFactory[tlsProtocol=TLSv1.3] PASSED
org.apache.kafka.common.network.SslTransportLayerTest > testValidEndpointIdentificationSanDns[tlsProtocol=TLSv1.3] STARTED
org.apache.kafka.common.network.SslTransportLayerTest > testValidEndpointIdentificationSanDns[tlsProtocol=TLSv1.3] PASSED
org.apache.kafka.common.network.SslTransportLayerTest > testEndpointIdentificationNoReverseLookup[tlsProtocol=TLSv1.3] STARTED
org.apache.kafka.common.network.SslTransportLayerTest > testEndpointIdentificationNoReverseLookup[tlsProtocol=TLSv1.3] PASSED
org.apache.kafka.common.network.SslTransportLayerTest > testUngracefulRemoteCloseDuringHandshakeWrite[tlsProtocol=TLSv1.3] STARTED
org.apache.kafka.common.network.SslTransportLayerTest > testUngracefulRemoteCloseDuringHandshakeWrite[tlsProtocol=TLSv1.3] PASSED
org.apache.kafka.common.network.SslTransportLayerTest > testGracefulRemoteCloseDuringHandshakeRead[tlsProtocol=TLSv1.3] STARTED
org.apache.kafka.common.network.SslTransportLayerTest > testGracefulRemoteCloseDuringHandshakeRead[tlsProtocol=TLSv1.3] PASSED
org.apache.kafka.common.network.SslTransportLayerTest > testInvalidSecureRandomImplementation[tlsProtocol=TLSv1.3] STARTED
org.apache.kafka.common.network.SslTransportLayerTest > testInvalidSecureRandomImplementation[tlsProtocol=TLSv1.3] PASSED
org.apache.kafka.common.network.SslTransportLayerTest > testInvalidEndpointIdentification[tlsProtocol=TLSv1.3] STARTED
org.apache.kafka.common.network.SslTransportLayerTest > testInvalidEndpointIdentification[tlsProtocol=TLSv1.3] PASSED
org.apache.kafka.common.network.SslTransportLayerTest > testValidEndpointIdentificationSanIp[tlsProtocol=TLSv1.3] STARTED
org.apache.kafka.common.network.SslTransportLayerTest > testValidEndpointIdentificationSanIp[tlsProtocol=TLSv1.3] PASSED
org.apache.kafka.common.network.SslTransportLayerTest > testEndpointIdentificationDisabled[tlsProtocol=TLSv1.3] STARTED
org.apache.kafka.common.network.SslTransportLayerTest > testEndpointIdentificationDisabled[tlsProtocol=TLSv1.3] PASSED
org.apache.kafka.common.network.SslTransportLayerTest > testInterBrokerSslConfigValidation[tlsProtocol=TLSv1.3] STARTED
org.apache.kafka.common.network.SslTransportLayerTest > testInterBrokerSslConfigValidation[tlsProtocol=TLSv1.3] PASSED
org.apache.kafka.common.network.SslTransportLayerTest > testServerTruststoreDynamicUpdate[tlsProtocol=TLSv1.3] STARTED
org.apache.kafka.common.network.SslTransportLayerTest > testServerTruststoreDynamicUpdate[tlsProtocol=TLSv1.3] PASSED
org.apache.kafka.common.network.SslTransportLayerTest > testInvalidSslEngineFactory[tlsProtocol=TLSv1.3] STARTED
org.apache.kafka.common.network.SslTransportLayerTest > testInvalidSslEngineFactory[tlsProtocol=TLSv1.3] PASSED
org.apache.kafka.common.network.SslTransportLayerTest > testNullTruststorePassword[tlsProtocol=TLSv1.3] STARTED
org.apache.kafka.common.network.SslTransportLayerTest > testNullTruststorePassword[tlsProtocol=TLSv1.3] PASSED
org.apache.kafka.common.network.SslTransportLayerTest > testUngracefulRemoteCloseDuringHandshakeRead[tlsProtocol=TLSv1.3] STARTED
org.apache.kafka.common.network.SslTransportLayerTest > testUngracefulRemoteCloseDuringHandshakeRead[tlsProtocol=TLSv1.3] PASSED
org.apache.kafka.common.network.SslTransportLayerTest > testClientAuthenticationRequiredUntrustedProvided[tlsProtocol=TLSv1.3] STARTED
org.apache.kafka.common.network.SslTransportLayerTest > testClientAuthenticationRequiredUntrustedProvided[tlsProtocol=TLSv1.3] PASSED
org.apache.kafka.common.network.SslTransportLayerTest > testClientAuthenticationDisabledUntrustedProvided[tlsProtocol=TLSv1.3] STARTED
org.apache.kafka.common.network.SslTransportLayerTest > testClientAuthenticationDisabledUntrustedProvided[tlsProtocol=TLSv1.3] PASSED
org.apache.kafka.common.network.SslTransportLayerTest > testTLSDefaults[tlsProtocol=TLSv1.3] STARTED
org.apache.kafka.common.network.SslTransportLayerTest > testTLSDefaults[tlsProtocol=TLSv1.3] PASSED
org.apache.kafka.common.network.SslTransportLayerTest > testSelectorPollReadSize[tlsProtocol=TLSv1.3] STARTED
org.apache.kafka.common.network.SslTransportLayerTest > testSelectorPollReadSize[tlsProtocol=TLSv1.3] PASSED
org.apache.kafka.common.network.SslTransportLayerTest > testNetReadBufferResize[tlsProtocol=TLSv1.3] STARTED
org.apache.kafka.common.network.SslTransportLayerTest > testNetReadBufferResize[tlsProtocol=TLSv1.3] PASSED
org.apache.kafka.common.network.SslTransportLayerTest > testNetWriteBufferResize[tlsProtocol=TLSv1.3] STARTED
org.apache.kafka.common.network.SslTransportLayerTest > testNetWriteBufferResize[tlsProtocol=TLSv1.3] PASSED
org.apache.kafka.common.network.SslTransportLayerTest > testCustomServerSslEngineFactory[tlsProtocol=TLSv1.3] STARTED
org.apache.kafka.common.network.SslTransportLayerTest > testCustomServerSslEngineFactory[tlsProtocol=TLSv1.3] PASSED
org.apache.kafka.common.network.SslTransportLayerTest > testInvalidTruststorePassword[tlsProtocol=TLSv1.3] STARTED
org.apache.kafka.common.network.SslTransportLayerTest > testInvalidTruststorePassword[tlsProtocol=TLSv1.3] PASSED
org.apache.kafka.common.network.SslTransportLayerTest > testServerRequestMetrics[tlsProtocol=TLSv1.3] STARTED
org.apache.kafka.common.network.SslTransportLayerTest > testServerRequestMetrics[tlsProtocol=TLSv1.3] PASSED
org.apache.kafka.common.network.SslTransportLayerTest > testPeerNotifiedOfHandshakeFailure[tlsProtocol=TLSv1.3] STARTED
org.apache.kafka.common.network.SslTransportLayerTest > testPeerNotifiedOfHandshakeFailure[tlsProtocol=TLSv1.3] PASSED
org.apache.kafka.common.network.SslTransportLayerTest > testApplicationBufferResize[tlsProtocol=TLSv1.3] STARTED
org.apache.kafka.common.network.SslTransportLayerTest > testApplicationBufferResize[tlsProtocol=TLSv1.3] PASSED
org.apache.kafka.common.network.SslTransportLayerTest > testClosePlaintext[tlsProtocol=TLSv1.3] STARTED
org.apache.kafka.common.network.SslTransportLayerTest > testClosePlaintext[tlsProtocol=TLSv1.3] PASSED
org.apache.kafka.common.network.SslTransportLayerTest > testUnsupportedCipher[tlsProtocol=TLSv1.3] STARTED
org.apache.kafka.common.network.SslTransportLayerTest > testUnsupportedCipher[tlsProtocol=TLSv1.3] PASSED
org.apache.kafka.common.network.SslTransportLayerTest > testServerKeystoreDynamicUpdate[tlsProtocol=TLSv1.3] STARTED
org.apache.kafka.common.network.SslTransportLayerTest > testServerKeystoreDynamicUpdate[tlsProtocol=TLSv1.3] PASSED
org.apache.kafka.common.network.SslTransportLayerTest > testClientAuthenticationRequiredValidProvided[tlsProtocol=TLSv1.3] STARTED
org.apache.kafka.common.network.SslTransportLayerTest > testClientAuthenticationRequiredValidProvided[tlsProtocol=TLSv1.3] PASSED
org.apache.kafka.common.network.SslTransportLayerTest > testInvalidKeyPassword[tlsProtocol=TLSv1.3] STARTED
org.apache.kafka.common.network.SslTransportLayerTest > testInvalidKeyPassword[tlsProtocol=TLSv1.3] PASSED
org.apache.kafka.common.network.SslTransportLayerTest > testCloseSsl[tlsProtocol=TLSv1.3] STARTED
org.apache.kafka.common.network.SslTransportLayerTest > testCloseSsl[tlsProtocol=TLSv1.3] PASSED
org.apache.kafka.common.network.SslTransportLayerTest > testInterBrokerSslConfigValidationFailure[tlsProtocol=TLSv1.3] STARTED
org.apache.kafka.common.network.SslTransportLayerTest > testInterBrokerSslConfigValidationFailure[tlsProtocol=TLSv1.3] PASSED
org.apache.kafka.common.network.SslSelectorTest > testBytesBufferedChannelAfterMute STARTED
org.apache.kafka.common.network.SslSelectorTest > testBytesBufferedChannelAfterMute PASSED
org.apache.kafka.common.network.SslSelectorTest > testBytesBufferedChannelWithNoIncomingBytes STARTED
org.apache.kafka.common.network.SslSelectorTest > testBytesBufferedChannelWithNoIncomingBytes PASSED
org.apache.kafka.common.network.SslSelectorTest > testRenegotiationFails STARTED
org.apache.kafka.common.network.SslSelectorTest > testRenegotiationFails PASSED
org.apache.kafka.common.network.SslSelectorTest > testDisconnectWithIntermediateBufferedBytes STARTED
org.apache.kafka.common.network.SslSelectorTest > testDisconnectWithIntermediateBufferedBytes PASSED
org.apache.kafka.common.network.SslSelectorTest > testConnectionWithCustomKeyManager STARTED
org.apache.kafka.common.network.SslSelectorTest > testConnectionWithCustomKeyManager PASSED
org.apache.kafka.common.network.SslSelectorTest > testGracefulClose STARTED
org.apache.kafka.common.network.SslSelectorTest > testGracefulClose PASSED
org.apache.kafka.common.network.SslSelectorTest > testSendLargeRequest STARTED
org.apache.kafka.common.network.SslSelectorTest > testSendLargeRequest PASSED
org.apache.kafka.common.network.SslSelectorTest > testLargeMessageSequence STARTED
FATAL: command execution failed
java.io.EOFException
at java.io.ObjectInputStream$PeekInputStream.readFully(ObjectInputStream.java:2681)
at java.io.ObjectInputStream$BlockDataInputStream.readShort(ObjectInputStream.java:3156)
at java.io.ObjectInputStream.readStreamHeader(ObjectInputStream.java:862)
at java.io.ObjectInputStream.<init>(ObjectInputStream.java:358)
at hudson.remoting.ObjectInputStreamEx.<init>(ObjectInputStreamEx.java:49)
at hudson.remoting.Command.readFrom(Command.java:140)
at hudson.remoting.Command.readFrom(Command.java:126)
at hudson.remoting.AbstractSynchronousByteArrayCommandTransport.read(AbstractSynchronousByteArrayCommandTransport.java:36)
at hudson.remoting.SynchronousCommandTransport$ReaderThread.run(SynchronousCommandTransport.java:63)
Caused: java.io.IOException: Unexpected termination of the channel
at hudson.remoting.SynchronousCommandTransport$ReaderThread.run(SynchronousCommandTransport.java:77)
Caused: java.io.IOException: Backing channel 'H30' is disconnected.
at hudson.remoting.RemoteInvocationHandler.channelOrFail(RemoteInvocationHandler.java:214)
at hudson.remoting.RemoteInvocationHandler.invoke(RemoteInvocationHandler.java:283)
at com.sun.proxy.$Proxy141.isAlive(Unknown Source)
at hudson.Launcher$RemoteLauncher$ProcImpl.isAlive(Launcher.java:1150)
at hudson.Launcher$RemoteLauncher$ProcImpl.join(Launcher.java:1142)
at hudson.tasks.CommandInterpreter.join(CommandInterpreter.java:155)
at hudson.tasks.CommandInterpreter.perform(CommandInterpreter.java:109)
at hudson.tasks.CommandInterpreter.perform(CommandInterpreter.java:66)
at hudson.tasks.BuildStepMonitor$1.perform(BuildStepMonitor.java:20)
at hudson.model.AbstractBuild$AbstractBuildExecution.perform(AbstractBuild.java:741)
at hudson.model.Build$BuildExecution.build(Build.java:206)
at hudson.model.Build$BuildExecution.doRun(Build.java:163)
at hudson.model.AbstractBuild$AbstractBuildExecution.run(AbstractBuild.java:504)
at hudson.model.Run.execute(Run.java:1815)
at hudson.model.FreeStyleBuild.run(FreeStyleBuild.java:43)
at hudson.model.ResourceController.execute(ResourceController.java:97)
at hudson.model.Executor.run(Executor.java:429)
FATAL: Unable to delete script file /tmp/jenkins709483106788327767.sh
java.io.EOFException
at java.io.ObjectInputStream$PeekInputStream.readFully(ObjectInputStream.java:2681)
at java.io.ObjectInputStream$BlockDataInputStream.readShort(ObjectInputStream.java:3156)
at java.io.ObjectInputStream.readStreamHeader(ObjectInputStream.java:862)
at java.io.ObjectInputStream.<init>(ObjectInputStream.java:358)
at hudson.remoting.ObjectInputStreamEx.<init>(ObjectInputStreamEx.java:49)
at hudson.remoting.Command.readFrom(Command.java:140)
at hudson.remoting.Command.readFrom(Command.java:126)
at hudson.remoting.AbstractSynchronousByteArrayCommandTransport.read(AbstractSynchronousByteArrayCommandTransport.java:36)
at hudson.remoting.SynchronousCommandTransport$ReaderThread.run(SynchronousCommandTransport.java:63)
Caused: java.io.IOException: Unexpected termination of the channel
at hudson.remoting.SynchronousCommandTransport$ReaderThread.run(SynchronousCommandTransport.java:77)
Caused: hudson.remoting.ChannelClosedException: Channel "unknown": Remote call on H30 failed. The channel is closing down or has closed down
at hudson.remoting.Channel.call(Channel.java:950)
at hudson.FilePath.act(FilePath.java:1072)
at hudson.FilePath.act(FilePath.java:1061)
at hudson.FilePath.delete(FilePath.java:1542)
at hudson.tasks.CommandInterpreter.perform(CommandInterpreter.java:123)
at hudson.tasks.CommandInterpreter.perform(CommandInterpreter.java:66)
at hudson.tasks.BuildStepMonitor$1.perform(BuildStepMonitor.java:20)
at hudson.model.AbstractBuild$AbstractBuildExecution.perform(AbstractBuild.java:741)
at hudson.model.Build$BuildExecution.build(Build.java:206)
at hudson.model.Build$BuildExecution.doRun(Build.java:163)
at hudson.model.AbstractBuild$AbstractBuildExecution.run(AbstractBuild.java:504)
at hudson.model.Run.execute(Run.java:1815)
at hudson.model.FreeStyleBuild.run(FreeStyleBuild.java:43)
at hudson.model.ResourceController.execute(ResourceController.java:97)
at hudson.model.Executor.run(Executor.java:429)
Build step 'Execute shell' marked build as failure
ERROR: Step ?Publish JUnit test result report? failed: no workspace for kafka-trunk-jdk11 #1478
ERROR: H30 is offline; cannot locate JDK 11 (latest)
ERROR: No tool found matching GRADLE_4_10_2_HOME
ERROR: H30 is offline; cannot locate Gradle 4.10.3
Setting GRADLE_4_10_3_HOME=/home/jenkins/tools/gradle/4.10.3
Not sending mail to unregistered user noreply@github.com
Build failed in Jenkins: kafka-trunk-jdk11 #1477
Posted by Apache Jenkins Server <je...@builds.apache.org>.
See <https://builds.apache.org/job/kafka-trunk-jdk11/1477/display/redirect?page=changes>
Changes:
[github] KAFKA-10011: Remove task id from lockedTaskDirectories during
------------------------------------------
[...truncated 4.99 MB...]
kafka.controller.ReplicaStateMachineTest > testReplicaDeletionIneligibleToOnlineReplicaTransition PASSED
kafka.controller.ReplicaStateMachineTest > testInvalidReplicaDeletionStartedToNewReplicaTransition STARTED
kafka.controller.ReplicaStateMachineTest > testInvalidReplicaDeletionStartedToNewReplicaTransition PASSED
kafka.controller.ReplicaStateMachineTest > testInvalidNonexistentReplicaToReplicaDeletionSuccessfulTransition STARTED
kafka.controller.ReplicaStateMachineTest > testInvalidNonexistentReplicaToReplicaDeletionSuccessfulTransition PASSED
kafka.controller.ReplicaStateMachineTest > testNewReplicaToOnlineReplicaTransition STARTED
kafka.controller.ReplicaStateMachineTest > testNewReplicaToOnlineReplicaTransition PASSED
kafka.controller.ControllerIntegrationTest > testControllerDetectsBouncedBrokers STARTED
kafka.controller.ControllerIntegrationTest > testControllerDetectsBouncedBrokers PASSED
kafka.controller.ControllerIntegrationTest > testControlledShutdown STARTED
kafka.controller.ControllerIntegrationTest > testControlledShutdown PASSED
kafka.controller.ControllerIntegrationTest > testPartitionReassignmentWithOfflineReplicaHaltingProgress STARTED
kafka.controller.ControllerIntegrationTest > testPartitionReassignmentWithOfflineReplicaHaltingProgress PASSED
kafka.controller.ControllerIntegrationTest > testControllerEpochPersistsWhenAllBrokersDown STARTED
kafka.controller.ControllerIntegrationTest > testControllerEpochPersistsWhenAllBrokersDown PASSED
kafka.controller.ControllerIntegrationTest > testTopicCreationWithOfflineReplica STARTED
kafka.controller.ControllerIntegrationTest > testTopicCreationWithOfflineReplica PASSED
kafka.controller.ControllerIntegrationTest > testPartitionReassignmentResumesAfterReplicaComesOnline STARTED
kafka.controller.ControllerIntegrationTest > testPartitionReassignmentResumesAfterReplicaComesOnline PASSED
kafka.controller.ControllerIntegrationTest > testLeaderAndIsrWhenEntireIsrOfflineAndUncleanLeaderElectionDisabled STARTED
kafka.controller.ControllerIntegrationTest > testLeaderAndIsrWhenEntireIsrOfflineAndUncleanLeaderElectionDisabled PASSED
kafka.controller.ControllerIntegrationTest > testTopicPartitionExpansionWithOfflineReplica STARTED
kafka.controller.ControllerIntegrationTest > testTopicPartitionExpansionWithOfflineReplica PASSED
kafka.controller.ControllerIntegrationTest > testPreferredReplicaLeaderElectionWithOfflinePreferredReplica STARTED
kafka.controller.ControllerIntegrationTest > testPreferredReplicaLeaderElectionWithOfflinePreferredReplica PASSED
kafka.controller.ControllerIntegrationTest > testMetadataPropagationOnControlPlane STARTED
kafka.controller.ControllerIntegrationTest > testMetadataPropagationOnControlPlane PASSED
kafka.controller.ControllerIntegrationTest > testAutoPreferredReplicaLeaderElection STARTED
kafka.controller.ControllerIntegrationTest > testAutoPreferredReplicaLeaderElection PASSED
kafka.controller.ControllerIntegrationTest > testTopicCreation STARTED
kafka.controller.ControllerIntegrationTest > testTopicCreation PASSED
kafka.controller.ControllerIntegrationTest > testControllerMoveOnTopicDeletion STARTED
kafka.controller.ControllerIntegrationTest > testControllerMoveOnTopicDeletion PASSED
kafka.controller.ControllerIntegrationTest > testPartitionReassignment STARTED
kafka.controller.ControllerIntegrationTest > testPartitionReassignment PASSED
kafka.controller.ControllerIntegrationTest > testTopicPartitionExpansion STARTED
kafka.controller.ControllerIntegrationTest > testTopicPartitionExpansion PASSED
kafka.controller.ControllerIntegrationTest > testControllerMoveIncrementsControllerEpoch STARTED
kafka.controller.ControllerIntegrationTest > testControllerMoveIncrementsControllerEpoch PASSED
kafka.controller.ControllerIntegrationTest > testLeaderAndIsrWhenEntireIsrOfflineAndUncleanLeaderElectionEnabled STARTED
kafka.controller.ControllerIntegrationTest > testLeaderAndIsrWhenEntireIsrOfflineAndUncleanLeaderElectionEnabled PASSED
kafka.controller.ControllerIntegrationTest > testControllerMoveOnPartitionReassignment STARTED
kafka.controller.ControllerIntegrationTest > testControllerMoveOnPartitionReassignment PASSED
kafka.controller.ControllerIntegrationTest > testControllerMoveOnTopicCreation STARTED
kafka.controller.ControllerIntegrationTest > testControllerMoveOnTopicCreation PASSED
kafka.controller.ControllerIntegrationTest > testControllerRejectControlledShutdownRequestWithStaleBrokerEpoch STARTED
kafka.controller.ControllerIntegrationTest > testControllerRejectControlledShutdownRequestWithStaleBrokerEpoch PASSED
kafka.controller.ControllerIntegrationTest > testBackToBackPreferredReplicaLeaderElections STARTED
kafka.controller.ControllerIntegrationTest > testBackToBackPreferredReplicaLeaderElections PASSED
kafka.controller.ControllerIntegrationTest > testEmptyCluster STARTED
kafka.controller.ControllerIntegrationTest > testEmptyCluster PASSED
kafka.controller.ControllerIntegrationTest > testControllerMoveOnPreferredReplicaElection STARTED
kafka.controller.ControllerIntegrationTest > testControllerMoveOnPreferredReplicaElection PASSED
kafka.controller.ControllerIntegrationTest > testPreferredReplicaLeaderElection STARTED
kafka.controller.ControllerIntegrationTest > testPreferredReplicaLeaderElection PASSED
kafka.controller.ControllerIntegrationTest > testMetadataPropagationOnBrokerChange STARTED
kafka.controller.ControllerIntegrationTest > testMetadataPropagationOnBrokerChange PASSED
kafka.controller.ControllerIntegrationTest > testMetadataPropagationForOfflineReplicas STARTED
kafka.controller.ControllerIntegrationTest > testMetadataPropagationForOfflineReplicas PASSED
kafka.controller.ControllerChannelManagerTest > testStopReplicaRequestWithAlreadyDefinedDeletedPartition STARTED
kafka.controller.ControllerChannelManagerTest > testStopReplicaRequestWithAlreadyDefinedDeletedPartition PASSED
kafka.controller.ControllerChannelManagerTest > testUpdateMetadataInterBrokerProtocolVersion STARTED
kafka.controller.ControllerChannelManagerTest > testUpdateMetadataInterBrokerProtocolVersion PASSED
kafka.controller.ControllerChannelManagerTest > testLeaderAndIsrRequestIsNew STARTED
kafka.controller.ControllerChannelManagerTest > testLeaderAndIsrRequestIsNew PASSED
kafka.controller.ControllerChannelManagerTest > testStopReplicaRequestsWhileTopicQueuedForDeletion STARTED
kafka.controller.ControllerChannelManagerTest > testStopReplicaRequestsWhileTopicQueuedForDeletion PASSED
kafka.controller.ControllerChannelManagerTest > testLeaderAndIsrRequestSentToLiveOrShuttingDownBrokers STARTED
kafka.controller.ControllerChannelManagerTest > testLeaderAndIsrRequestSentToLiveOrShuttingDownBrokers PASSED
kafka.controller.ControllerChannelManagerTest > testStopReplicaInterBrokerProtocolVersion STARTED
kafka.controller.ControllerChannelManagerTest > testStopReplicaInterBrokerProtocolVersion PASSED
kafka.controller.ControllerChannelManagerTest > testStopReplicaSentOnlyToLiveAndShuttingDownBrokers STARTED
kafka.controller.ControllerChannelManagerTest > testStopReplicaSentOnlyToLiveAndShuttingDownBrokers PASSED
kafka.controller.ControllerChannelManagerTest > testStopReplicaGroupsByBroker STARTED
kafka.controller.ControllerChannelManagerTest > testStopReplicaGroupsByBroker PASSED
kafka.controller.ControllerChannelManagerTest > testUpdateMetadataDoesNotIncludePartitionsWithoutLeaderAndIsr STARTED
kafka.controller.ControllerChannelManagerTest > testUpdateMetadataDoesNotIncludePartitionsWithoutLeaderAndIsr PASSED
kafka.controller.ControllerChannelManagerTest > testMixedDeleteAndNotDeleteStopReplicaRequests STARTED
kafka.controller.ControllerChannelManagerTest > testMixedDeleteAndNotDeleteStopReplicaRequests PASSED
kafka.controller.ControllerChannelManagerTest > testLeaderAndIsrInterBrokerProtocolVersion STARTED
kafka.controller.ControllerChannelManagerTest > testLeaderAndIsrInterBrokerProtocolVersion PASSED
kafka.controller.ControllerChannelManagerTest > testUpdateMetadataRequestSent STARTED
kafka.controller.ControllerChannelManagerTest > testUpdateMetadataRequestSent PASSED
kafka.controller.ControllerChannelManagerTest > testUpdateMetadataRequestDuringTopicDeletion STARTED
kafka.controller.ControllerChannelManagerTest > testUpdateMetadataRequestDuringTopicDeletion PASSED
kafka.controller.ControllerChannelManagerTest > testUpdateMetadataIncludesLiveOrShuttingDownBrokers STARTED
kafka.controller.ControllerChannelManagerTest > testUpdateMetadataIncludesLiveOrShuttingDownBrokers PASSED
kafka.controller.ControllerChannelManagerTest > testStopReplicaRequestSent STARTED
kafka.controller.ControllerChannelManagerTest > testStopReplicaRequestSent PASSED
kafka.controller.ControllerChannelManagerTest > testStopReplicaRequestsWhileTopicDeletionStarted STARTED
kafka.controller.ControllerChannelManagerTest > testStopReplicaRequestsWhileTopicDeletionStarted PASSED
kafka.controller.ControllerChannelManagerTest > testLeaderAndIsrRequestSent STARTED
kafka.controller.ControllerChannelManagerTest > testLeaderAndIsrRequestSent PASSED
kafka.controller.ControllerChannelManagerTest > testStopReplicaRequestWithoutDeletePartitionWhileTopicDeletionStarted STARTED
kafka.controller.ControllerChannelManagerTest > testStopReplicaRequestWithoutDeletePartitionWhileTopicDeletionStarted PASSED
unit.kafka.cluster.AssignmentStateTest > testPartitionAssignmentStatus[0] STARTED
unit.kafka.cluster.AssignmentStateTest > testPartitionAssignmentStatus[0] PASSED
unit.kafka.cluster.AssignmentStateTest > testPartitionAssignmentStatus[1] STARTED
unit.kafka.cluster.AssignmentStateTest > testPartitionAssignmentStatus[1] PASSED
unit.kafka.cluster.AssignmentStateTest > testPartitionAssignmentStatus[2] STARTED
unit.kafka.cluster.AssignmentStateTest > testPartitionAssignmentStatus[2] PASSED
unit.kafka.cluster.AssignmentStateTest > testPartitionAssignmentStatus[3] STARTED
unit.kafka.cluster.AssignmentStateTest > testPartitionAssignmentStatus[3] PASSED
unit.kafka.cluster.AssignmentStateTest > testPartitionAssignmentStatus[4] STARTED
unit.kafka.cluster.AssignmentStateTest > testPartitionAssignmentStatus[4] PASSED
unit.kafka.cluster.AssignmentStateTest > testPartitionAssignmentStatus[5] STARTED
unit.kafka.cluster.AssignmentStateTest > testPartitionAssignmentStatus[5] PASSED
unit.kafka.cluster.AssignmentStateTest > testPartitionAssignmentStatus[6] STARTED
unit.kafka.cluster.AssignmentStateTest > testPartitionAssignmentStatus[6] PASSED
unit.kafka.cluster.AssignmentStateTest > testPartitionAssignmentStatus[7] STARTED
unit.kafka.cluster.AssignmentStateTest > testPartitionAssignmentStatus[7] PASSED
unit.kafka.cluster.AssignmentStateTest > testPartitionAssignmentStatus[8] STARTED
unit.kafka.cluster.AssignmentStateTest > testPartitionAssignmentStatus[8] PASSED
ERROR: No tool found matching GRADLE_4_10_2_HOME
ERROR: Could not install GRADLE_4_10_3_HOME
java.lang.NullPointerException
ERROR: No tool found matching GRADLE_4_10_2_HOME
ERROR: Could not install GRADLE_4_10_3_HOME
java.lang.NullPointerException
ERROR: No tool found matching GRADLE_4_10_2_HOME
ERROR: Could not install GRADLE_4_10_3_HOME
java.lang.NullPointerException
ERROR: No tool found matching GRADLE_4_10_2_HOME
ERROR: Could not install GRADLE_4_10_3_HOME
java.lang.NullPointerException
ERROR: No tool found matching GRADLE_4_10_2_HOME
ERROR: Could not install GRADLE_4_10_3_HOME
java.lang.NullPointerException
Build timed out (after 480 minutes). Marking the build as failed.
Build was aborted
Recording test results
ERROR: No tool found matching GRADLE_4_10_2_HOME
Setting GRADLE_4_10_3_HOME=/home/jenkins/tools/gradle/4.10.3
ERROR: No tool found matching GRADLE_4_10_2_HOME
Setting GRADLE_4_10_3_HOME=/home/jenkins/tools/gradle/4.10.3
Not sending mail to unregistered user noreply@github.com
Build failed in Jenkins: kafka-trunk-jdk11 #1476
Posted by Apache Jenkins Server <je...@builds.apache.org>.
See <https://builds.apache.org/job/kafka-trunk-jdk11/1476/display/redirect?page=changes>
Changes:
[github] KAFKA-6145: Add unit tests to verify fix of bug KAFKA-9173 (#8689)
[github] KAFKA-9992: Eliminate JavaConverters in EmbeddedKafkaCluster (#8673)
------------------------------------------
[...truncated 3.09 MB...]
org.apache.kafka.streams.TopologyTestDriverTest > shouldUseSourceSpecificDeserializersDeprecated[Eos enabled = false] PASSED
org.apache.kafka.streams.TopologyTestDriverTest > shouldPunctuateIfEvenTimeAdvances[Eos enabled = false] STARTED
org.apache.kafka.streams.TopologyTestDriverTest > shouldPunctuateIfEvenTimeAdvances[Eos enabled = false] PASSED
org.apache.kafka.streams.TopologyTestDriverTest > shouldInitProcessor[Eos enabled = false] STARTED
org.apache.kafka.streams.TopologyTestDriverTest > shouldInitProcessor[Eos enabled = false] PASSED
org.apache.kafka.streams.TopologyTestDriverTest > shouldThrowForUnknownTopic[Eos enabled = false] STARTED
org.apache.kafka.streams.TopologyTestDriverTest > shouldThrowForUnknownTopic[Eos enabled = false] PASSED
org.apache.kafka.streams.TopologyTestDriverTest > shouldPunctuateOnStreamsTime[Eos enabled = false] STARTED
org.apache.kafka.streams.TopologyTestDriverTest > shouldPunctuateOnStreamsTime[Eos enabled = false] PASSED
org.apache.kafka.streams.TopologyTestDriverTest > shouldCaptureGlobalTopicNameIfWrittenInto[Eos enabled = false] STARTED
org.apache.kafka.streams.TopologyTestDriverTest > shouldCaptureGlobalTopicNameIfWrittenInto[Eos enabled = false] PASSED
org.apache.kafka.streams.TopologyTestDriverTest > shouldThrowIfInMemoryBuiltInStoreIsAccessedWithUntypedMethod[Eos enabled = false] STARTED
org.apache.kafka.streams.TopologyTestDriverTest > shouldThrowIfInMemoryBuiltInStoreIsAccessedWithUntypedMethod[Eos enabled = false] PASSED
org.apache.kafka.streams.TopologyTestDriverTest > shouldProcessFromSourcesThatMatchMultiplePattern[Eos enabled = false] STARTED
org.apache.kafka.streams.TopologyTestDriverTest > shouldProcessFromSourcesThatMatchMultiplePattern[Eos enabled = false] PASSED
org.apache.kafka.streams.TopologyTestDriverTest > shouldPopulateGlobalStore[Eos enabled = false] STARTED
org.apache.kafka.streams.TopologyTestDriverTest > shouldPopulateGlobalStore[Eos enabled = false] PASSED
org.apache.kafka.streams.TopologyTestDriverTest > shouldThrowIfPersistentBuiltInStoreIsAccessedWithUntypedMethod[Eos enabled = false] STARTED
org.apache.kafka.streams.TopologyTestDriverTest > shouldThrowIfPersistentBuiltInStoreIsAccessedWithUntypedMethod[Eos enabled = false] PASSED
org.apache.kafka.streams.TopologyTestDriverTest > shouldAllowPrePopulatingStatesStoresWithCachingEnabled[Eos enabled = false] STARTED
org.apache.kafka.streams.TopologyTestDriverTest > shouldAllowPrePopulatingStatesStoresWithCachingEnabled[Eos enabled = false] PASSED
org.apache.kafka.streams.TopologyTestDriverTest > shouldReturnCorrectPersistentStoreTypeOnly[Eos enabled = false] STARTED
org.apache.kafka.streams.TopologyTestDriverTest > shouldReturnCorrectPersistentStoreTypeOnly[Eos enabled = false] PASSED
org.apache.kafka.streams.TopologyTestDriverTest > shouldRespectTaskIdling[Eos enabled = false] STARTED
org.apache.kafka.streams.TopologyTestDriverTest > shouldRespectTaskIdling[Eos enabled = false] PASSED
org.apache.kafka.streams.TopologyTestDriverTest > shouldUseSourceSpecificDeserializers[Eos enabled = false] STARTED
org.apache.kafka.streams.TopologyTestDriverTest > shouldUseSourceSpecificDeserializers[Eos enabled = false] PASSED
org.apache.kafka.streams.TopologyTestDriverTest > shouldReturnAllStores[Eos enabled = false] STARTED
org.apache.kafka.streams.TopologyTestDriverTest > shouldReturnAllStores[Eos enabled = false] PASSED
org.apache.kafka.streams.TopologyTestDriverTest > shouldNotCreateStateDirectoryForStatelessTopology[Eos enabled = false] STARTED
org.apache.kafka.streams.TopologyTestDriverTest > shouldNotCreateStateDirectoryForStatelessTopology[Eos enabled = false] PASSED
org.apache.kafka.streams.TopologyTestDriverTest > shouldApplyGlobalUpdatesCorrectlyInRecursiveTopologies[Eos enabled = false] STARTED
org.apache.kafka.streams.TopologyTestDriverTest > shouldApplyGlobalUpdatesCorrectlyInRecursiveTopologies[Eos enabled = false] PASSED
org.apache.kafka.streams.TopologyTestDriverTest > shouldReturnAllStoresNames[Eos enabled = false] STARTED
org.apache.kafka.streams.TopologyTestDriverTest > shouldReturnAllStoresNames[Eos enabled = false] PASSED
org.apache.kafka.streams.TopologyTestDriverTest > shouldProcessConsumerRecordList[Eos enabled = false] STARTED
org.apache.kafka.streams.TopologyTestDriverTest > shouldProcessConsumerRecordList[Eos enabled = false] PASSED
org.apache.kafka.streams.TopologyTestDriverTest > shouldUseSinkSpecificSerializers[Eos enabled = false] STARTED
org.apache.kafka.streams.TopologyTestDriverTest > shouldUseSinkSpecificSerializers[Eos enabled = false] PASSED
org.apache.kafka.streams.TopologyTestDriverTest > shouldFlushStoreForFirstInput[Eos enabled = false] STARTED
org.apache.kafka.streams.TopologyTestDriverTest > shouldFlushStoreForFirstInput[Eos enabled = false] PASSED
org.apache.kafka.streams.TopologyTestDriverTest > shouldProcessFromSourceThatMatchPattern[Eos enabled = false] STARTED
org.apache.kafka.streams.TopologyTestDriverTest > shouldProcessFromSourceThatMatchPattern[Eos enabled = false] PASSED
org.apache.kafka.streams.TopologyTestDriverTest > shouldCaptureSinkTopicNamesIfWrittenInto[Eos enabled = false] STARTED
org.apache.kafka.streams.TopologyTestDriverTest > shouldCaptureSinkTopicNamesIfWrittenInto[Eos enabled = false] PASSED
org.apache.kafka.streams.TopologyTestDriverTest > shouldUpdateStoreForNewKey[Eos enabled = false] STARTED
org.apache.kafka.streams.TopologyTestDriverTest > shouldUpdateStoreForNewKey[Eos enabled = false] PASSED
org.apache.kafka.streams.TopologyTestDriverTest > shouldSendRecordViaCorrectSourceTopicDeprecated[Eos enabled = false] STARTED
org.apache.kafka.streams.TopologyTestDriverTest > shouldSendRecordViaCorrectSourceTopicDeprecated[Eos enabled = false] PASSED
org.apache.kafka.streams.TopologyTestDriverTest > shouldPunctuateOnWallClockTime[Eos enabled = false] STARTED
org.apache.kafka.streams.TopologyTestDriverTest > shouldPunctuateOnWallClockTime[Eos enabled = false] PASSED
org.apache.kafka.streams.TopologyTestDriverTest > shouldSetRecordMetadata[Eos enabled = false] STARTED
org.apache.kafka.streams.TopologyTestDriverTest > shouldSetRecordMetadata[Eos enabled = false] PASSED
org.apache.kafka.streams.TopologyTestDriverTest > shouldNotUpdateStoreForLargerValue[Eos enabled = false] STARTED
org.apache.kafka.streams.TopologyTestDriverTest > shouldNotUpdateStoreForLargerValue[Eos enabled = false] PASSED
org.apache.kafka.streams.TopologyTestDriverTest > shouldReturnCorrectInMemoryStoreTypeOnly[Eos enabled = false] STARTED
org.apache.kafka.streams.TopologyTestDriverTest > shouldReturnCorrectInMemoryStoreTypeOnly[Eos enabled = false] PASSED
org.apache.kafka.streams.TopologyTestDriverTest > shouldThrowForMissingTime[Eos enabled = false] STARTED
org.apache.kafka.streams.TopologyTestDriverTest > shouldThrowForMissingTime[Eos enabled = false] PASSED
org.apache.kafka.streams.TopologyTestDriverTest > shouldCaptureInternalTopicNamesIfWrittenInto[Eos enabled = false] STARTED
org.apache.kafka.streams.TopologyTestDriverTest > shouldCaptureInternalTopicNamesIfWrittenInto[Eos enabled = false] PASSED
org.apache.kafka.streams.TopologyTestDriverTest > shouldPunctuateOnWallClockTimeDeprecated[Eos enabled = false] STARTED
org.apache.kafka.streams.TopologyTestDriverTest > shouldPunctuateOnWallClockTimeDeprecated[Eos enabled = false] PASSED
org.apache.kafka.streams.TopologyTestDriverTest > shouldProcessRecordForTopic[Eos enabled = false] STARTED
org.apache.kafka.streams.TopologyTestDriverTest > shouldProcessRecordForTopic[Eos enabled = false] PASSED
org.apache.kafka.streams.TopologyTestDriverTest > shouldForwardRecordsFromSubtopologyToSubtopology[Eos enabled = false] STARTED
org.apache.kafka.streams.TopologyTestDriverTest > shouldForwardRecordsFromSubtopologyToSubtopology[Eos enabled = false] PASSED
org.apache.kafka.streams.TopologyTestDriverTest > shouldNotUpdateStoreForSmallerValue[Eos enabled = false] STARTED
org.apache.kafka.streams.TopologyTestDriverTest > shouldNotUpdateStoreForSmallerValue[Eos enabled = false] PASSED
org.apache.kafka.streams.TopologyTestDriverTest > shouldCreateStateDirectoryForStatefulTopology[Eos enabled = false] STARTED
org.apache.kafka.streams.TopologyTestDriverTest > shouldCreateStateDirectoryForStatefulTopology[Eos enabled = false] PASSED
org.apache.kafka.streams.TopologyTestDriverTest > shouldPunctuateIfWallClockTimeAdvances[Eos enabled = false] STARTED
org.apache.kafka.streams.TopologyTestDriverTest > shouldPunctuateIfWallClockTimeAdvances[Eos enabled = false] PASSED
> Task :streams:upgrade-system-tests-10:processTestResources NO-SOURCE
> Task :streams:upgrade-system-tests-10:testClasses
> Task :streams:upgrade-system-tests-10:checkstyleTest
> Task :streams:upgrade-system-tests-10:spotbugsMain NO-SOURCE
> Task :streams:upgrade-system-tests-10:test
> Task :streams:upgrade-system-tests-11:compileJava NO-SOURCE
> Task :streams:upgrade-system-tests-11:processResources NO-SOURCE
> Task :streams:upgrade-system-tests-11:classes UP-TO-DATE
> Task :streams:upgrade-system-tests-11:checkstyleMain NO-SOURCE
> Task :streams:upgrade-system-tests-11:compileTestJava
> Task :streams:upgrade-system-tests-11:processTestResources NO-SOURCE
> Task :streams:upgrade-system-tests-11:testClasses
> Task :streams:upgrade-system-tests-11:checkstyleTest
> Task :streams:upgrade-system-tests-11:spotbugsMain NO-SOURCE
> Task :streams:upgrade-system-tests-11:test
> Task :streams:upgrade-system-tests-20:compileJava NO-SOURCE
> Task :streams:upgrade-system-tests-20:processResources NO-SOURCE
> Task :streams:upgrade-system-tests-20:classes UP-TO-DATE
> Task :streams:upgrade-system-tests-20:checkstyleMain NO-SOURCE
> Task :streams:upgrade-system-tests-20:compileTestJava
> Task :streams:upgrade-system-tests-20:processTestResources NO-SOURCE
> Task :streams:upgrade-system-tests-20:testClasses
> Task :streams:upgrade-system-tests-20:checkstyleTest
> Task :streams:upgrade-system-tests-20:spotbugsMain NO-SOURCE
> Task :streams:upgrade-system-tests-20:test
> Task :streams:upgrade-system-tests-21:compileJava NO-SOURCE
> Task :streams:upgrade-system-tests-21:processResources NO-SOURCE
> Task :streams:upgrade-system-tests-21:classes UP-TO-DATE
> Task :streams:upgrade-system-tests-21:checkstyleMain NO-SOURCE
> Task :streams:upgrade-system-tests-21:compileTestJava
> Task :streams:upgrade-system-tests-21:processTestResources NO-SOURCE
> Task :streams:upgrade-system-tests-21:testClasses
> Task :streams:upgrade-system-tests-21:checkstyleTest
> Task :streams:upgrade-system-tests-21:spotbugsMain NO-SOURCE
> Task :streams:upgrade-system-tests-21:test
> Task :streams:upgrade-system-tests-22:compileJava NO-SOURCE
> Task :streams:upgrade-system-tests-22:processResources NO-SOURCE
> Task :streams:upgrade-system-tests-22:classes UP-TO-DATE
> Task :streams:upgrade-system-tests-22:checkstyleMain NO-SOURCE
> Task :streams:upgrade-system-tests-22:compileTestJava
> Task :streams:upgrade-system-tests-22:processTestResources NO-SOURCE
> Task :streams:upgrade-system-tests-22:testClasses
> Task :streams:upgrade-system-tests-22:checkstyleTest
> Task :streams:upgrade-system-tests-22:spotbugsMain NO-SOURCE
> Task :streams:upgrade-system-tests-22:test
> Task :streams:upgrade-system-tests-23:compileJava NO-SOURCE
> Task :streams:upgrade-system-tests-23:processResources NO-SOURCE
> Task :streams:upgrade-system-tests-23:classes UP-TO-DATE
> Task :streams:upgrade-system-tests-23:checkstyleMain NO-SOURCE
> Task :streams:upgrade-system-tests-23:compileTestJava
> Task :streams:upgrade-system-tests-23:processTestResources NO-SOURCE
> Task :streams:upgrade-system-tests-23:testClasses
> Task :streams:upgrade-system-tests-23:checkstyleTest
> Task :streams:upgrade-system-tests-23:spotbugsMain NO-SOURCE
> Task :streams:upgrade-system-tests-23:test
> Task :streams:upgrade-system-tests-24:compileJava NO-SOURCE
> Task :streams:upgrade-system-tests-24:processResources NO-SOURCE
> Task :streams:upgrade-system-tests-24:classes UP-TO-DATE
> Task :streams:upgrade-system-tests-24:checkstyleMain NO-SOURCE
> Task :streams:upgrade-system-tests-24:compileTestJava
> Task :streams:upgrade-system-tests-24:processTestResources NO-SOURCE
> Task :streams:upgrade-system-tests-24:testClasses
> Task :streams:upgrade-system-tests-24:checkstyleTest
> Task :streams:upgrade-system-tests-24:spotbugsMain NO-SOURCE
> Task :streams:upgrade-system-tests-24:test
> Task :streams:upgrade-system-tests-25:compileJava NO-SOURCE
> Task :streams:upgrade-system-tests-25:processResources NO-SOURCE
> Task :streams:upgrade-system-tests-25:classes UP-TO-DATE
> Task :streams:upgrade-system-tests-25:checkstyleMain NO-SOURCE
> Task :streams:upgrade-system-tests-25:compileTestJava
> Task :streams:upgrade-system-tests-25:processTestResources NO-SOURCE
> Task :streams:upgrade-system-tests-25:testClasses
> Task :streams:upgrade-system-tests-25:checkstyleTest
> Task :streams:upgrade-system-tests-25:spotbugsMain NO-SOURCE
> Task :streams:upgrade-system-tests-25:test
FAILURE: Build failed with an exception.
* What went wrong:
Execution failed for task ':streams:streams-scala:test'.
> Process 'Gradle Test Executor 36' finished with non-zero exit value 1
This problem might be caused by incorrect test process configuration.
Please refer to the test execution section in the User Manual at https://docs.gradle.org/6.4.1/userguide/java_testing.html#sec:test_execution
* Try:
Run with --stacktrace option to get the stack trace. Run with --info or --debug option to get more log output. Run with --scan to get full insights.
* Get more help at https://help.gradle.org
Deprecated Gradle features were used in this build, making it incompatible with Gradle 7.0.
Use '--warning-mode all' to show the individual deprecation warnings.
See https://docs.gradle.org/6.4.1/userguide/command_line_interface.html#sec:command_line_warnings
BUILD FAILED in 2h 1m 26s
215 actionable tasks: 183 executed, 32 up-to-date
Build step 'Execute shell' marked build as failure
Recording test results
ERROR: No tool found matching GRADLE_4_10_2_HOME
Setting GRADLE_4_10_3_HOME=/home/jenkins/tools/gradle/4.10.3
ERROR: No tool found matching GRADLE_4_10_2_HOME
Setting GRADLE_4_10_3_HOME=/home/jenkins/tools/gradle/4.10.3
Not sending mail to unregistered user noreply@github.com