You are viewing a plain text version of this content. The canonical link for it is here.
Posted to notifications@jclouds.apache.org by "Diogo Monteiro (JIRA)" <ji...@apache.org> on 2013/06/19 00:41:20 UTC
[jira] [Created] (JCLOUDS-135) Error building cloudstack API 1.6.x
Diogo Monteiro created JCLOUDS-135:
--------------------------------------
Summary: Error building cloudstack API 1.6.x
Key: JCLOUDS-135
URL: https://issues.apache.org/jira/browse/JCLOUDS-135
Project: jclouds
Issue Type: Bug
Affects Versions: 1.6.0
Reporter: Diogo Monteiro
I tried to build the branch 1.6.x and it kept failing on the cloudstack API
[ERROR] Failed to execute goal org.apache.maven.plugins:maven-surefire-plugin:2.12.4:test (default-test) on project cloudstack: There are test failures.
[ERROR]
[ERROR] Please refer to /Users/diogogmt/Documents/projects/jclouds/apis/cloudstack/target/surefire-reports for the individual test results.
Looking at the test desc I got this:
org.jclouds.cloudstack.compute.loaders.FindSecurityGroupOrCreateTest
testLoad
"java.lang.NoSuchMethodError: org.jclouds.cloudstack.features.SecurityGroupClient.getSecurityGroupByName(Ljava/lang/String;)Lorg/jclouds/cloudstack/domain/SecurityGroup; at org.jclouds.cloudstack.compute.loaders.FindSecurityGroupOrCreateTest.testLoad(FindSecurityGroupOrCreateTest.java:88) at java.util.concurrent.ThreadPoolExecutor.runWorker(ThreadPoolExecutor.java:1145) at java.util.concurrent.ThreadPoolExecutor$Worker.run(ThreadPoolExecutor.java:615) at java.lang.Thread.run(Thread.java:722) ... Removed 10 stack frames
java.lang.NoSuchMethodError: org.jclouds.cloudstack.features.SecurityGroupClient.getSecurityGroupByName(Ljava/lang/String;)Lorg/jclouds/cloudstack/domain/SecurityGroup; at org.jclouds.cloudstack.compute.loaders.FindSecurityGroupOrCreateTest.testLoad(FindSecurityGroupOrCreateTest.java:88) at sun.reflect.NativeMethodAccessorImpl.invoke0(Native Method) at sun.reflect.NativeMethodAccessorImpl.invoke(NativeMethodAccessorImpl.java:57) at sun.reflect.DelegatingMethodAccessorImpl.invoke(DelegatingMethodAccessorImpl.java:43) at java.lang.reflect.Method.invoke(Method.java:601) at org.testng.internal.MethodInvocationHelper.invokeMethod(MethodInvocationHelper.java:80) at org.testng.internal.Invoker.invokeMethod(Invoker.java:714) at org.testng.internal.Invoker.invokeTestMethod(Invoker.java:901) at org.testng.internal.Invoker.invokeTestMethods(Invoker.java:1231) at org.testng.internal.TestMethodWorker.invokeTestMethods(TestMethodWorker.java:127) at org.testng.internal.TestMethodWorker.run(TestMethodWorker.java:111) at java.util.concurrent.ThreadPoolExecutor.runWorker(ThreadPoolExecutor.java:1145) at java.util.concurrent.ThreadPoolExecutor$Worker.run(ThreadPoolExecutor.java:615) at java.lang.Thread.run(Thread.java:722) "
org.jclouds.cloudstack.compute.loaders.FindSecurityGroupOrCreateTest.testLoad(FindSecurityGroupOrCreateTest.java:88)
sun.reflect.NativeMethodAccessorImpl.invoke0(Native Method)
sun.reflect.NativeMethodAccessorImpl.invoke(NativeMethodAccessorImpl.java:57)
sun.reflect.DelegatingMethodAccessorImpl.invoke(DelegatingMethodAccessorImpl.java:43)
java.lang.reflect.Method.invoke(Method.java:601)
org.testng.internal.MethodInvocationHelper.invokeMethod(MethodInvocationHelper.java:80)
org.testng.internal.Invoker.invokeMethod(Invoker.java:714)
org.testng.internal.Invoker.invokeTestMethod(Invoker.java:901)
org.testng.internal.Invoker.invokeTestMethods(Invoker.java:1231)
org.testng.internal.TestMethodWorker.invokeTestMethods(TestMethodWorker.java:127)
org.testng.internal.TestMethodWorker.run(TestMethodWorker.java:111)
java.util.concurrent.ThreadPoolExecutor.runWorker(ThreadPoolExecutor.java:1145)
java.util.concurrent.ThreadPoolExecutor$Worker.run(ThreadPoolExecutor.java:615)
java.lang.Thread.run(Thread.java:722)
testLoadAlreadyExists
"java.lang.NoSuchMethodError: org.jclouds.cloudstack.features.SecurityGroupClient.getSecurityGroupByName(Ljava/lang/String;)Lorg/jclouds/cloudstack/domain/SecurityGroup; at org.jclouds.cloudstack.compute.loaders.FindSecurityGroupOrCreateTest.testLoadAlreadyExists(FindSecurityGroupOrCreateTest.java:156) at java.util.concurrent.ThreadPoolExecutor.runWorker(ThreadPoolExecutor.java:1145) at java.util.concurrent.ThreadPoolExecutor$Worker.run(ThreadPoolExecutor.java:615) at java.lang.Thread.run(Thread.java:722) ... Removed 10 stack frames
java.lang.NoSuchMethodError: org.jclouds.cloudstack.features.SecurityGroupClient.getSecurityGroupByName(Ljava/lang/String;)Lorg/jclouds/cloudstack/domain/SecurityGroup; at org.jclouds.cloudstack.compute.loaders.FindSecurityGroupOrCreateTest.testLoadAlreadyExists(FindSecurityGroupOrCreateTest.java:156) at sun.reflect.NativeMethodAccessorImpl.invoke0(Native Method) at sun.reflect.NativeMethodAccessorImpl.invoke(NativeMethodAccessorImpl.java:57) at sun.reflect.DelegatingMethodAccessorImpl.invoke(DelegatingMethodAccessorImpl.java:43) at java.lang.reflect.Method.invoke(Method.java:601) at org.testng.internal.MethodInvocationHelper.invokeMethod(MethodInvocationHelper.java:80) at org.testng.internal.Invoker.invokeMethod(Invoker.java:714) at org.testng.internal.Invoker.invokeTestMethod(Invoker.java:901) at org.testng.internal.Invoker.invokeTestMethods(Invoker.java:1231) at org.testng.internal.TestMethodWorker.invokeTestMethods(TestMethodWorker.java:127) at org.testng.internal.TestMethodWorker.run(TestMethodWorker.java:111) at java.util.concurrent.ThreadPoolExecutor.runWorker(ThreadPoolExecutor.java:1145) at java.util.concurrent.ThreadPoolExecutor$Worker.run(ThreadPoolExecutor.java:615) at java.lang.Thread.run(Thread.java:722) "
org.jclouds.cloudstack.compute.loaders.FindSecurityGroupOrCreateTest.testLoadAlreadyExists(FindSecurityGroupOrCreateTest.java:156)
sun.reflect.NativeMethodAccessorImpl.invoke0(Native Method)
sun.reflect.NativeMethodAccessorImpl.invoke(NativeMethodAccessorImpl.java:57)
sun.reflect.DelegatingMethodAccessorImpl.invoke(DelegatingMethodAccessorImpl.java:43)
java.lang.reflect.Method.invoke(Method.java:601)
org.testng.internal.MethodInvocationHelper.invokeMethod(MethodInvocationHelper.java:80)
org.testng.internal.Invoker.invokeMethod(Invoker.java:714)
org.testng.internal.Invoker.invokeTestMethod(Invoker.java:901)
org.testng.internal.Invoker.invokeTestMethods(Invoker.java:1231)
org.testng.internal.TestMethodWorker.invokeTestMethods(TestMethodWorker.java:127)
org.testng.internal.TestMethodWorker.run(TestMethodWorker.java:111)
java.util.concurrent.ThreadPoolExecutor.runWorker(ThreadPoolExecutor.java:1145)
java.util.concurrent.ThreadPoolExecutor$Worker.run(ThreadPoolExecutor.java:615)
java.lang.Thread.run(Thread.java:722)
testLoadZoneNoSecurityGroups
"org.testng.TestException: Expected exception java.lang.IllegalArgumentException but got java.lang.NoSuchMethodError: org.jclouds.cloudstack.features.SecurityGroupClient.getSecurityGroupByName(Ljava/lang/String;)Lorg/jclouds/cloudstack/domain/SecurityGroup; at java.util.concurrent.ThreadPoolExecutor.runWorker(ThreadPoolExecutor.java:1145) at java.util.concurrent.ThreadPoolExecutor$Worker.run(ThreadPoolExecutor.java:615) at java.lang.Thread.run(Thread.java:722) Expected exception java.lang.IllegalArgumentException but got java.lang.NoSuchMethodError: org.jclouds.cloudstack.features.SecurityGroupClient.getSecurityGroupByName(Ljava/lang/String;)Lorg/jclouds/cloudstack/domain/SecurityGroup; ... 5 more Caused by: java.lang.NoSuchMethodError: org.jclouds.cloudstack.features.SecurityGroupClient.getSecurityGroupByName(Ljava/lang/String;)Lorg/jclouds/cloudstack/domain/SecurityGroup; at org.jclouds.cloudstack.compute.loaders.FindSecurityGroupOrCreateTest.testLoadZoneNoSecurityGroups(FindSecurityGroupOrCreateTest.java:218) ... 7 more ... Removed 16 stack frames
org.testng.TestException: Expected exception java.lang.IllegalArgumentException but got org.testng.TestException: Expected exception java.lang.IllegalArgumentException but got java.lang.NoSuchMethodError: org.jclouds.cloudstack.features.SecurityGroupClient.getSecurityGroupByName(Ljava/lang/String;)Lorg/jclouds/cloudstack/domain/SecurityGroup; at org.testng.internal.Invoker.handleInvocationResults(Invoker.java:1497) at org.testng.internal.Invoker.invokeTestMethods(Invoker.java:1245) at org.testng.internal.TestMethodWorker.invokeTestMethods(TestMethodWorker.java:127) at org.testng.internal.TestMethodWorker.run(TestMethodWorker.java:111) at java.util.concurrent.ThreadPoolExecutor.runWorker(ThreadPoolExecutor.java:1145) at java.util.concurrent.ThreadPoolExecutor$Worker.run(ThreadPoolExecutor.java:615) at java.lang.Thread.run(Thread.java:722) Caused by: org.testng.TestException: Expected exception java.lang.IllegalArgumentException but got java.lang.NoSuchMethodError: org.jclouds.cloudstack.features.SecurityGroupClient.getSecurityGroupByName(Ljava/lang/String;)Lorg/jclouds/cloudstack/domain/SecurityGroup; at org.testng.internal.Invoker.handleInvocationResults(Invoker.java:1497) at org.testng.internal.Invoker.invokeMethod(Invoker.java:754) at org.testng.internal.Invoker.invokeTestMethod(Invoker.java:901) at org.testng.internal.Invoker.invokeTestMethods(Invoker.java:1231) ... 5 more Caused by: java.lang.NoSuchMethodError: org.jclouds.cloudstack.features.SecurityGroupClient.getSecurityGroupByName(Ljava/lang/String;)Lorg/jclouds/cloudstack/domain/SecurityGroup; at org.jclouds.cloudstack.compute.loaders.FindSecurityGroupOrCreateTest.testLoadZoneNoSecurityGroups(FindSecurityGroupOrCreateTest.java:218) at sun.reflect.NativeMethodAccessorImpl.invoke0(Native Method) at sun.reflect.NativeMethodAccessorImpl.invoke(NativeMethodAccessorImpl.java:57) at sun.reflect.DelegatingMethodAccessorImpl.invoke(DelegatingMethodAccessorImpl.java:43) at java.lang.reflect.Method.invoke(Method.java:601) at org.testng.internal.MethodInvocationHelper.invokeMethod(MethodInvocationHelper.java:80) at org.testng.internal.Invoker.invokeMethod(Invoker.java:714) ... 7 more "
org.testng.internal.Invoker.handleInvocationResults(Invoker.java:1497)
org.testng.internal.Invoker.invokeTestMethods(Invoker.java:1245)
org.testng.internal.TestMethodWorker.invokeTestMethods(TestMethodWorker.java:127)
org.testng.internal.TestMethodWorker.run(TestMethodWorker.java:111)
java.util.concurrent.ThreadPoolExecutor.runWorker(ThreadPoolExecutor.java:1145)
java.util.concurrent.ThreadPoolExecutor$Worker.run(ThreadPoolExecutor.java:615)
java.lang.Thread.run(Thread.java:722)
org.jclouds.cloudstack.functions.CreateSecurityGroupIfNeededTest
testApplyGroupAlreadyExists
"java.lang.NoSuchMethodError: org.jclouds.cloudstack.features.SecurityGroupClient.getSecurityGroupByName(Ljava/lang/String;)Lorg/jclouds/cloudstack/domain/SecurityGroup; at org.jclouds.cloudstack.functions.CreateSecurityGroupIfNeededTest.testApplyGroupAlreadyExists(CreateSecurityGroupIfNeededTest.java:148) at java.util.concurrent.ThreadPoolExecutor.runWorker(ThreadPoolExecutor.java:1145) at java.util.concurrent.ThreadPoolExecutor$Worker.run(ThreadPoolExecutor.java:615) at java.lang.Thread.run(Thread.java:722) ... Removed 10 stack frames
java.lang.NoSuchMethodError: org.jclouds.cloudstack.features.SecurityGroupClient.getSecurityGroupByName(Ljava/lang/String;)Lorg/jclouds/cloudstack/domain/SecurityGroup; at org.jclouds.cloudstack.functions.CreateSecurityGroupIfNeededTest.testApplyGroupAlreadyExists(CreateSecurityGroupIfNeededTest.java:148) at sun.reflect.NativeMethodAccessorImpl.invoke0(Native Method) at sun.reflect.NativeMethodAccessorImpl.invoke(NativeMethodAccessorImpl.java:57) at sun.reflect.DelegatingMethodAccessorImpl.invoke(DelegatingMethodAccessorImpl.java:43) at java.lang.reflect.Method.invoke(Method.java:601) at org.testng.internal.MethodInvocationHelper.invokeMethod(MethodInvocationHelper.java:80) at org.testng.internal.Invoker.invokeMethod(Invoker.java:714) at org.testng.internal.Invoker.invokeTestMethod(Invoker.java:901) at org.testng.internal.Invoker.invokeTestMethods(Invoker.java:1231) at org.testng.internal.TestMethodWorker.invokeTestMethods(TestMethodWorker.java:127) at org.testng.internal.TestMethodWorker.run(TestMethodWorker.java:111) at java.util.concurrent.ThreadPoolExecutor.runWorker(ThreadPoolExecutor.java:1145) at java.util.concurrent.ThreadPoolExecutor$Worker.run(ThreadPoolExecutor.java:615) at java.lang.Thread.run(Thread.java:722) "
org.jclouds.cloudstack.functions.CreateSecurityGroupIfNeededTest.testApplyGroupAlreadyExists(CreateSecurityGroupIfNeededTest.java:148)
sun.reflect.NativeMethodAccessorImpl.invoke0(Native Method)
sun.reflect.NativeMethodAccessorImpl.invoke(NativeMethodAccessorImpl.java:57)
sun.reflect.DelegatingMethodAccessorImpl.invoke(DelegatingMethodAccessorImpl.java:43)
java.lang.reflect.Method.invoke(Method.java:601)
org.testng.internal.MethodInvocationHelper.invokeMethod(MethodInvocationHelper.java:80)
org.testng.internal.Invoker.invokeMethod(Invoker.java:714)
org.testng.internal.Invoker.invokeTestMethod(Invoker.java:901)
org.testng.internal.Invoker.invokeTestMethods(Invoker.java:1231)
org.testng.internal.TestMethodWorker.invokeTestMethods(TestMethodWorker.java:127)
org.testng.internal.TestMethodWorker.run(TestMethodWorker.java:111)
java.util.concurrent.ThreadPoolExecutor.runWorker(ThreadPoolExecutor.java:1145)
java.util.concurrent.ThreadPoolExecutor$Worker.run(ThreadPoolExecutor.java:615)
java.lang.Thread.run(Thread.java:722)
org.jclouds.cloudstack.parse.ListHostsResponseTest
compare
"org.testng.TestNGException: Method compare requires 2 parameters but 0 were supplied in the @Test annotation. at java.util.concurrent.ThreadPoolExecutor.runWorker(ThreadPoolExecutor.java:1145) at java.util.concurrent.ThreadPoolExecutor$Worker.run(ThreadPoolExecutor.java:615) at java.lang.Thread.run(Thread.java:722) ... Removed 9 stack frames
org.testng.TestNGException: Method compare requires 2 parameters but 0 were supplied in the @Test annotation. at org.testng.internal.Parameters.checkParameterTypes(Parameters.java:198) at org.testng.internal.Parameters.createParameters(Parameters.java:134) at org.testng.internal.Parameters.createParameters(Parameters.java:370) at org.testng.internal.Parameters.handleParameters(Parameters.java:447) at org.testng.internal.Invoker.handleParameters(Invoker.java:1383) at org.testng.internal.Invoker.createParameters(Invoker.java:1075) at org.testng.internal.Invoker.invokeTestMethods(Invoker.java:1180) at org.testng.internal.TestMethodWorker.invokeTestMethods(TestMethodWorker.java:127) at org.testng.internal.TestMethodWorker.run(TestMethodWorker.java:111) at java.util.concurrent.ThreadPoolExecutor.runWorker(ThreadPoolExecutor.java:1145) at java.util.concurrent.ThreadPoolExecutor$Worker.run(ThreadPoolExecutor.java:615) at java.lang.Thread.run(Thread.java:722) "
org.testng.internal.Parameters.checkParameterTypes(Parameters.java:198)
org.testng.internal.Parameters.createParameters(Parameters.java:134)
org.testng.internal.Parameters.createParameters(Parameters.java:370)
org.testng.internal.Parameters.handleParameters(Parameters.java:447)
org.testng.internal.Invoker.handleParameters(Invoker.java:1383)
org.testng.internal.Invoker.createParameters(Invoker.java:1075)
org.testng.internal.Invoker.invokeTestMethods(Invoker.java:1180)
org.testng.internal.TestMethodWorker.invokeTestMethods(TestMethodWorker.java:127)
org.testng.internal.TestMethodWorker.run(TestMethodWorker.java:111)
java.util.concurrent.ThreadPoolExecutor.runWorker(ThreadPoolExecutor.java:1145)
java.util.concurrent.ThreadPoolExecutor$Worker.run(ThreadPoolExecutor.java:615)
java.lang.Thread.run(Thread.java:722)
compare
"org.testng.TestNGException: Method compare requires 2 parameters but 0 were supplied in the @Test annotation. at java.util.concurrent.ThreadPoolExecutor.runWorker(ThreadPoolExecutor.java:1145) at java.util.concurrent.ThreadPoolExecutor$Worker.run(ThreadPoolExecutor.java:615) at java.lang.Thread.run(Thread.java:722) ... Removed 9 stack frames
org.testng.TestNGException: Method compare requires 2 parameters but 0 were supplied in the @Test annotation. at org.testng.internal.Parameters.checkParameterTypes(Parameters.java:198) at org.testng.internal.Parameters.createParameters(Parameters.java:134) at org.testng.internal.Parameters.createParameters(Parameters.java:370) at org.testng.internal.Parameters.handleParameters(Parameters.java:447) at org.testng.internal.Invoker.handleParameters(Invoker.java:1383) at org.testng.internal.Invoker.createParameters(Invoker.java:1075) at org.testng.internal.Invoker.invokeTestMethods(Invoker.java:1180) at org.testng.internal.TestMethodWorker.invokeTestMethods(TestMethodWorker.java:127) at org.testng.internal.TestMethodWorker.run(TestMethodWorker.java:111) at java.util.concurrent.ThreadPoolExecutor.runWorker(ThreadPoolExecutor.java:1145) at java.util.concurrent.ThreadPoolExecutor$Worker.run(ThreadPoolExecutor.java:615) at java.lang.Thread.run(Thread.java:722) "
org.testng.internal.Parameters.checkParameterTypes(Parameters.java:198)
org.testng.internal.Parameters.createParameters(Parameters.java:134)
org.testng.internal.Parameters.createParameters(Parameters.java:370)
org.testng.internal.Parameters.handleParameters(Parameters.java:447)
org.testng.internal.Invoker.handleParameters(Invoker.java:1383)
org.testng.internal.Invoker.createParameters(Invoker.java:1075)
org.testng.internal.Invoker.invokeTestMethods(Invoker.java:1180)
org.testng.internal.TestMethodWorker.invokeTestMethods(TestMethodWorker.java:127)
org.testng.internal.TestMethodWorker.run(TestMethodWorker.java:111)
java.util.concurrent.ThreadPoolExecutor.runWorker(ThreadPoolExecutor.java:1145)
java.util.concurrent.ThreadPoolExecutor$Worker.run(ThreadPoolExecutor.java:615)
java.lang.Thread.run(Thread.java:722)
--
This message is automatically generated by JIRA.
If you think it was sent incorrectly, please contact your JIRA administrators
For more information on JIRA, see: http://www.atlassian.com/software/jira