You are viewing a plain text version of this content. The canonical link for it is here.
Posted to commits@beam.apache.org by Apache Jenkins Server <je...@builds.apache.org> on 2018/06/30 10:14:10 UTC
Build failed in Jenkins: beam_PostCommit_Java_GradleBuild #1002
See <https://builds.apache.org/job/beam_PostCommit_Java_GradleBuild/1002/display/redirect?page=changes>
Changes:
[relax] Rename RowType -> Schema and move to new schemas package.
[relax] Add classes for SchemaRegistry and SchemaProvider.
[relax] Add SchemaCoder, some more detail in SchemaProvider/Registery, and
[relax] Update to comment.
[relax] Integrate Schemas into PCollection Coder inference.
[relax] Add setSchema convenience method.
[relax] Fix compilation errors.
[relax] Refactor Schema: Schema now is a fully-specified based on primitive
[relax] Implement SchemaCoder and fix up schema classes.
[relax] Flesh out FieldAccessDescriptor.
[relax] Start plumbing through DoFn.
[relax] Start editing signatures
[relax] Finish plumbing schemas through.
[relax] Add test for schema PCollection.
[relax] Add withSchema to Create.java
[relax] Plumb schemas through OutputReceiver.
[relax] Add an implementation of SchemaProvider.
[relax] Add SchemaRegistry and a test for schema inference. Change schema
[relax] Add unit test for SchemaRegistry.
[relax] Add FieldAccessDescriptorTest
[relax] Add test for Create changes.
[relax] Plumb FieldAccess through.
[relax] Make sure everything is marked experimental with Kind.SCHEMAS
[relax] Add graph-construction time verification of schemas.
[relax] Fix build and style failures.
[relax] Address code-review comments.
[relax] Fixup after merge.
[relax] Apply spotless autoformat.
[relax] Fix compilation error introduced by merge.
[relax] Fix CheckStyle errors.
[relax] Fix Apex runner.
[relax] Fix more breakages.
[relax] run spotless.
[relax] Fix issues.
[relax] Fix Spark issue.
[relax] Address code-review comments and fix a failing test.
[relax] Fix Apex runner.
[relax] Change ParDoSchemaTest to ValidatesRunner, and exclude unsupported
[relax] Make worker changes backwards compatible with DataflowRunner. Once
[relax] Add another backwards-compatible method.
[klk] Add integrationTest task for GCP IO module
[klk] PubsubIO: Always use GCP project from PipelineOptions for subscriptions
[klk] Use BagState in PubsubSignal since it doesn't use SetState methods
[klk] Replace println with logging
[klk] More logging when PubsubJsonIT fails
[klk] Add start signal to TestPubsubSignal
[klk] Use futures in PubsubJsonIT LIMIT test
[klk] Integration test of Pubsub public dataset
[klk] Use test PipelineOptions in PubsubJsonIT LIMIT test
[klk] Sickbay PubsubReadIT on Dataflow
[klk] Fix import order
------------------------------------------
[...truncated 2.67 MB...]
Jun 30, 2018 10:14:06 AM org.apache.beam.sdk.io.FileBasedSink$WriteOperation createMissingEmptyShards
INFO: Opening empty writer f0f9c7a3-6a8f-4325-9ca3-54334b1d9af3 for destination null
Jun 30, 2018 10:14:06 AM org.apache.beam.sdk.io.FileBasedSink$Writer close
INFO: Successfully wrote temporary file /tmp/junit2781139394677014684/output/.temp-beam-2018-06-30_10-14-06-5/f0f9c7a3-6a8f-4325-9ca3-54334b1d9af3
Jun 30, 2018 10:14:06 AM org.apache.beam.sdk.io.FileBasedSink$WriteOperation createMissingEmptyShards
INFO: Opening empty writer c327f817-e156-44fa-9852-1127b517f066 for destination null
Jun 30, 2018 10:14:06 AM org.apache.beam.sdk.io.FileBasedSink$Writer close
INFO: Successfully wrote temporary file /tmp/junit2781139394677014684/output/.temp-beam-2018-06-30_10-14-06-5/c327f817-e156-44fa-9852-1127b517f066
Jun 30, 2018 10:14:06 AM org.apache.beam.sdk.io.FileBasedSink$WriteOperation createMissingEmptyShards
INFO: Opening empty writer a354ce1e-a70f-4486-9abf-4121c5359a4f for destination null
Jun 30, 2018 10:14:06 AM org.apache.beam.sdk.io.FileBasedSink$Writer close
INFO: Successfully wrote temporary file /tmp/junit2781139394677014684/output/.temp-beam-2018-06-30_10-14-06-5/a354ce1e-a70f-4486-9abf-4121c5359a4f
org.apache.beam.sdk.io.FileBasedSinkTest > testFinalizeMultipleCalls STANDARD_ERROR
Jun 30, 2018 10:14:06 AM org.apache.beam.sdk.io.FileBasedSink$WriteOperation createMissingEmptyShards
INFO: Finalizing for destination null num shards 3.
Jun 30, 2018 10:14:06 AM org.apache.beam.sdk.io.FileBasedSink$WriteOperation moveToOutputFiles
INFO: Will copy temporary file FileResult{tempFilename=/tmp/junit116453407567605626/tmp/junit116453407567605626/temp/0, shard=0, window=org.apache.beam.sdk.transforms.windowing.GlobalWindow@5bf5afcd, paneInfo=PaneInfo{isFirst=true, isLast=true, timing=ON_TIME, index=0, onTimeIndex=0}} to final location /tmp/junit116453407567605626/output/file-00-of-03.test
Jun 30, 2018 10:14:06 AM org.apache.beam.sdk.io.FileBasedSink$WriteOperation moveToOutputFiles
INFO: Will copy temporary file FileResult{tempFilename=/tmp/junit116453407567605626/tmp/junit116453407567605626/temp/1, shard=1, window=org.apache.beam.sdk.transforms.windowing.GlobalWindow@5bf5afcd, paneInfo=PaneInfo{isFirst=true, isLast=true, timing=ON_TIME, index=0, onTimeIndex=0}} to final location /tmp/junit116453407567605626/output/file-01-of-03.test
Jun 30, 2018 10:14:06 AM org.apache.beam.sdk.io.FileBasedSink$WriteOperation moveToOutputFiles
INFO: Will copy temporary file FileResult{tempFilename=/tmp/junit116453407567605626/tmp/junit116453407567605626/temp/2, shard=2, window=org.apache.beam.sdk.transforms.windowing.GlobalWindow@5bf5afcd, paneInfo=PaneInfo{isFirst=true, isLast=true, timing=ON_TIME, index=0, onTimeIndex=0}} to final location /tmp/junit116453407567605626/output/file-02-of-03.test
Jun 30, 2018 10:14:06 AM org.apache.beam.sdk.io.FileBasedSink$WriteOperation removeTemporaryFiles
INFO: Will remove known temporary file /tmp/junit116453407567605626/tmp/junit116453407567605626/temp/0
Jun 30, 2018 10:14:06 AM org.apache.beam.sdk.io.FileBasedSink$WriteOperation removeTemporaryFiles
INFO: Will remove known temporary file /tmp/junit116453407567605626/tmp/junit116453407567605626/temp/1
Jun 30, 2018 10:14:06 AM org.apache.beam.sdk.io.FileBasedSink$WriteOperation removeTemporaryFiles
INFO: Will remove known temporary file /tmp/junit116453407567605626/tmp/junit116453407567605626/temp/2
Jun 30, 2018 10:14:06 AM org.apache.beam.sdk.io.FileBasedSink$WriteOperation createMissingEmptyShards
INFO: Finalizing for destination null num shards 3.
Jun 30, 2018 10:14:06 AM org.apache.beam.sdk.io.FileBasedSink$WriteOperation moveToOutputFiles
INFO: Will copy temporary file FileResult{tempFilename=/tmp/junit116453407567605626/tmp/junit116453407567605626/temp/0, shard=0, window=org.apache.beam.sdk.transforms.windowing.GlobalWindow@5bf5afcd, paneInfo=PaneInfo{isFirst=true, isLast=true, timing=ON_TIME, index=0, onTimeIndex=0}} to final location /tmp/junit116453407567605626/output/file-00-of-03.test
Jun 30, 2018 10:14:06 AM org.apache.beam.sdk.io.FileBasedSink$WriteOperation moveToOutputFiles
INFO: Will copy temporary file FileResult{tempFilename=/tmp/junit116453407567605626/tmp/junit116453407567605626/temp/1, shard=1, window=org.apache.beam.sdk.transforms.windowing.GlobalWindow@5bf5afcd, paneInfo=PaneInfo{isFirst=true, isLast=true, timing=ON_TIME, index=0, onTimeIndex=0}} to final location /tmp/junit116453407567605626/output/file-01-of-03.test
Jun 30, 2018 10:14:06 AM org.apache.beam.sdk.io.FileBasedSink$WriteOperation moveToOutputFiles
INFO: Will copy temporary file FileResult{tempFilename=/tmp/junit116453407567605626/tmp/junit116453407567605626/temp/2, shard=2, window=org.apache.beam.sdk.transforms.windowing.GlobalWindow@5bf5afcd, paneInfo=PaneInfo{isFirst=true, isLast=true, timing=ON_TIME, index=0, onTimeIndex=0}} to final location /tmp/junit116453407567605626/output/file-02-of-03.test
Jun 30, 2018 10:14:06 AM org.apache.beam.sdk.io.FileBasedSink$WriteOperation removeTemporaryFiles
INFO: Will remove known temporary file /tmp/junit116453407567605626/tmp/junit116453407567605626/temp/0
Jun 30, 2018 10:14:06 AM org.apache.beam.sdk.io.FileBasedSink$WriteOperation removeTemporaryFiles
INFO: Will remove known temporary file /tmp/junit116453407567605626/tmp/junit116453407567605626/temp/1
Jun 30, 2018 10:14:06 AM org.apache.beam.sdk.io.FileBasedSink$WriteOperation removeTemporaryFiles
INFO: Will remove known temporary file /tmp/junit116453407567605626/tmp/junit116453407567605626/temp/2
org.apache.beam.sdk.io.FileBasedSinkTest > testWriter STANDARD_ERROR
Jun 30, 2018 10:14:06 AM org.apache.beam.sdk.io.FileBasedSink$Writer close
INFO: Successfully wrote temporary file /tmp/junit719991416903010184/temp/testId
org.apache.beam.sdk.io.FileBasedSourceTest > testFractionConsumedWhenReadingFilepattern STANDARD_ERROR
Jun 30, 2018 10:14:06 AM org.apache.beam.sdk.io.FileBasedSource createReader
INFO: Matched 3 files for pattern /tmp/junit1720817687249898167/file*
org.apache.beam.sdk.io.FileBasedSourceTest > testReadAllSplitsOfFilePattern STANDARD_ERROR
Jun 30, 2018 10:14:06 AM org.apache.beam.sdk.io.FileBasedSource split
INFO: Splitting filepattern /tmp/junit7707288506471767580/file* into bundles of size 512 took 0 ms and produced 3 files and 3 bundles
org.apache.beam.sdk.io.FileBasedSourceTest > testReadEverythingFromFileWithSplits STANDARD_ERROR
Jun 30, 2018 10:14:06 AM org.apache.beam.sdk.io.FileBasedSource createReader
INFO: Matched 1 files for pattern /tmp/junit1874492705034729706/file
org.apache.beam.sdk.io.FileBasedSourceTest > testEstimatedSizeOfFilePattern STANDARD_ERROR
Jun 30, 2018 10:14:06 AM org.apache.beam.sdk.io.FileBasedSource getEstimatedSizeBytes
INFO: Filepattern /tmp/junit4846355777896843126/file* matched 3 files with total size 360
org.apache.beam.sdk.io.FileBasedSourceTest > testEstimatedSizeOfFile STANDARD_ERROR
Jun 30, 2018 10:14:06 AM org.apache.beam.sdk.io.FileBasedSource getEstimatedSizeBytes
INFO: Filepattern /tmp/junit3262167302453562823/file matched 1 files with total size 200
org.apache.beam.sdk.io.FileBasedSourceTest > testFullyReadSingleFile STANDARD_ERROR
Jun 30, 2018 10:14:06 AM org.apache.beam.sdk.io.FileBasedSource createReader
INFO: Matched 1 files for pattern /tmp/junit1959152653491634504/file
org.apache.beam.sdk.io.FileBasedSourceTest > testReadAllSplitsOfSingleFile STANDARD_ERROR
Jun 30, 2018 10:14:06 AM org.apache.beam.sdk.io.FileBasedSource split
INFO: Splitting filepattern /tmp/junit8297780100802762466/file into bundles of size 32 took 0 ms and produced 1 files and 6 bundles
org.apache.beam.sdk.io.FileBasedSourceTest > testFullyReadFilePatternFirstRecordEmpty STANDARD_ERROR
Jun 30, 2018 10:14:06 AM org.apache.beam.sdk.io.FileBasedSource createReader
INFO: Matched 3 files for pattern /tmp/junit1298757202230634859/file*
org.apache.beam.sdk.io.FileBasedSourceTest > testEmptyFilepatternTreatmentAllow STANDARD_ERROR
Jun 30, 2018 10:14:06 AM org.apache.beam.sdk.io.FileBasedSource createReader
INFO: Matched 0 files for pattern /tmp/junit2023316624818441195/doesNotExist
Jun 30, 2018 10:14:06 AM org.apache.beam.sdk.io.FileBasedSource createReader
INFO: Matched 0 files for pattern /tmp/junit2023316624818441195/doesNotExist*
org.apache.beam.sdk.io.FileBasedSourceTest > testSplitAtFractionExhaustive STANDARD_ERROR
Jun 30, 2018 10:14:06 AM org.apache.beam.sdk.testing.SourceTestUtils assertSplitAtFractionExhaustive
WARNING: After 101 concurrent splitting trials at item #1, observed only failure, giving up on this item
Jun 30, 2018 10:14:06 AM org.apache.beam.sdk.testing.SourceTestUtils assertSplitAtFractionExhaustive
WARNING: After 101 concurrent splitting trials at item #2, observed only failure, giving up on this item
Jun 30, 2018 10:14:06 AM org.apache.beam.sdk.testing.SourceTestUtils assertSplitAtFractionExhaustive
WARNING: After 101 concurrent splitting trials at item #3, observed only failure, giving up on this item
Jun 30, 2018 10:14:06 AM org.apache.beam.sdk.testing.SourceTestUtils assertSplitAtFractionExhaustive
WARNING: After 101 concurrent splitting trials at item #4, observed only failure, giving up on this item
Jun 30, 2018 10:14:06 AM org.apache.beam.sdk.testing.SourceTestUtils assertSplitAtFractionExhaustive
WARNING: After 101 concurrent splitting trials at item #5, observed only failure, giving up on this item
Jun 30, 2018 10:14:06 AM org.apache.beam.sdk.testing.SourceTestUtils assertSplitAtFractionExhaustive
WARNING: After 101 concurrent splitting trials at item #6, observed only failure, giving up on this item
Jun 30, 2018 10:14:06 AM org.apache.beam.sdk.testing.SourceTestUtils assertSplitAtFractionExhaustive
WARNING: After 101 concurrent splitting trials at item #7, observed only failure, giving up on this item
Jun 30, 2018 10:14:06 AM org.apache.beam.sdk.testing.SourceTestUtils assertSplitAtFractionExhaustive
WARNING: After 101 concurrent splitting trials at item #8, observed only failure, giving up on this item
Jun 30, 2018 10:14:06 AM org.apache.beam.sdk.testing.SourceTestUtils assertSplitAtFractionExhaustive
WARNING: After 101 concurrent splitting trials at item #9, observed only failure, giving up on this item
Jun 30, 2018 10:14:06 AM org.apache.beam.sdk.testing.SourceTestUtils assertSplitAtFractionExhaustive
WARNING: After 101 concurrent splitting trials at item #10, observed only failure, giving up on this item
Jun 30, 2018 10:14:06 AM org.apache.beam.sdk.testing.SourceTestUtils assertSplitAtFractionExhaustive
WARNING: After 1010 total concurrent splitting trials, considered only 10 items, giving up.
Jun 30, 2018 10:14:06 AM org.apache.beam.sdk.testing.SourceTestUtils assertSplitAtFractionExhaustive
INFO: 1010 total concurrent splitting trials for 20 items
org.apache.beam.sdk.io.FileBasedSourceTest > testCloseUnstartedFilePatternReader STANDARD_ERROR
Jun 30, 2018 10:14:06 AM org.apache.beam.sdk.io.FileBasedSource createReader
INFO: Matched 3 files for pattern /tmp/junit1880407443311587331/file*
org.apache.beam.sdk.io.FileBasedSourceTest > testFullyReadFilePattern STANDARD_ERROR
Jun 30, 2018 10:14:06 AM org.apache.beam.sdk.io.FileBasedSource createReader
INFO: Matched 3 files for pattern /tmp/junit4052935648203129266/file*
org.apache.beam.sdk.io.OffsetBasedSourceTest > testSplitAtFractionExhaustive STANDARD_ERROR
Jun 30, 2018 10:14:06 AM org.apache.beam.sdk.testing.SourceTestUtils assertSplitAtFractionExhaustive
WARNING: After 101 concurrent splitting trials at item #1, observed only failure, giving up on this item
Jun 30, 2018 10:14:06 AM org.apache.beam.sdk.testing.SourceTestUtils assertSplitAtFractionExhaustive
WARNING: After 101 concurrent splitting trials at item #2, observed only failure, giving up on this item
Jun 30, 2018 10:14:06 AM org.apache.beam.sdk.testing.SourceTestUtils assertSplitAtFractionExhaustive
WARNING: After 101 concurrent splitting trials at item #3, observed only failure, giving up on this item
Jun 30, 2018 10:14:06 AM org.apache.beam.sdk.testing.SourceTestUtils assertSplitAtFractionExhaustive
WARNING: After 101 concurrent splitting trials at item #4, observed only failure, giving up on this item
Jun 30, 2018 10:14:06 AM org.apache.beam.sdk.testing.SourceTestUtils assertSplitAtFractionExhaustive
WARNING: After 101 concurrent splitting trials at item #5, observed only failure, giving up on this item
Jun 30, 2018 10:14:06 AM org.apache.beam.sdk.testing.SourceTestUtils assertSplitAtFractionExhaustive
WARNING: After 101 concurrent splitting trials at item #6, observed only failure, giving up on this item
Jun 30, 2018 10:14:06 AM org.apache.beam.sdk.testing.SourceTestUtils assertSplitAtFractionExhaustive
WARNING: After 101 concurrent splitting trials at item #7, observed only failure, giving up on this item
Jun 30, 2018 10:14:06 AM org.apache.beam.sdk.testing.SourceTestUtils assertSplitAtFractionExhaustive
INFO: 707 total concurrent splitting trials for 20 items
org.apache.beam.sdk.io.range.ByteKeyRangeEstimateFractionTest > testEstimateFractionForKey[385: i=22, k=23] STANDARD_ERROR
Jun 30, 2018 10:14:06 AM org.apache.beam.sdk.io.range.ByteKeyRange estimateFractionForKey
WARNING: Using 0.0 as the default fraction for this near-empty range ByteKeyRange{startKey=[ff], endKey=[ff00]} where start and end keys differ only by trailing zeros.
org.apache.beam.sdk.io.range.ByteKeyRangeTrackerTest > testToString STANDARD_ERROR
Jun 30, 2018 10:14:06 AM org.apache.beam.sdk.io.range.ByteKeyRangeTracker tryReturnRecordAt
INFO: Adjusting range start from [12] to [12] as position of first returned record
org.apache.beam.sdk.io.range.ByteKeyRangeTrackerTest > testSplitAtPosition STANDARD_ERROR
Jun 30, 2018 10:14:06 AM org.apache.beam.sdk.io.range.ByteKeyRangeTracker trySplitAtPosition
WARNING: ByteKeyRangeTracker{range=ByteKeyRange{startKey=[12], endKey=[34]}, position=null}: Rejecting split request at [23] because no records have been returned.
Jun 30, 2018 10:14:06 AM org.apache.beam.sdk.io.range.ByteKeyRangeTracker tryReturnRecordAt
INFO: Adjusting range start from [12] to [12] as position of first returned record
Jun 30, 2018 10:14:06 AM org.apache.beam.sdk.io.range.ByteKeyRangeTracker trySplitAtPosition
WARNING: ByteKeyRangeTracker{range=ByteKeyRange{startKey=[12], endKey=[33]}, position=[12]}: Rejecting split request at [34] because it is not within the range.
Jun 30, 2018 10:14:06 AM org.apache.beam.sdk.io.range.ByteKeyRangeTracker trySplitAtPosition
WARNING: ByteKeyRangeTracker{range=ByteKeyRange{startKey=[12], endKey=[33]}, position=[23]}: Rejecting split request at [23] because it is not after current position [23].
org.apache.beam.sdk.io.range.ByteKeyRangeTrackerTest > testGetFractionConsumedAfterOutOfRangeClaim STANDARD_ERROR
Jun 30, 2018 10:14:06 AM org.apache.beam.sdk.io.range.ByteKeyRangeTracker tryReturnRecordAt
INFO: Adjusting range start from [12] to [12] as position of first returned record
org.apache.beam.sdk.io.range.ByteKeyRangeTrackerTest > testGetFractionConsumed STANDARD_ERROR
Jun 30, 2018 10:14:06 AM org.apache.beam.sdk.io.range.ByteKeyRangeTracker tryReturnRecordAt
INFO: Adjusting range start from [12] to [12] as position of first returned record
org.apache.beam.sdk.io.range.ByteKeyRangeTrackerTest > testGetFractionConsumedUpdateStartKey STANDARD_ERROR
Jun 30, 2018 10:14:06 AM org.apache.beam.sdk.io.range.ByteKeyRangeTracker tryReturnRecordAt
INFO: Adjusting range start from [12] to [14] as position of first returned record
org.apache.beam.sdk.io.range.ByteKeyRangeTrackerTest > testTryReturnBeforeLastReturnedRecord STANDARD_ERROR
Jun 30, 2018 10:14:06 AM org.apache.beam.sdk.io.range.ByteKeyRangeTracker tryReturnRecordAt
INFO: Adjusting range start from [12] to [12] as position of first returned record
org.apache.beam.sdk.io.range.ByteKeyRangeTrackerTest > testUpdateStartKey STANDARD_ERROR
Jun 30, 2018 10:14:06 AM org.apache.beam.sdk.io.range.ByteKeyRangeTracker tryReturnRecordAt
INFO: Adjusting range start from [12] to [14] as position of first returned record
org.apache.beam.sdk.io.range.ByteKeyRangeTrackerTest > testGetFractionConsumedAfterDone STANDARD_ERROR
Jun 30, 2018 10:14:06 AM org.apache.beam.sdk.io.range.ByteKeyRangeTracker tryReturnRecordAt
INFO: Adjusting range start from [12] to [12] as position of first returned record
org.apache.beam.sdk.io.range.ByteKeyRangeTrackerTest > testTryReturnRecordAt STANDARD_ERROR
Jun 30, 2018 10:14:06 AM org.apache.beam.sdk.io.range.ByteKeyRangeTracker tryReturnRecordAt
INFO: Adjusting range start from [12] to [12] as position of first returned record
org.apache.beam.sdk.io.range.ByteKeyRangeTrackerTest > testGetSplitPointsConsumed STANDARD_ERROR
Jun 30, 2018 10:14:06 AM org.apache.beam.sdk.io.range.ByteKeyRangeTracker tryReturnRecordAt
INFO: Adjusting range start from [12] to [12] as position of first returned record
org.apache.beam.sdk.util.MutationDetectorsTest > testMutationWithEqualEncodings STANDARD_ERROR
Jun 30, 2018 10:14:07 AM org.apache.beam.sdk.util.MutationDetectors$CodedValueMutationDetector verifyUnmodifiedThrowingCheckedExceptions
WARNING: Coder of type class org.apache.beam.sdk.util.MutationDetectorsTest$1EncodingBadStructuralValueCoder has a #structuralValue method which does not return true when the encoding of the elements is equal. Element [1, foo, [Ljava.lang.Byte;@4f973fc2]
org.apache.beam.sdk.util.NumberedShardedFileTest > testReadWithRetriesFailsWhenOutputDirEmpty STANDARD_ERROR
Jun 30, 2018 10:14:07 AM org.apache.beam.sdk.util.NumberedShardedFile readFilesWithRetries
WARNING: Error in file reading. Ignore and retry.
Jun 30, 2018 10:14:07 AM org.apache.beam.sdk.util.NumberedShardedFile readFilesWithRetries
WARNING: Error in file reading. Ignore and retry.
Jun 30, 2018 10:14:07 AM org.apache.beam.sdk.util.NumberedShardedFile readFilesWithRetries
WARNING: Error in file reading. Ignore and retry.
Jun 30, 2018 10:14:07 AM org.apache.beam.sdk.util.NumberedShardedFile readFilesWithRetries
WARNING: Error in file reading. Ignore and retry.
Jun 30, 2018 10:14:07 AM org.apache.beam.sdk.util.NumberedShardedFile readFilesWithRetries
WARNING: Error in file reading. Ignore and retry.
Gradle Test Executor 42 finished executing tests.
> Task :beam-sdks-java-core:test
Finished generating test XML results (0.033 secs) into: <https://builds.apache.org/job/beam_PostCommit_Java_GradleBuild/ws/src/sdks/java/core/build/test-results/test>
Generating HTML test report...
Finished generating test html results (0.112 secs) into: <https://builds.apache.org/job/beam_PostCommit_Java_GradleBuild/ws/src/sdks/java/core/build/reports/tests/test>
Packing task ':beam-sdks-java-core:test'
:beam-sdks-java-core:test (Thread[Task worker for ':' Thread 14,5,main]) completed. Took 28.056 secs.
:beam-sdks-java-core:check (Thread[Task worker for ':' Thread 14,5,main]) started.
> Task :beam-sdks-java-core:check
Skipping task ':beam-sdks-java-core:check' as it has no actions.
:beam-sdks-java-core:check (Thread[Task worker for ':' Thread 14,5,main]) completed. Took 0.0 secs.
:beam-sdks-java-core:build (Thread[Task worker for ':' Thread 14,5,main]) started.
> Task :beam-sdks-java-core:build
Skipping task ':beam-sdks-java-core:build' as it has no actions.
:beam-sdks-java-core:build (Thread[Task worker for ':' Thread 14,5,main]) completed. Took 0.0 secs.
:beam-sdks-java-core:buildNeeded (Thread[Daemon worker,5,main]) started.
> Task :beam-sdks-java-core:buildNeeded
Skipping task ':beam-sdks-java-core:buildNeeded' as it has no actions.
:beam-sdks-java-core:buildNeeded (Thread[Daemon worker,5,main]) completed. Took 0.0 secs.
FAILURE: Build failed with an exception.
* What went wrong:
Execution failed for task ':beam-runners-core-java:compileJava'.
> Compilation failed with exit code 1; see the compiler error output for details.
* Try:
Run with --stacktrace option to get the stack trace. Run with --debug option to get more log output. Run with --scan to get full insights.
* Get more help at https://help.gradle.org
Deprecated Gradle features were used in this build, making it incompatible with Gradle 5.0.
See https://docs.gradle.org/4.8/userguide/command_line_interface.html#sec:command_line_warnings
BUILD FAILED in 4m 55s
338 actionable tasks: 335 executed, 3 from cache
Publishing build scan...
https://gradle.com/s/c6z7btdkhwj3a
Build step 'Invoke Gradle script' changed build result to FAILURE
Build step 'Invoke Gradle script' marked build as failure
Jenkins build is back to normal : beam_PostCommit_Java_GradleBuild
#1005
Posted by Apache Jenkins Server <je...@builds.apache.org>.
See <https://builds.apache.org/job/beam_PostCommit_Java_GradleBuild/1005/display/redirect?page=changes>
Build failed in Jenkins: beam_PostCommit_Java_GradleBuild #1004
Posted by Apache Jenkins Server <je...@builds.apache.org>.
See <https://builds.apache.org/job/beam_PostCommit_Java_GradleBuild/1004/display/redirect?page=changes>
Changes:
[relax] Fix build.
------------------------------------------
[...truncated 19.44 MB...]
INFO: 2018-06-30T20:06:22.775Z: Fusing adjacent ParDo, Read, Write, and Flatten operations
Jun 30, 2018 8:06:27 PM org.apache.beam.runners.dataflow.util.MonitoringUtil$LoggingHandler process
INFO: 2018-06-30T20:06:22.796Z: Elided trivial flatten
Jun 30, 2018 8:06:27 PM org.apache.beam.runners.dataflow.util.MonitoringUtil$LoggingHandler process
INFO: 2018-06-30T20:06:22.831Z: Fusing consumer SpannerIO.Write/Write mutations to Cloud Spanner/Wait.OnSignal/Wait/Map into SpannerIO.Write/Write mutations to Cloud Spanner/Create seed/Read(CreateSource)
Jun 30, 2018 8:06:27 PM org.apache.beam.runners.dataflow.util.MonitoringUtil$LoggingHandler process
INFO: 2018-06-30T20:06:22.859Z: Fusing consumer SpannerIO.Write/Write mutations to Cloud Spanner/Read information schema into SpannerIO.Write/Write mutations to Cloud Spanner/Wait.OnSignal/Wait/Map
Jun 30, 2018 8:06:27 PM org.apache.beam.runners.dataflow.util.MonitoringUtil$LoggingHandler process
INFO: 2018-06-30T20:06:22.892Z: Fusing consumer SpannerIO.Write/Write mutations to Cloud Spanner/Schema View/Combine.GloballyAsSingletonView/BatchViewOverrides.GroupByWindowHashAsKeyAndWindowAsSortKey/BatchViewOverrides.GroupByKeyAndSortValuesOnly/Write into SpannerIO.Write/Write mutations to Cloud Spanner/Schema View/Combine.GloballyAsSingletonView/BatchViewOverrides.GroupByWindowHashAsKeyAndWindowAsSortKey/ParDo(UseWindowHashAsKeyAndWindowAsSortKey)
Jun 30, 2018 8:06:27 PM org.apache.beam.runners.dataflow.util.MonitoringUtil$LoggingHandler process
INFO: 2018-06-30T20:06:22.925Z: Fusing consumer SpannerIO.Write/Write mutations to Cloud Spanner/Schema View/Combine.GloballyAsSingletonView/ParDo(IsmRecordForSingularValuePerWindow) into SpannerIO.Write/Write mutations to Cloud Spanner/Schema View/Combine.GloballyAsSingletonView/BatchViewOverrides.GroupByWindowHashAsKeyAndWindowAsSortKey/BatchViewOverrides.GroupByKeyAndSortValuesOnly/Read
Jun 30, 2018 8:06:27 PM org.apache.beam.runners.dataflow.util.MonitoringUtil$LoggingHandler process
INFO: 2018-06-30T20:06:22.951Z: Fusing consumer SpannerIO.Write/Write mutations to Cloud Spanner/Schema View/Combine.GloballyAsSingletonView/Combine.globally(Singleton)/WithKeys/AddKeys/Map into SpannerIO.Write/Write mutations to Cloud Spanner/Read information schema
Jun 30, 2018 8:06:27 PM org.apache.beam.runners.dataflow.util.MonitoringUtil$LoggingHandler process
INFO: 2018-06-30T20:06:22.983Z: Fusing consumer SpannerIO.Write/Write mutations to Cloud Spanner/Schema View/Combine.GloballyAsSingletonView/Combine.globally(Singleton)/Combine.perKey(Singleton)/Combine.GroupedValues into SpannerIO.Write/Write mutations to Cloud Spanner/Schema View/Combine.GloballyAsSingletonView/Combine.globally(Singleton)/Combine.perKey(Singleton)/GroupByKey/Read
Jun 30, 2018 8:06:27 PM org.apache.beam.runners.dataflow.util.MonitoringUtil$LoggingHandler process
INFO: 2018-06-30T20:06:23.018Z: Fusing consumer SpannerIO.Write/Write mutations to Cloud Spanner/Schema View/Combine.GloballyAsSingletonView/Combine.globally(Singleton)/Values/Values/Map into SpannerIO.Write/Write mutations to Cloud Spanner/Schema View/Combine.GloballyAsSingletonView/Combine.globally(Singleton)/Combine.perKey(Singleton)/Combine.GroupedValues/Extract
Jun 30, 2018 8:06:27 PM org.apache.beam.runners.dataflow.util.MonitoringUtil$LoggingHandler process
INFO: 2018-06-30T20:06:23.053Z: Fusing consumer SpannerIO.Write/Write mutations to Cloud Spanner/Schema View/Combine.GloballyAsSingletonView/BatchViewOverrides.GroupByWindowHashAsKeyAndWindowAsSortKey/ParDo(UseWindowHashAsKeyAndWindowAsSortKey) into SpannerIO.Write/Write mutations to Cloud Spanner/Schema View/Combine.GloballyAsSingletonView/Combine.globally(Singleton)/Values/Values/Map
Jun 30, 2018 8:06:27 PM org.apache.beam.runners.dataflow.util.MonitoringUtil$LoggingHandler process
INFO: 2018-06-30T20:06:23.085Z: Fusing consumer SpannerIO.Write/Write mutations to Cloud Spanner/Schema View/Combine.GloballyAsSingletonView/Combine.globally(Singleton)/Combine.perKey(Singleton)/Combine.GroupedValues/Extract into SpannerIO.Write/Write mutations to Cloud Spanner/Schema View/Combine.GloballyAsSingletonView/Combine.globally(Singleton)/Combine.perKey(Singleton)/Combine.GroupedValues
Jun 30, 2018 8:06:27 PM org.apache.beam.runners.dataflow.util.MonitoringUtil$LoggingHandler process
INFO: 2018-06-30T20:06:23.109Z: Fusing consumer SpannerIO.Write/Write mutations to Cloud Spanner/Schema View/Combine.GloballyAsSingletonView/Combine.globally(Singleton)/Combine.perKey(Singleton)/GroupByKey+SpannerIO.Write/Write mutations to Cloud Spanner/Schema View/Combine.GloballyAsSingletonView/Combine.globally(Singleton)/Combine.perKey(Singleton)/Combine.GroupedValues/Partial into SpannerIO.Write/Write mutations to Cloud Spanner/Schema View/Combine.GloballyAsSingletonView/Combine.globally(Singleton)/WithKeys/AddKeys/Map
Jun 30, 2018 8:06:27 PM org.apache.beam.runners.dataflow.util.MonitoringUtil$LoggingHandler process
INFO: 2018-06-30T20:06:23.144Z: Fusing consumer SpannerIO.Write/Write mutations to Cloud Spanner/Schema View/Combine.GloballyAsSingletonView/Combine.globally(Singleton)/Combine.perKey(Singleton)/GroupByKey/Reify into SpannerIO.Write/Write mutations to Cloud Spanner/Schema View/Combine.GloballyAsSingletonView/Combine.globally(Singleton)/Combine.perKey(Singleton)/GroupByKey+SpannerIO.Write/Write mutations to Cloud Spanner/Schema View/Combine.GloballyAsSingletonView/Combine.globally(Singleton)/Combine.perKey(Singleton)/Combine.GroupedValues/Partial
Jun 30, 2018 8:06:27 PM org.apache.beam.runners.dataflow.util.MonitoringUtil$LoggingHandler process
INFO: 2018-06-30T20:06:23.178Z: Fusing consumer SpannerIO.Write/Write mutations to Cloud Spanner/Schema View/Combine.GloballyAsSingletonView/Combine.globally(Singleton)/Combine.perKey(Singleton)/GroupByKey/Write into SpannerIO.Write/Write mutations to Cloud Spanner/Schema View/Combine.GloballyAsSingletonView/Combine.globally(Singleton)/Combine.perKey(Singleton)/GroupByKey/Reify
Jun 30, 2018 8:06:27 PM org.apache.beam.runners.dataflow.util.MonitoringUtil$LoggingHandler process
INFO: 2018-06-30T20:06:23.212Z: Fusing consumer SpannerIO.Write/Write mutations to Cloud Spanner/Wait.OnSignal/To wait view 0/ParDo(CollectWindows) into SpannerIO.Write/To mutation group
Jun 30, 2018 8:06:27 PM org.apache.beam.runners.dataflow.util.MonitoringUtil$LoggingHandler process
INFO: 2018-06-30T20:06:23.241Z: Fusing consumer SpannerIO.Write/Write mutations to Cloud Spanner/Extract keys into SpannerIO.Write/Write mutations to Cloud Spanner/Serialize mutations
Jun 30, 2018 8:06:27 PM org.apache.beam.runners.dataflow.util.MonitoringUtil$LoggingHandler process
INFO: 2018-06-30T20:06:23.272Z: Fusing consumer ParDo(GenerateMutations) into GenerateSequence/Read(BoundedCountingSource)
Jun 30, 2018 8:06:27 PM org.apache.beam.runners.dataflow.util.MonitoringUtil$LoggingHandler process
INFO: 2018-06-30T20:06:23.307Z: Fusing consumer SpannerIO.Write/Write mutations to Cloud Spanner/Sample keys/Combine.GroupedValues into SpannerIO.Write/Write mutations to Cloud Spanner/Sample keys/GroupByKey/Read
Jun 30, 2018 8:06:27 PM org.apache.beam.runners.dataflow.util.MonitoringUtil$LoggingHandler process
INFO: 2018-06-30T20:06:23.342Z: Fusing consumer SpannerIO.Write/Write mutations to Cloud Spanner/Batch mutations together into SpannerIO.Write/Write mutations to Cloud Spanner/Group by partition/GroupByWindow
Jun 30, 2018 8:06:27 PM org.apache.beam.runners.dataflow.util.MonitoringUtil$LoggingHandler process
INFO: 2018-06-30T20:06:23.375Z: Fusing consumer SpannerIO.Write/Write mutations to Cloud Spanner/Keys sample as view/ParMultiDo(ToIsmRecordForMapLike) into SpannerIO.Write/Write mutations to Cloud Spanner/Keys sample as view/GBKaSVForData/BatchViewOverrides.GroupByKeyAndSortValuesOnly/Read
Jun 30, 2018 8:06:27 PM org.apache.beam.runners.dataflow.util.MonitoringUtil$LoggingHandler process
INFO: 2018-06-30T20:06:23.410Z: Fusing consumer SpannerIO.Write/Write mutations to Cloud Spanner/Keys sample as view/GBKaSVForData/BatchViewOverrides.GroupByKeyAndSortValuesOnly/Write into SpannerIO.Write/Write mutations to Cloud Spanner/Keys sample as view/GBKaSVForData/ParDo(GroupByKeyHashAndSortByKeyAndWindow)
Jun 30, 2018 8:06:27 PM org.apache.beam.runners.dataflow.util.MonitoringUtil$LoggingHandler process
INFO: 2018-06-30T20:06:23.433Z: Fusing consumer SpannerIO.Write/Write mutations to Cloud Spanner/Keys sample as view/GBKaSVForData/ParDo(GroupByKeyHashAndSortByKeyAndWindow) into SpannerIO.Write/Write mutations to Cloud Spanner/Sample keys/Combine.GroupedValues/Extract
Jun 30, 2018 8:06:27 PM org.apache.beam.runners.dataflow.util.MonitoringUtil$LoggingHandler process
INFO: 2018-06-30T20:06:23.462Z: Fusing consumer SpannerIO.Write/Write mutations to Cloud Spanner/Sample keys/GroupByKey/Write into SpannerIO.Write/Write mutations to Cloud Spanner/Sample keys/GroupByKey/Reify
Jun 30, 2018 8:06:27 PM org.apache.beam.runners.dataflow.util.MonitoringUtil$LoggingHandler process
INFO: 2018-06-30T20:06:23.491Z: Fusing consumer SpannerIO.Write/Write mutations to Cloud Spanner/Sample keys/Combine.GroupedValues/Extract into SpannerIO.Write/Write mutations to Cloud Spanner/Sample keys/Combine.GroupedValues
Jun 30, 2018 8:06:27 PM org.apache.beam.runners.dataflow.util.MonitoringUtil$LoggingHandler process
INFO: 2018-06-30T20:06:23.527Z: Fusing consumer SpannerIO.Write/Write mutations to Cloud Spanner/Sample keys/GroupByKey/Reify into SpannerIO.Write/Write mutations to Cloud Spanner/Sample keys/GroupByKey+SpannerIO.Write/Write mutations to Cloud Spanner/Sample keys/Combine.GroupedValues/Partial
Jun 30, 2018 8:06:27 PM org.apache.beam.runners.dataflow.util.MonitoringUtil$LoggingHandler process
INFO: 2018-06-30T20:06:23.561Z: Fusing consumer SpannerIO.Write/Write mutations to Cloud Spanner/Sample keys/GroupByKey+SpannerIO.Write/Write mutations to Cloud Spanner/Sample keys/Combine.GroupedValues/Partial into SpannerIO.Write/Write mutations to Cloud Spanner/Extract keys
Jun 30, 2018 8:06:27 PM org.apache.beam.runners.dataflow.util.MonitoringUtil$LoggingHandler process
INFO: 2018-06-30T20:06:23.598Z: Fusing consumer SpannerIO.Write/Write mutations to Cloud Spanner/Wait.OnSignal/To wait view 0/Sample.Any/Combine.globally(SampleAny)/Combine.perKey(SampleAny)/GroupByKey/Write into SpannerIO.Write/Write mutations to Cloud Spanner/Wait.OnSignal/To wait view 0/Sample.Any/Combine.globally(SampleAny)/Combine.perKey(SampleAny)/GroupByKey/Reify
Jun 30, 2018 8:06:27 PM org.apache.beam.runners.dataflow.util.MonitoringUtil$LoggingHandler process
INFO: 2018-06-30T20:06:23.629Z: Fusing consumer SpannerIO.Write/Write mutations to Cloud Spanner/Keys sample as view/GBKaSVForSize/Write into SpannerIO.Write/Write mutations to Cloud Spanner/Keys sample as view/ParMultiDo(ToIsmRecordForMapLike)
Jun 30, 2018 8:06:27 PM org.apache.beam.runners.dataflow.util.MonitoringUtil$LoggingHandler process
INFO: 2018-06-30T20:06:23.657Z: Fusing consumer SpannerIO.Write/Write mutations to Cloud Spanner/Wait.OnSignal/To wait view 0/View.AsList/ParDo(ToIsmRecordForGlobalWindow) into SpannerIO.Write/Write mutations to Cloud Spanner/Wait.OnSignal/To wait view 0/Sample.Any/Flatten.Iterables/FlattenIterables/FlatMap
Jun 30, 2018 8:06:27 PM org.apache.beam.runners.dataflow.util.MonitoringUtil$LoggingHandler process
INFO: 2018-06-30T20:06:23.688Z: Fusing consumer SpannerIO.Write/Write mutations to Cloud Spanner/Keys sample as view/GBKaSVForKeys/Write into SpannerIO.Write/Write mutations to Cloud Spanner/Keys sample as view/ParMultiDo(ToIsmRecordForMapLike)
Jun 30, 2018 8:06:27 PM org.apache.beam.runners.dataflow.util.MonitoringUtil$LoggingHandler process
INFO: 2018-06-30T20:06:23.718Z: Fusing consumer SpannerIO.Write/Write mutations to Cloud Spanner/Wait.OnSignal/To wait view 0/Sample.Any/Flatten.Iterables/FlattenIterables/FlatMap into SpannerIO.Write/Write mutations to Cloud Spanner/Wait.OnSignal/To wait view 0/Sample.Any/Combine.globally(SampleAny)/Values/Values/Map
Jun 30, 2018 8:06:27 PM org.apache.beam.runners.dataflow.util.MonitoringUtil$LoggingHandler process
INFO: 2018-06-30T20:06:23.742Z: Fusing consumer SpannerIO.Write/Write mutations to Cloud Spanner/Wait.OnSignal/To wait view 0/Sample.Any/Combine.globally(SampleAny)/Values/Values/Map into SpannerIO.Write/Write mutations to Cloud Spanner/Wait.OnSignal/To wait view 0/Sample.Any/Combine.globally(SampleAny)/Combine.perKey(SampleAny)/Combine.GroupedValues/Extract
Jun 30, 2018 8:06:27 PM org.apache.beam.runners.dataflow.util.MonitoringUtil$LoggingHandler process
INFO: 2018-06-30T20:06:23.777Z: Fusing consumer SpannerIO.Write/Write mutations to Cloud Spanner/Keys sample as view/ParDo(ToIsmMetadataRecordForKey) into SpannerIO.Write/Write mutations to Cloud Spanner/Keys sample as view/GBKaSVForKeys/Read
Jun 30, 2018 8:06:27 PM org.apache.beam.runners.dataflow.util.MonitoringUtil$LoggingHandler process
INFO: 2018-06-30T20:06:23.813Z: Fusing consumer SpannerIO.Write/Write mutations to Cloud Spanner/Wait.OnSignal/To wait view 0/Sample.Any/Combine.globally(SampleAny)/Combine.perKey(SampleAny)/Combine.GroupedValues/Extract into SpannerIO.Write/Write mutations to Cloud Spanner/Wait.OnSignal/To wait view 0/Sample.Any/Combine.globally(SampleAny)/Combine.perKey(SampleAny)/Combine.GroupedValues
Jun 30, 2018 8:06:27 PM org.apache.beam.runners.dataflow.util.MonitoringUtil$LoggingHandler process
INFO: 2018-06-30T20:06:23.839Z: Fusing consumer SpannerIO.Write/Write mutations to Cloud Spanner/Wait.OnSignal/To wait view 0/Sample.Any/Combine.globally(SampleAny)/WithKeys/AddKeys/Map into SpannerIO.Write/Write mutations to Cloud Spanner/Wait.OnSignal/To wait view 0/ParDo(CollectWindows)
Jun 30, 2018 8:06:27 PM org.apache.beam.runners.dataflow.util.MonitoringUtil$LoggingHandler process
INFO: 2018-06-30T20:06:23.869Z: Fusing consumer SpannerIO.Write/Write mutations to Cloud Spanner/Wait.OnSignal/To wait view 0/Sample.Any/Combine.globally(SampleAny)/Combine.perKey(SampleAny)/Combine.GroupedValues into SpannerIO.Write/Write mutations to Cloud Spanner/Wait.OnSignal/To wait view 0/Sample.Any/Combine.globally(SampleAny)/Combine.perKey(SampleAny)/GroupByKey/Read
Jun 30, 2018 8:06:27 PM org.apache.beam.runners.dataflow.util.MonitoringUtil$LoggingHandler process
INFO: 2018-06-30T20:06:23.896Z: Fusing consumer SpannerIO.Write/Write mutations to Cloud Spanner/Write mutations to Spanner into SpannerIO.Write/Write mutations to Cloud Spanner/Batch mutations together
Jun 30, 2018 8:06:27 PM org.apache.beam.runners.dataflow.util.MonitoringUtil$LoggingHandler process
INFO: 2018-06-30T20:06:23.929Z: Fusing consumer SpannerIO.Write/Write mutations to Cloud Spanner/Wait.OnSignal/To wait view 0/Sample.Any/Combine.globally(SampleAny)/Combine.perKey(SampleAny)/GroupByKey/Reify into SpannerIO.Write/Write mutations to Cloud Spanner/Wait.OnSignal/To wait view 0/Sample.Any/Combine.globally(SampleAny)/Combine.perKey(SampleAny)/GroupByKey+SpannerIO.Write/Write mutations to Cloud Spanner/Wait.OnSignal/To wait view 0/Sample.Any/Combine.globally(SampleAny)/Combine.perKey(SampleAny)/Combine.GroupedValues/Partial
Jun 30, 2018 8:06:27 PM org.apache.beam.runners.dataflow.util.MonitoringUtil$LoggingHandler process
INFO: 2018-06-30T20:06:23.955Z: Fusing consumer SpannerIO.Write/Write mutations to Cloud Spanner/Wait.OnSignal/To wait view 0/Sample.Any/Combine.globally(SampleAny)/Combine.perKey(SampleAny)/GroupByKey+SpannerIO.Write/Write mutations to Cloud Spanner/Wait.OnSignal/To wait view 0/Sample.Any/Combine.globally(SampleAny)/Combine.perKey(SampleAny)/Combine.GroupedValues/Partial into SpannerIO.Write/Write mutations to Cloud Spanner/Wait.OnSignal/To wait view 0/Sample.Any/Combine.globally(SampleAny)/WithKeys/AddKeys/Map
Jun 30, 2018 8:06:27 PM org.apache.beam.runners.dataflow.util.MonitoringUtil$LoggingHandler process
INFO: 2018-06-30T20:06:23.979Z: Fusing consumer SpannerIO.Write/Write mutations to Cloud Spanner/Group by partition/Reify into SpannerIO.Write/Write mutations to Cloud Spanner/Partition input
Jun 30, 2018 8:06:27 PM org.apache.beam.runners.dataflow.util.MonitoringUtil$LoggingHandler process
INFO: 2018-06-30T20:06:24.007Z: Fusing consumer SpannerIO.Write/To mutation group into ParDo(GenerateMutations)
Jun 30, 2018 8:06:27 PM org.apache.beam.runners.dataflow.util.MonitoringUtil$LoggingHandler process
INFO: 2018-06-30T20:06:24.041Z: Fusing consumer SpannerIO.Write/Write mutations to Cloud Spanner/Group by partition/GroupByWindow into SpannerIO.Write/Write mutations to Cloud Spanner/Group by partition/Read
Jun 30, 2018 8:06:27 PM org.apache.beam.runners.dataflow.util.MonitoringUtil$LoggingHandler process
INFO: 2018-06-30T20:06:24.071Z: Fusing consumer SpannerIO.Write/Write mutations to Cloud Spanner/Group by partition/Write into SpannerIO.Write/Write mutations to Cloud Spanner/Group by partition/Reify
Jun 30, 2018 8:06:27 PM org.apache.beam.runners.dataflow.util.MonitoringUtil$LoggingHandler process
INFO: 2018-06-30T20:06:24.096Z: Fusing consumer SpannerIO.Write/Write mutations to Cloud Spanner/Keys sample as view/ParDo(ToIsmMetadataRecordForSize) into SpannerIO.Write/Write mutations to Cloud Spanner/Keys sample as view/GBKaSVForSize/Read
Jun 30, 2018 8:06:27 PM org.apache.beam.runners.dataflow.util.MonitoringUtil$LoggingHandler process
INFO: 2018-06-30T20:06:24.487Z: Executing operation SpannerIO.Write/Write mutations to Cloud Spanner/Schema View/Combine.GloballyAsSingletonView/Combine.globally(Singleton)/Combine.perKey(Singleton)/GroupByKey/Create
Jun 30, 2018 8:06:27 PM org.apache.beam.runners.dataflow.util.MonitoringUtil$LoggingHandler process
INFO: 2018-06-30T20:06:24.523Z: Executing operation SpannerIO.Write/Write mutations to Cloud Spanner/Schema View/Combine.GloballyAsSingletonView/BatchViewOverrides.GroupByWindowHashAsKeyAndWindowAsSortKey/BatchViewOverrides.GroupByKeyAndSortValuesOnly/Create
Jun 30, 2018 8:06:27 PM org.apache.beam.runners.dataflow.util.MonitoringUtil$LoggingHandler process
INFO: 2018-06-30T20:06:24.557Z: Executing operation SpannerIO.Write/Write mutations to Cloud Spanner/Sample keys/GroupByKey/Create
Jun 30, 2018 8:06:27 PM org.apache.beam.runners.dataflow.util.MonitoringUtil$LoggingHandler process
INFO: 2018-06-30T20:06:24.572Z: Starting 1 workers in us-central1-b...
Jun 30, 2018 8:06:27 PM org.apache.beam.runners.dataflow.util.MonitoringUtil$LoggingHandler process
INFO: 2018-06-30T20:06:24.587Z: Executing operation SpannerIO.Write/Write mutations to Cloud Spanner/Keys sample as view/GBKaSVForData/BatchViewOverrides.GroupByKeyAndSortValuesOnly/Create
Jun 30, 2018 8:06:27 PM org.apache.beam.runners.dataflow.util.MonitoringUtil$LoggingHandler process
INFO: 2018-06-30T20:06:24.618Z: Executing operation SpannerIO.Write/Write mutations to Cloud Spanner/Keys sample as view/GBKaSVForSize/Create
Jun 30, 2018 8:06:27 PM org.apache.beam.runners.dataflow.util.MonitoringUtil$LoggingHandler process
INFO: 2018-06-30T20:06:24.647Z: Executing operation SpannerIO.Write/Write mutations to Cloud Spanner/Keys sample as view/GBKaSVForKeys/Create
Jun 30, 2018 8:06:27 PM org.apache.beam.runners.dataflow.util.MonitoringUtil$LoggingHandler process
INFO: 2018-06-30T20:06:24.679Z: Executing operation SpannerIO.Write/Write mutations to Cloud Spanner/Group by partition/Create
Jun 30, 2018 8:06:27 PM org.apache.beam.runners.dataflow.util.MonitoringUtil$LoggingHandler process
INFO: 2018-06-30T20:06:24.707Z: Executing operation SpannerIO.Write/Write mutations to Cloud Spanner/Wait.OnSignal/To wait view 0/Sample.Any/Combine.globally(SampleAny)/Combine.perKey(SampleAny)/GroupByKey/Create
Jun 30, 2018 8:06:27 PM org.apache.beam.runners.dataflow.util.MonitoringUtil$LoggingHandler process
INFO: 2018-06-30T20:06:25.041Z: Executing operation GenerateSequence/Read(BoundedCountingSource)+ParDo(GenerateMutations)+SpannerIO.Write/To mutation group+SpannerIO.Write/Write mutations to Cloud Spanner/Wait.OnSignal/To wait view 0/ParDo(CollectWindows)+SpannerIO.Write/Write mutations to Cloud Spanner/Wait.OnSignal/To wait view 0/Sample.Any/Combine.globally(SampleAny)/WithKeys/AddKeys/Map+SpannerIO.Write/Write mutations to Cloud Spanner/Wait.OnSignal/To wait view 0/Sample.Any/Combine.globally(SampleAny)/Combine.perKey(SampleAny)/GroupByKey+SpannerIO.Write/Write mutations to Cloud Spanner/Wait.OnSignal/To wait view 0/Sample.Any/Combine.globally(SampleAny)/Combine.perKey(SampleAny)/Combine.GroupedValues/Partial+SpannerIO.Write/Write mutations to Cloud Spanner/Wait.OnSignal/To wait view 0/Sample.Any/Combine.globally(SampleAny)/Combine.perKey(SampleAny)/GroupByKey/Reify+SpannerIO.Write/Write mutations to Cloud Spanner/Wait.OnSignal/To wait view 0/Sample.Any/Combine.globally(SampleAny)/Combine.perKey(SampleAny)/GroupByKey/Write
Jun 30, 2018 8:06:35 PM org.apache.beam.runners.dataflow.util.MonitoringUtil$LoggingHandler process
INFO: 2018-06-30T20:06:33.312Z: Autoscaling: Raised the number of workers to 0 based on the rate of progress in the currently running step(s).
Jun 30, 2018 8:06:44 PM org.apache.beam.runners.dataflow.util.MonitoringUtil$LoggingHandler process
INFO: 2018-06-30T20:06:43.881Z: Autoscaling: Raised the number of workers to 1 based on the rate of progress in the currently running step(s).
Jun 30, 2018 8:06:44 PM org.apache.beam.runners.dataflow.util.MonitoringUtil$LoggingHandler process
INFO: 2018-06-30T20:06:43.909Z: Autoscaling: Would further reduce the number of workers but reached the minimum number allowed for the job.
Jun 30, 2018 8:07:00 PM org.apache.beam.runners.dataflow.util.MonitoringUtil$LoggingHandler process
INFO: 2018-06-30T20:06:58.250Z: Workers have started successfully.
Jun 30, 2018 8:07:19 PM org.apache.beam.runners.dataflow.util.MonitoringUtil$LoggingHandler process
INFO: 2018-06-30T20:07:19.395Z: Executing operation SpannerIO.Write/Write mutations to Cloud Spanner/Wait.OnSignal/To wait view 0/Sample.Any/Combine.globally(SampleAny)/Combine.perKey(SampleAny)/GroupByKey/Close
Jun 30, 2018 8:07:19 PM org.apache.beam.runners.dataflow.util.MonitoringUtil$LoggingHandler process
INFO: 2018-06-30T20:07:19.454Z: Executing operation SpannerIO.Write/Write mutations to Cloud Spanner/Wait.OnSignal/To wait view 0/Sample.Any/Combine.globally(SampleAny)/Combine.perKey(SampleAny)/GroupByKey/Read+SpannerIO.Write/Write mutations to Cloud Spanner/Wait.OnSignal/To wait view 0/Sample.Any/Combine.globally(SampleAny)/Combine.perKey(SampleAny)/Combine.GroupedValues+SpannerIO.Write/Write mutations to Cloud Spanner/Wait.OnSignal/To wait view 0/Sample.Any/Combine.globally(SampleAny)/Combine.perKey(SampleAny)/Combine.GroupedValues/Extract+SpannerIO.Write/Write mutations to Cloud Spanner/Wait.OnSignal/To wait view 0/Sample.Any/Combine.globally(SampleAny)/Values/Values/Map+SpannerIO.Write/Write mutations to Cloud Spanner/Wait.OnSignal/To wait view 0/Sample.Any/Flatten.Iterables/FlattenIterables/FlatMap+SpannerIO.Write/Write mutations to Cloud Spanner/Wait.OnSignal/To wait view 0/View.AsList/ParDo(ToIsmRecordForGlobalWindow)
Jun 30, 2018 8:07:28 PM org.apache.beam.runners.dataflow.util.MonitoringUtil$LoggingHandler process
INFO: 2018-06-30T20:07:27.354Z: Executing operation SpannerIO.Write/Write mutations to Cloud Spanner/Wait.OnSignal/To wait view 0/View.AsList/CreateDataflowView
Jun 30, 2018 8:07:28 PM org.apache.beam.runners.dataflow.util.MonitoringUtil$LoggingHandler process
INFO: 2018-06-30T20:07:27.606Z: Executing operation SpannerIO.Write/Write mutations to Cloud Spanner/Create seed/Read(CreateSource)+SpannerIO.Write/Write mutations to Cloud Spanner/Wait.OnSignal/Wait/Map+SpannerIO.Write/Write mutations to Cloud Spanner/Read information schema+SpannerIO.Write/Write mutations to Cloud Spanner/Schema View/Combine.GloballyAsSingletonView/Combine.globally(Singleton)/WithKeys/AddKeys/Map+SpannerIO.Write/Write mutations to Cloud Spanner/Schema View/Combine.GloballyAsSingletonView/Combine.globally(Singleton)/Combine.perKey(Singleton)/GroupByKey+SpannerIO.Write/Write mutations to Cloud Spanner/Schema View/Combine.GloballyAsSingletonView/Combine.globally(Singleton)/Combine.perKey(Singleton)/Combine.GroupedValues/Partial+SpannerIO.Write/Write mutations to Cloud Spanner/Schema View/Combine.GloballyAsSingletonView/Combine.globally(Singleton)/Combine.perKey(Singleton)/GroupByKey/Reify+SpannerIO.Write/Write mutations to Cloud Spanner/Schema View/Combine.GloballyAsSingletonView/Combine.globally(Singleton)/Combine.perKey(Singleton)/GroupByKey/Write
Jun 30, 2018 8:07:35 PM org.apache.beam.runners.dataflow.util.MonitoringUtil$LoggingHandler process
INFO: 2018-06-30T20:07:34.132Z: Executing operation SpannerIO.Write/Write mutations to Cloud Spanner/Schema View/Combine.GloballyAsSingletonView/Combine.globally(Singleton)/Combine.perKey(Singleton)/GroupByKey/Close
Jun 30, 2018 8:07:35 PM org.apache.beam.runners.dataflow.util.MonitoringUtil$LoggingHandler process
INFO: 2018-06-30T20:07:34.327Z: Executing operation SpannerIO.Write/Write mutations to Cloud Spanner/Schema View/Combine.GloballyAsSingletonView/Combine.globally(Singleton)/Combine.perKey(Singleton)/GroupByKey/Read+SpannerIO.Write/Write mutations to Cloud Spanner/Schema View/Combine.GloballyAsSingletonView/Combine.globally(Singleton)/Combine.perKey(Singleton)/Combine.GroupedValues+SpannerIO.Write/Write mutations to Cloud Spanner/Schema View/Combine.GloballyAsSingletonView/Combine.globally(Singleton)/Combine.perKey(Singleton)/Combine.GroupedValues/Extract+SpannerIO.Write/Write mutations to Cloud Spanner/Schema View/Combine.GloballyAsSingletonView/Combine.globally(Singleton)/Values/Values/Map+SpannerIO.Write/Write mutations to Cloud Spanner/Schema View/Combine.GloballyAsSingletonView/BatchViewOverrides.GroupByWindowHashAsKeyAndWindowAsSortKey/ParDo(UseWindowHashAsKeyAndWindowAsSortKey)+SpannerIO.Write/Write mutations to Cloud Spanner/Schema View/Combine.GloballyAsSingletonView/BatchViewOverrides.GroupByWindowHashAsKeyAndWindowAsSortKey/BatchViewOverrides.GroupByKeyAndSortValuesOnly/Write
Jun 30, 2018 8:07:40 PM org.apache.beam.runners.dataflow.util.MonitoringUtil$LoggingHandler process
INFO: 2018-06-30T20:07:40.510Z: Executing operation SpannerIO.Write/Write mutations to Cloud Spanner/Schema View/Combine.GloballyAsSingletonView/BatchViewOverrides.GroupByWindowHashAsKeyAndWindowAsSortKey/BatchViewOverrides.GroupByKeyAndSortValuesOnly/Close
Jun 30, 2018 8:07:42 PM org.apache.beam.runners.dataflow.util.MonitoringUtil$LoggingHandler process
INFO: 2018-06-30T20:07:40.562Z: Executing operation SpannerIO.Write/Write mutations to Cloud Spanner/Schema View/Combine.GloballyAsSingletonView/BatchViewOverrides.GroupByWindowHashAsKeyAndWindowAsSortKey/BatchViewOverrides.GroupByKeyAndSortValuesOnly/Read+SpannerIO.Write/Write mutations to Cloud Spanner/Schema View/Combine.GloballyAsSingletonView/ParDo(IsmRecordForSingularValuePerWindow)
Jun 30, 2018 8:07:48 PM org.apache.beam.runners.dataflow.util.MonitoringUtil$LoggingHandler process
INFO: 2018-06-30T20:07:47.569Z: Executing operation SpannerIO.Write/Write mutations to Cloud Spanner/Schema View/Combine.GloballyAsSingletonView/CreateDataflowView
Jun 30, 2018 8:07:48 PM org.apache.beam.runners.dataflow.util.MonitoringUtil$LoggingHandler process
INFO: 2018-06-30T20:07:47.723Z: Executing operation SpannerIO.Write/Write mutations to Cloud Spanner/Serialize mutations+SpannerIO.Write/Write mutations to Cloud Spanner/Extract keys+SpannerIO.Write/Write mutations to Cloud Spanner/Sample keys/GroupByKey+SpannerIO.Write/Write mutations to Cloud Spanner/Sample keys/Combine.GroupedValues/Partial+SpannerIO.Write/Write mutations to Cloud Spanner/Sample keys/GroupByKey/Reify+SpannerIO.Write/Write mutations to Cloud Spanner/Sample keys/GroupByKey/Write
Jun 30, 2018 8:08:00 PM org.apache.beam.runners.dataflow.util.MonitoringUtil$LoggingHandler process
INFO: 2018-06-30T20:07:58.803Z: Executing operation SpannerIO.Write/Write mutations to Cloud Spanner/Sample keys/GroupByKey/Close
Jun 30, 2018 8:08:00 PM org.apache.beam.runners.dataflow.util.MonitoringUtil$LoggingHandler process
INFO: 2018-06-30T20:07:58.896Z: Executing operation SpannerIO.Write/Write mutations to Cloud Spanner/Sample keys/GroupByKey/Read+SpannerIO.Write/Write mutations to Cloud Spanner/Sample keys/Combine.GroupedValues+SpannerIO.Write/Write mutations to Cloud Spanner/Sample keys/Combine.GroupedValues/Extract+SpannerIO.Write/Write mutations to Cloud Spanner/Keys sample as view/GBKaSVForData/ParDo(GroupByKeyHashAndSortByKeyAndWindow)+SpannerIO.Write/Write mutations to Cloud Spanner/Keys sample as view/GBKaSVForData/BatchViewOverrides.GroupByKeyAndSortValuesOnly/Write
Jun 30, 2018 8:08:02 PM org.apache.beam.runners.dataflow.util.MonitoringUtil$LoggingHandler process
INFO: 2018-06-30T20:08:01.298Z: Executing operation SpannerIO.Write/Write mutations to Cloud Spanner/Keys sample as view/GBKaSVForData/BatchViewOverrides.GroupByKeyAndSortValuesOnly/Close
Jun 30, 2018 8:08:02 PM org.apache.beam.runners.dataflow.util.MonitoringUtil$LoggingHandler process
INFO: 2018-06-30T20:08:01.361Z: Executing operation SpannerIO.Write/Write mutations to Cloud Spanner/Keys sample as view/GBKaSVForData/BatchViewOverrides.GroupByKeyAndSortValuesOnly/Read+SpannerIO.Write/Write mutations to Cloud Spanner/Keys sample as view/ParMultiDo(ToIsmRecordForMapLike)+SpannerIO.Write/Write mutations to Cloud Spanner/Keys sample as view/GBKaSVForSize/Write+SpannerIO.Write/Write mutations to Cloud Spanner/Keys sample as view/GBKaSVForKeys/Write
Jun 30, 2018 8:08:06 PM org.apache.beam.runners.dataflow.util.MonitoringUtil$LoggingHandler process
INFO: 2018-06-30T20:08:04.949Z: Executing operation SpannerIO.Write/Write mutations to Cloud Spanner/Keys sample as view/GBKaSVForSize/Close
Jun 30, 2018 8:08:06 PM org.apache.beam.runners.dataflow.util.MonitoringUtil$LoggingHandler process
INFO: 2018-06-30T20:08:04.978Z: Executing operation SpannerIO.Write/Write mutations to Cloud Spanner/Keys sample as view/GBKaSVForKeys/Close
Jun 30, 2018 8:08:06 PM org.apache.beam.runners.dataflow.util.MonitoringUtil$LoggingHandler process
INFO: 2018-06-30T20:08:05.014Z: Executing operation SpannerIO.Write/Write mutations to Cloud Spanner/Keys sample as view/GBKaSVForSize/Read+SpannerIO.Write/Write mutations to Cloud Spanner/Keys sample as view/ParDo(ToIsmMetadataRecordForSize)
Jun 30, 2018 8:08:06 PM org.apache.beam.runners.dataflow.util.MonitoringUtil$LoggingHandler process
INFO: 2018-06-30T20:08:05.046Z: Executing operation SpannerIO.Write/Write mutations to Cloud Spanner/Keys sample as view/GBKaSVForKeys/Read+SpannerIO.Write/Write mutations to Cloud Spanner/Keys sample as view/ParDo(ToIsmMetadataRecordForKey)
Jun 30, 2018 8:08:12 PM org.apache.beam.runners.dataflow.util.MonitoringUtil$LoggingHandler process
INFO: 2018-06-30T20:08:11.528Z: Executing operation SpannerIO.Write/Write mutations to Cloud Spanner/Keys sample as view/Flatten.PCollections
Jun 30, 2018 8:08:12 PM org.apache.beam.runners.dataflow.util.MonitoringUtil$LoggingHandler process
INFO: 2018-06-30T20:08:11.726Z: Executing operation SpannerIO.Write/Write mutations to Cloud Spanner/Keys sample as view/CreateDataflowView
Jun 30, 2018 8:08:12 PM org.apache.beam.runners.dataflow.util.MonitoringUtil$LoggingHandler process
INFO: 2018-06-30T20:08:11.868Z: Executing operation SpannerIO.Write/Write mutations to Cloud Spanner/Partition input+SpannerIO.Write/Write mutations to Cloud Spanner/Group by partition/Reify+SpannerIO.Write/Write mutations to Cloud Spanner/Group by partition/Write
Jun 30, 2018 8:08:17 PM org.apache.beam.runners.dataflow.util.MonitoringUtil$LoggingHandler process
INFO: 2018-06-30T20:08:17.162Z: Executing operation SpannerIO.Write/Write mutations to Cloud Spanner/Group by partition/Close
Jun 30, 2018 8:08:17 PM org.apache.beam.runners.dataflow.util.MonitoringUtil$LoggingHandler process
INFO: 2018-06-30T20:08:17.221Z: Executing operation SpannerIO.Write/Write mutations to Cloud Spanner/Group by partition/Read+SpannerIO.Write/Write mutations to Cloud Spanner/Group by partition/GroupByWindow+SpannerIO.Write/Write mutations to Cloud Spanner/Batch mutations together+SpannerIO.Write/Write mutations to Cloud Spanner/Write mutations to Spanner
Jun 30, 2018 8:08:22 PM org.apache.beam.runners.dataflow.util.MonitoringUtil$LoggingHandler process
INFO: 2018-06-30T20:08:21.280Z: Cleaning up.
Jun 30, 2018 8:08:22 PM org.apache.beam.runners.dataflow.util.MonitoringUtil$LoggingHandler process
INFO: 2018-06-30T20:08:21.400Z: Stopping worker pool...
Jun 30, 2018 8:09:53 PM org.apache.beam.runners.dataflow.util.MonitoringUtil$LoggingHandler process
INFO: 2018-06-30T20:09:52.709Z: Autoscaling: Resized worker pool from 1 to 0.
Jun 30, 2018 8:09:53 PM org.apache.beam.runners.dataflow.util.MonitoringUtil$LoggingHandler process
INFO: 2018-06-30T20:09:52.735Z: Autoscaling: Would further reduce the number of workers but reached the minimum number allowed for the job.
Jun 30, 2018 8:09:53 PM org.apache.beam.runners.dataflow.util.MonitoringUtil$LoggingHandler process
INFO: 2018-06-30T20:09:52.776Z: Worker pool stopped.
Jun 30, 2018 8:10:03 PM org.apache.beam.runners.dataflow.DataflowPipelineJob waitUntilFinish
INFO: Job 2018-06-30_13_06_15-10981419768240554729 finished with status DONE.
Jun 30, 2018 8:10:03 PM org.apache.beam.runners.dataflow.TestDataflowRunner checkForPAssertSuccess
INFO: Success result for Dataflow job 2018-06-30_13_06_15-10981419768240554729. Found 0 success, 0 failures out of 0 expected assertions.
Jun 30, 2018 8:10:03 PM org.apache.beam.runners.dataflow.DataflowPipelineJob waitUntilFinish
INFO: Job 2018-06-30_13_06_15-10981419768240554729 finished with status DONE.
Gradle Test Executor 142 finished executing tests.
> Task :beam-runners-google-cloud-dataflow-java:googleCloudPlatformIntegrationTest
Finished generating test XML results (0.009 secs) into: <https://builds.apache.org/job/beam_PostCommit_Java_GradleBuild/ws/src/runners/google-cloud-dataflow-java/build/test-results/googleCloudPlatformIntegrationTest>
Generating HTML test report...
Finished generating test html results (0.009 secs) into: <https://builds.apache.org/job/beam_PostCommit_Java_GradleBuild/ws/src/runners/google-cloud-dataflow-java/build/reports/tests/googleCloudPlatformIntegrationTest>
Packing task ':beam-runners-google-cloud-dataflow-java:googleCloudPlatformIntegrationTest'
:beam-runners-google-cloud-dataflow-java:googleCloudPlatformIntegrationTest (Thread[Task worker for ':' Thread 12,5,main]) completed. Took 31 mins 31.975 secs.
:beam-runners-google-cloud-dataflow-java:buildDependents (Thread[Task worker for ':' Thread 12,5,main]) started.
> Task :beam-runners-google-cloud-dataflow-java:buildDependents
Caching disabled for task ':beam-runners-google-cloud-dataflow-java:buildDependents': Caching has not been enabled for the task
Task ':beam-runners-google-cloud-dataflow-java:buildDependents' is not up-to-date because:
Task has not declared any outputs despite executing actions.
:beam-runners-google-cloud-dataflow-java:buildDependents (Thread[Task worker for ':' Thread 12,5,main]) completed. Took 0.0 secs.
:beam-sdks-java-io-google-cloud-platform:buildDependents (Thread[Task worker for ':' Thread 12,5,main]) started.
:beam-runners-google-cloud-dataflow-java:postCommit (Thread[Task worker for ':' Thread 10,5,main]) started.
> Task :beam-runners-google-cloud-dataflow-java:postCommit
Skipping task ':beam-runners-google-cloud-dataflow-java:postCommit' as it has no actions.
:beam-runners-google-cloud-dataflow-java:postCommit (Thread[Task worker for ':' Thread 10,5,main]) completed. Took 0.0 secs.
> Task :beam-sdks-java-io-google-cloud-platform:buildDependents
Caching disabled for task ':beam-sdks-java-io-google-cloud-platform:buildDependents': Caching has not been enabled for the task
Task ':beam-sdks-java-io-google-cloud-platform:buildDependents' is not up-to-date because:
Task has not declared any outputs despite executing actions.
:beam-sdks-java-io-google-cloud-platform:buildDependents (Thread[Task worker for ':' Thread 12,5,main]) completed. Took 0.0 secs.
:beam-runners-direct-java:buildDependents (Thread[Task worker for ':' Thread 12,5,main]) started.
:beam-sdks-java-extensions-protobuf:buildDependents (Thread[Task worker for ':' Thread 6,5,main]) started.
> Task :beam-runners-direct-java:buildDependents
Caching disabled for task ':beam-runners-direct-java:buildDependents': Caching has not been enabled for the task
Task ':beam-runners-direct-java:buildDependents' is not up-to-date because:
Task has not declared any outputs despite executing actions.
:beam-runners-direct-java:buildDependents (Thread[Task worker for ':' Thread 12,5,main]) completed. Took 0.0 secs.
> Task :beam-sdks-java-extensions-protobuf:buildDependents
Caching disabled for task ':beam-sdks-java-extensions-protobuf:buildDependents': Caching has not been enabled for the task
Task ':beam-sdks-java-extensions-protobuf:buildDependents' is not up-to-date because:
Task has not declared any outputs despite executing actions.
:beam-sdks-java-extensions-protobuf:buildDependents (Thread[Task worker for ':' Thread 6,5,main]) completed. Took 0.0 secs.
:beam-runners-local-java-core:buildDependents (Thread[Task worker for ':' Thread 6,5,main]) started.
> Task :beam-runners-local-java-core:buildDependents
Caching disabled for task ':beam-runners-local-java-core:buildDependents': Caching has not been enabled for the task
Task ':beam-runners-local-java-core:buildDependents' is not up-to-date because:
Task has not declared any outputs despite executing actions.
:beam-runners-local-java-core:buildDependents (Thread[Task worker for ':' Thread 6,5,main]) completed. Took 0.0 secs.
FAILURE: Build failed with an exception.
* What went wrong:
Execution failed for task ':beam-runners-java-fn-execution:test'.
> There were failing tests. See the report at: file://<https://builds.apache.org/job/beam_PostCommit_Java_GradleBuild/ws/src/runners/java-fn-execution/build/reports/tests/test/index.html>
* Try:
Run with --stacktrace option to get the stack trace. Run with --debug option to get more log output. Run with --scan to get full insights.
* Get more help at https://help.gradle.org
Deprecated Gradle features were used in this build, making it incompatible with Gradle 5.0.
See https://docs.gradle.org/4.8/userguide/command_line_interface.html#sec:command_line_warnings
BUILD FAILED in 46m 1s
646 actionable tasks: 641 executed, 5 from cache
Publishing build scan...
https://gradle.com/s/sk7afecmjqkzw
Build step 'Invoke Gradle script' changed build result to FAILURE
Build step 'Invoke Gradle script' marked build as failure
Build failed in Jenkins: beam_PostCommit_Java_GradleBuild #1003
Posted by Apache Jenkins Server <je...@builds.apache.org>.
See <https://builds.apache.org/job/beam_PostCommit_Java_GradleBuild/1003/display/redirect>
------------------------------------------
[...truncated 2.51 MB...]
Jun 30, 2018 3:06:36 PM org.apache.beam.sdk.io.FileBasedSink$Writer close
INFO: Successfully wrote temporary file /tmp/junit5963081097523038888/output/.temp-beam-2018-06-30_15-06-36-5/62a6c4ab-4a5c-47d2-a8b2-935bb12934f4
Jun 30, 2018 3:06:36 PM org.apache.beam.sdk.io.FileBasedSink$WriteOperation createMissingEmptyShards
INFO: Opening empty writer d66e3101-3943-43be-a04e-aad01fea850b for destination null
Jun 30, 2018 3:06:36 PM org.apache.beam.sdk.io.FileBasedSink$Writer close
INFO: Successfully wrote temporary file /tmp/junit5963081097523038888/output/.temp-beam-2018-06-30_15-06-36-5/d66e3101-3943-43be-a04e-aad01fea850b
Jun 30, 2018 3:06:36 PM org.apache.beam.sdk.io.FileBasedSink$WriteOperation createMissingEmptyShards
INFO: Opening empty writer 9ec3db92-bf2c-4fef-be04-8ebe51a6a438 for destination null
Jun 30, 2018 3:06:36 PM org.apache.beam.sdk.io.FileBasedSink$Writer close
INFO: Successfully wrote temporary file /tmp/junit5963081097523038888/output/.temp-beam-2018-06-30_15-06-36-5/9ec3db92-bf2c-4fef-be04-8ebe51a6a438
Jun 30, 2018 3:06:36 PM org.apache.beam.sdk.io.FileBasedSink$WriteOperation createMissingEmptyShards
INFO: Opening empty writer daf39221-3397-485a-9a8e-46debca6c62a for destination null
Jun 30, 2018 3:06:36 PM org.apache.beam.sdk.io.FileBasedSink$Writer close
INFO: Successfully wrote temporary file /tmp/junit5963081097523038888/output/.temp-beam-2018-06-30_15-06-36-5/daf39221-3397-485a-9a8e-46debca6c62a
org.apache.beam.sdk.io.FileBasedSinkTest > testFinalizeMultipleCalls STANDARD_ERROR
Jun 30, 2018 3:06:36 PM org.apache.beam.sdk.io.FileBasedSink$WriteOperation createMissingEmptyShards
INFO: Finalizing for destination null num shards 3.
Jun 30, 2018 3:06:36 PM org.apache.beam.sdk.io.FileBasedSink$WriteOperation moveToOutputFiles
INFO: Will copy temporary file FileResult{tempFilename=/tmp/junit2827908436174738572/tmp/junit2827908436174738572/temp/0, shard=0, window=org.apache.beam.sdk.transforms.windowing.GlobalWindow@5bf5afcd, paneInfo=PaneInfo{isFirst=true, isLast=true, timing=ON_TIME, index=0, onTimeIndex=0}} to final location /tmp/junit2827908436174738572/output/file-00-of-03.test
Jun 30, 2018 3:06:36 PM org.apache.beam.sdk.io.FileBasedSink$WriteOperation moveToOutputFiles
INFO: Will copy temporary file FileResult{tempFilename=/tmp/junit2827908436174738572/tmp/junit2827908436174738572/temp/1, shard=1, window=org.apache.beam.sdk.transforms.windowing.GlobalWindow@5bf5afcd, paneInfo=PaneInfo{isFirst=true, isLast=true, timing=ON_TIME, index=0, onTimeIndex=0}} to final location /tmp/junit2827908436174738572/output/file-01-of-03.test
Jun 30, 2018 3:06:36 PM org.apache.beam.sdk.io.FileBasedSink$WriteOperation moveToOutputFiles
INFO: Will copy temporary file FileResult{tempFilename=/tmp/junit2827908436174738572/tmp/junit2827908436174738572/temp/2, shard=2, window=org.apache.beam.sdk.transforms.windowing.GlobalWindow@5bf5afcd, paneInfo=PaneInfo{isFirst=true, isLast=true, timing=ON_TIME, index=0, onTimeIndex=0}} to final location /tmp/junit2827908436174738572/output/file-02-of-03.test
Jun 30, 2018 3:06:36 PM org.apache.beam.sdk.io.FileBasedSink$WriteOperation removeTemporaryFiles
INFO: Will remove known temporary file /tmp/junit2827908436174738572/tmp/junit2827908436174738572/temp/0
Jun 30, 2018 3:06:36 PM org.apache.beam.sdk.io.FileBasedSink$WriteOperation removeTemporaryFiles
INFO: Will remove known temporary file /tmp/junit2827908436174738572/tmp/junit2827908436174738572/temp/2
Jun 30, 2018 3:06:36 PM org.apache.beam.sdk.io.FileBasedSink$WriteOperation removeTemporaryFiles
INFO: Will remove known temporary file /tmp/junit2827908436174738572/tmp/junit2827908436174738572/temp/1
Jun 30, 2018 3:06:36 PM org.apache.beam.sdk.io.FileBasedSink$WriteOperation createMissingEmptyShards
INFO: Finalizing for destination null num shards 3.
Jun 30, 2018 3:06:36 PM org.apache.beam.sdk.io.FileBasedSink$WriteOperation moveToOutputFiles
INFO: Will copy temporary file FileResult{tempFilename=/tmp/junit2827908436174738572/tmp/junit2827908436174738572/temp/0, shard=0, window=org.apache.beam.sdk.transforms.windowing.GlobalWindow@5bf5afcd, paneInfo=PaneInfo{isFirst=true, isLast=true, timing=ON_TIME, index=0, onTimeIndex=0}} to final location /tmp/junit2827908436174738572/output/file-00-of-03.test
Jun 30, 2018 3:06:36 PM org.apache.beam.sdk.io.FileBasedSink$WriteOperation moveToOutputFiles
INFO: Will copy temporary file FileResult{tempFilename=/tmp/junit2827908436174738572/tmp/junit2827908436174738572/temp/1, shard=1, window=org.apache.beam.sdk.transforms.windowing.GlobalWindow@5bf5afcd, paneInfo=PaneInfo{isFirst=true, isLast=true, timing=ON_TIME, index=0, onTimeIndex=0}} to final location /tmp/junit2827908436174738572/output/file-01-of-03.test
Jun 30, 2018 3:06:36 PM org.apache.beam.sdk.io.FileBasedSink$WriteOperation moveToOutputFiles
INFO: Will copy temporary file FileResult{tempFilename=/tmp/junit2827908436174738572/tmp/junit2827908436174738572/temp/2, shard=2, window=org.apache.beam.sdk.transforms.windowing.GlobalWindow@5bf5afcd, paneInfo=PaneInfo{isFirst=true, isLast=true, timing=ON_TIME, index=0, onTimeIndex=0}} to final location /tmp/junit2827908436174738572/output/file-02-of-03.test
Jun 30, 2018 3:06:36 PM org.apache.beam.sdk.io.FileBasedSink$WriteOperation removeTemporaryFiles
INFO: Will remove known temporary file /tmp/junit2827908436174738572/tmp/junit2827908436174738572/temp/0
Jun 30, 2018 3:06:36 PM org.apache.beam.sdk.io.FileBasedSink$WriteOperation removeTemporaryFiles
INFO: Will remove known temporary file /tmp/junit2827908436174738572/tmp/junit2827908436174738572/temp/2
Jun 30, 2018 3:06:36 PM org.apache.beam.sdk.io.FileBasedSink$WriteOperation removeTemporaryFiles
INFO: Will remove known temporary file /tmp/junit2827908436174738572/tmp/junit2827908436174738572/temp/1
org.apache.beam.sdk.io.FileBasedSinkTest > testWriter STANDARD_ERROR
Jun 30, 2018 3:06:36 PM org.apache.beam.sdk.io.FileBasedSink$Writer close
INFO: Successfully wrote temporary file /tmp/junit5128544150351966894/temp/testId
org.apache.beam.sdk.io.FileBasedSourceTest > testFractionConsumedWhenReadingFilepattern STANDARD_ERROR
Jun 30, 2018 3:06:36 PM org.apache.beam.sdk.io.FileBasedSource createReader
INFO: Matched 3 files for pattern /tmp/junit9011511993758953384/file*
org.apache.beam.sdk.io.FileBasedSourceTest > testReadAllSplitsOfFilePattern STANDARD_ERROR
Jun 30, 2018 3:06:36 PM org.apache.beam.sdk.io.FileBasedSource split
INFO: Splitting filepattern /tmp/junit6247178867878325306/file* into bundles of size 512 took 0 ms and produced 3 files and 3 bundles
org.apache.beam.sdk.io.FileBasedSourceTest > testReadEverythingFromFileWithSplits STANDARD_ERROR
Jun 30, 2018 3:06:36 PM org.apache.beam.sdk.io.FileBasedSource createReader
INFO: Matched 1 files for pattern /tmp/junit4949996010986867937/file
org.apache.beam.sdk.io.FileBasedSourceTest > testEstimatedSizeOfFilePattern STANDARD_ERROR
Jun 30, 2018 3:06:36 PM org.apache.beam.sdk.io.FileBasedSource getEstimatedSizeBytes
INFO: Filepattern /tmp/junit1603768092324405446/file* matched 3 files with total size 360
org.apache.beam.sdk.io.FileBasedSourceTest > testEstimatedSizeOfFile STANDARD_ERROR
Jun 30, 2018 3:06:36 PM org.apache.beam.sdk.io.FileBasedSource getEstimatedSizeBytes
INFO: Filepattern /tmp/junit7574695233957739275/file matched 1 files with total size 200
org.apache.beam.sdk.io.FileBasedSourceTest > testFullyReadSingleFile STANDARD_ERROR
Jun 30, 2018 3:06:36 PM org.apache.beam.sdk.io.FileBasedSource createReader
INFO: Matched 1 files for pattern /tmp/junit6111245359454622679/file
org.apache.beam.sdk.io.FileBasedSourceTest > testReadAllSplitsOfSingleFile STANDARD_ERROR
Jun 30, 2018 3:06:36 PM org.apache.beam.sdk.io.FileBasedSource split
INFO: Splitting filepattern /tmp/junit8160719106588098045/file into bundles of size 32 took 0 ms and produced 1 files and 6 bundles
org.apache.beam.sdk.io.FileBasedSourceTest > testFullyReadFilePatternFirstRecordEmpty STANDARD_ERROR
Jun 30, 2018 3:06:36 PM org.apache.beam.sdk.io.FileBasedSource createReader
INFO: Matched 3 files for pattern /tmp/junit322962750218909536/file*
org.apache.beam.sdk.io.FileBasedSourceTest > testEmptyFilepatternTreatmentAllow STANDARD_ERROR
Jun 30, 2018 3:06:36 PM org.apache.beam.sdk.io.FileBasedSource createReader
INFO: Matched 0 files for pattern /tmp/junit2010899718601744912/doesNotExist
Jun 30, 2018 3:06:36 PM org.apache.beam.sdk.io.FileBasedSource createReader
INFO: Matched 0 files for pattern /tmp/junit2010899718601744912/doesNotExist*
org.apache.beam.sdk.io.FileBasedSourceTest > testSplitAtFractionExhaustive STANDARD_ERROR
Jun 30, 2018 3:06:36 PM org.apache.beam.sdk.testing.SourceTestUtils assertSplitAtFractionExhaustive
INFO: 2 trials to observe both success and failure of concurrent splitting at item #1
Jun 30, 2018 3:06:36 PM org.apache.beam.sdk.testing.SourceTestUtils assertSplitAtFractionExhaustive
WARNING: After 101 concurrent splitting trials at item #2, observed only failure, giving up on this item
Jun 30, 2018 3:06:36 PM org.apache.beam.sdk.testing.SourceTestUtils assertSplitAtFractionExhaustive
WARNING: After 101 concurrent splitting trials at item #3, observed only failure, giving up on this item
Jun 30, 2018 3:06:36 PM org.apache.beam.sdk.testing.SourceTestUtils assertSplitAtFractionExhaustive
WARNING: After 101 concurrent splitting trials at item #4, observed only failure, giving up on this item
Jun 30, 2018 3:06:36 PM org.apache.beam.sdk.testing.SourceTestUtils assertSplitAtFractionExhaustive
INFO: 22 trials to observe both success and failure of concurrent splitting at item #5
Jun 30, 2018 3:06:36 PM org.apache.beam.sdk.testing.SourceTestUtils assertSplitAtFractionExhaustive
WARNING: After 101 concurrent splitting trials at item #6, observed only failure, giving up on this item
Jun 30, 2018 3:06:36 PM org.apache.beam.sdk.testing.SourceTestUtils assertSplitAtFractionExhaustive
WARNING: After 101 concurrent splitting trials at item #7, observed only failure, giving up on this item
Jun 30, 2018 3:06:36 PM org.apache.beam.sdk.testing.SourceTestUtils assertSplitAtFractionExhaustive
WARNING: After 101 concurrent splitting trials at item #8, observed only failure, giving up on this item
Jun 30, 2018 3:06:36 PM org.apache.beam.sdk.testing.SourceTestUtils assertSplitAtFractionExhaustive
WARNING: After 101 concurrent splitting trials at item #9, observed only failure, giving up on this item
Jun 30, 2018 3:06:36 PM org.apache.beam.sdk.testing.SourceTestUtils assertSplitAtFractionExhaustive
WARNING: After 101 concurrent splitting trials at item #10, observed only failure, giving up on this item
Jun 30, 2018 3:06:36 PM org.apache.beam.sdk.testing.SourceTestUtils assertSplitAtFractionExhaustive
INFO: 832 total concurrent splitting trials for 20 items
org.apache.beam.sdk.io.FileBasedSourceTest > testCloseUnstartedFilePatternReader STANDARD_ERROR
Jun 30, 2018 3:06:36 PM org.apache.beam.sdk.io.FileBasedSource createReader
INFO: Matched 3 files for pattern /tmp/junit658940515655605689/file*
org.apache.beam.sdk.io.FileBasedSourceTest > testFullyReadFilePattern STANDARD_ERROR
Jun 30, 2018 3:06:36 PM org.apache.beam.sdk.io.FileBasedSource createReader
INFO: Matched 3 files for pattern /tmp/junit8212448753720624895/file*
org.apache.beam.sdk.io.OffsetBasedSourceTest > testSplitAtFractionExhaustive STANDARD_ERROR
Jun 30, 2018 3:06:36 PM org.apache.beam.sdk.testing.SourceTestUtils assertSplitAtFractionExhaustive
WARNING: After 101 concurrent splitting trials at item #1, observed only failure, giving up on this item
Jun 30, 2018 3:06:36 PM org.apache.beam.sdk.testing.SourceTestUtils assertSplitAtFractionExhaustive
WARNING: After 101 concurrent splitting trials at item #2, observed only failure, giving up on this item
Jun 30, 2018 3:06:36 PM org.apache.beam.sdk.testing.SourceTestUtils assertSplitAtFractionExhaustive
WARNING: After 101 concurrent splitting trials at item #3, observed only failure, giving up on this item
Jun 30, 2018 3:06:36 PM org.apache.beam.sdk.testing.SourceTestUtils assertSplitAtFractionExhaustive
WARNING: After 101 concurrent splitting trials at item #4, observed only failure, giving up on this item
Jun 30, 2018 3:06:36 PM org.apache.beam.sdk.testing.SourceTestUtils assertSplitAtFractionExhaustive
WARNING: After 101 concurrent splitting trials at item #5, observed only failure, giving up on this item
Jun 30, 2018 3:06:36 PM org.apache.beam.sdk.testing.SourceTestUtils assertSplitAtFractionExhaustive
WARNING: After 101 concurrent splitting trials at item #6, observed only failure, giving up on this item
Jun 30, 2018 3:06:36 PM org.apache.beam.sdk.testing.SourceTestUtils assertSplitAtFractionExhaustive
WARNING: After 101 concurrent splitting trials at item #7, observed only failure, giving up on this item
Jun 30, 2018 3:06:36 PM org.apache.beam.sdk.testing.SourceTestUtils assertSplitAtFractionExhaustive
INFO: 707 total concurrent splitting trials for 20 items
org.apache.beam.sdk.io.range.ByteKeyRangeEstimateFractionTest > testEstimateFractionForKey[385: i=22, k=23] STANDARD_ERROR
Jun 30, 2018 3:06:36 PM org.apache.beam.sdk.io.range.ByteKeyRange estimateFractionForKey
WARNING: Using 0.0 as the default fraction for this near-empty range ByteKeyRange{startKey=[ff], endKey=[ff00]} where start and end keys differ only by trailing zeros.
org.apache.beam.sdk.io.range.ByteKeyRangeTrackerTest > testToString STANDARD_ERROR
Jun 30, 2018 3:06:36 PM org.apache.beam.sdk.io.range.ByteKeyRangeTracker tryReturnRecordAt
INFO: Adjusting range start from [12] to [12] as position of first returned record
org.apache.beam.sdk.io.range.ByteKeyRangeTrackerTest > testSplitAtPosition STANDARD_ERROR
Jun 30, 2018 3:06:36 PM org.apache.beam.sdk.io.range.ByteKeyRangeTracker trySplitAtPosition
WARNING: ByteKeyRangeTracker{range=ByteKeyRange{startKey=[12], endKey=[34]}, position=null}: Rejecting split request at [23] because no records have been returned.
Jun 30, 2018 3:06:36 PM org.apache.beam.sdk.io.range.ByteKeyRangeTracker tryReturnRecordAt
INFO: Adjusting range start from [12] to [12] as position of first returned record
Jun 30, 2018 3:06:36 PM org.apache.beam.sdk.io.range.ByteKeyRangeTracker trySplitAtPosition
WARNING: ByteKeyRangeTracker{range=ByteKeyRange{startKey=[12], endKey=[33]}, position=[12]}: Rejecting split request at [34] because it is not within the range.
Jun 30, 2018 3:06:36 PM org.apache.beam.sdk.io.range.ByteKeyRangeTracker trySplitAtPosition
WARNING: ByteKeyRangeTracker{range=ByteKeyRange{startKey=[12], endKey=[33]}, position=[23]}: Rejecting split request at [23] because it is not after current position [23].
org.apache.beam.sdk.io.range.ByteKeyRangeTrackerTest > testGetFractionConsumedAfterOutOfRangeClaim STANDARD_ERROR
Jun 30, 2018 3:06:36 PM org.apache.beam.sdk.io.range.ByteKeyRangeTracker tryReturnRecordAt
INFO: Adjusting range start from [12] to [12] as position of first returned record
org.apache.beam.sdk.io.range.ByteKeyRangeTrackerTest > testGetFractionConsumed STANDARD_ERROR
Jun 30, 2018 3:06:36 PM org.apache.beam.sdk.io.range.ByteKeyRangeTracker tryReturnRecordAt
INFO: Adjusting range start from [12] to [12] as position of first returned record
org.apache.beam.sdk.io.range.ByteKeyRangeTrackerTest > testGetFractionConsumedUpdateStartKey STANDARD_ERROR
Jun 30, 2018 3:06:36 PM org.apache.beam.sdk.io.range.ByteKeyRangeTracker tryReturnRecordAt
INFO: Adjusting range start from [12] to [14] as position of first returned record
org.apache.beam.sdk.io.range.ByteKeyRangeTrackerTest > testTryReturnBeforeLastReturnedRecord STANDARD_ERROR
Jun 30, 2018 3:06:36 PM org.apache.beam.sdk.io.range.ByteKeyRangeTracker tryReturnRecordAt
INFO: Adjusting range start from [12] to [12] as position of first returned record
org.apache.beam.sdk.io.range.ByteKeyRangeTrackerTest > testUpdateStartKey STANDARD_ERROR
Jun 30, 2018 3:06:36 PM org.apache.beam.sdk.io.range.ByteKeyRangeTracker tryReturnRecordAt
INFO: Adjusting range start from [12] to [14] as position of first returned record
org.apache.beam.sdk.io.range.ByteKeyRangeTrackerTest > testGetFractionConsumedAfterDone STANDARD_ERROR
Jun 30, 2018 3:06:36 PM org.apache.beam.sdk.io.range.ByteKeyRangeTracker tryReturnRecordAt
INFO: Adjusting range start from [12] to [12] as position of first returned record
org.apache.beam.sdk.io.range.ByteKeyRangeTrackerTest > testTryReturnRecordAt STANDARD_ERROR
Jun 30, 2018 3:06:36 PM org.apache.beam.sdk.io.range.ByteKeyRangeTracker tryReturnRecordAt
INFO: Adjusting range start from [12] to [12] as position of first returned record
org.apache.beam.sdk.io.range.ByteKeyRangeTrackerTest > testGetSplitPointsConsumed STANDARD_ERROR
Jun 30, 2018 3:06:36 PM org.apache.beam.sdk.io.range.ByteKeyRangeTracker tryReturnRecordAt
INFO: Adjusting range start from [12] to [12] as position of first returned record
org.apache.beam.sdk.util.MutationDetectorsTest > testMutationWithEqualEncodings STANDARD_ERROR
Jun 30, 2018 3:06:36 PM org.apache.beam.sdk.util.MutationDetectors$CodedValueMutationDetector verifyUnmodifiedThrowingCheckedExceptions
WARNING: Coder of type class org.apache.beam.sdk.util.MutationDetectorsTest$1EncodingBadStructuralValueCoder has a #structuralValue method which does not return true when the encoding of the elements is equal. Element [1, foo, [Ljava.lang.Byte;@4f973fc2]
org.apache.beam.sdk.util.NumberedShardedFileTest > testReadWithRetriesFailsWhenOutputDirEmpty STANDARD_ERROR
Jun 30, 2018 3:06:36 PM org.apache.beam.sdk.util.NumberedShardedFile readFilesWithRetries
WARNING: Error in file reading. Ignore and retry.
Jun 30, 2018 3:06:36 PM org.apache.beam.sdk.util.NumberedShardedFile readFilesWithRetries
WARNING: Error in file reading. Ignore and retry.
Jun 30, 2018 3:06:36 PM org.apache.beam.sdk.util.NumberedShardedFile readFilesWithRetries
WARNING: Error in file reading. Ignore and retry.
Jun 30, 2018 3:06:36 PM org.apache.beam.sdk.util.NumberedShardedFile readFilesWithRetries
WARNING: Error in file reading. Ignore and retry.
Jun 30, 2018 3:06:36 PM org.apache.beam.sdk.util.NumberedShardedFile readFilesWithRetries
WARNING: Error in file reading. Ignore and retry.
Gradle Test Executor 41 finished executing tests.
> Task :beam-sdks-java-core:test
Finished generating test XML results (0.048 secs) into: <https://builds.apache.org/job/beam_PostCommit_Java_GradleBuild/ws/src/sdks/java/core/build/test-results/test>
Generating HTML test report...
Finished generating test html results (0.067 secs) into: <https://builds.apache.org/job/beam_PostCommit_Java_GradleBuild/ws/src/sdks/java/core/build/reports/tests/test>
Packing task ':beam-sdks-java-core:test'
:beam-sdks-java-core:test (Thread[Task worker for ':' Thread 12,5,main]) completed. Took 26.39 secs.
:beam-sdks-java-core:check (Thread[Task worker for ':' Thread 12,5,main]) started.
> Task :beam-sdks-java-core:check
Skipping task ':beam-sdks-java-core:check' as it has no actions.
:beam-sdks-java-core:check (Thread[Task worker for ':' Thread 12,5,main]) completed. Took 0.0 secs.
:beam-sdks-java-core:build (Thread[Task worker for ':' Thread 12,5,main]) started.
> Task :beam-sdks-java-core:build
Skipping task ':beam-sdks-java-core:build' as it has no actions.
:beam-sdks-java-core:build (Thread[Task worker for ':' Thread 12,5,main]) completed. Took 0.0 secs.
:beam-sdks-java-core:buildNeeded (Thread[Task worker for ':' Thread 12,5,main]) started.
> Task :beam-sdks-java-core:buildNeeded
Skipping task ':beam-sdks-java-core:buildNeeded' as it has no actions.
:beam-sdks-java-core:buildNeeded (Thread[Task worker for ':' Thread 12,5,main]) completed. Took 0.0 secs.
FAILURE: Build failed with an exception.
* What went wrong:
Execution failed for task ':beam-runners-core-java:compileJava'.
> Compilation failed with exit code 1; see the compiler error output for details.
* Try:
Run with --stacktrace option to get the stack trace. Run with --debug option to get more log output. Run with --scan to get full insights.
* Get more help at https://help.gradle.org
Deprecated Gradle features were used in this build, making it incompatible with Gradle 5.0.
See https://docs.gradle.org/4.8/userguide/command_line_interface.html#sec:command_line_warnings
BUILD FAILED in 4m 12s
338 actionable tasks: 333 executed, 5 from cache
Publishing build scan...
https://gradle.com/s/6pi2yiesas5f4
Build step 'Invoke Gradle script' changed build result to FAILURE
Build step 'Invoke Gradle script' marked build as failure