You are viewing a plain text version of this content. The canonical link for it is here.
Posted to dev@jmeter.apache.org by Apache Jenkins Server <je...@builds.apache.org> on 2025/07/18 13:28:18 UTC

Build failed in Jenkins: JMeter » JMeter-trunk #813

See <https://ci-builds.apache.org/job/JMeter/job/JMeter-trunk/813/display/redirect?page=changes>

Changes:

[Vladimir Sitnikov] fix: replace checksum-dependency-plugin with Gradle dependency verification


------------------------------------------
Started by GitHub push by vlsi
Started by GitHub push by vlsi
Running as SYSTEM
[EnvInject] - Loading node environment variables.
Building remotely on builds57 (ubuntu ubuntu-avx) in workspace <https://ci-builds.apache.org/job/JMeter/job/JMeter-trunk/ws/>
[WS-CLEANUP] Deleting project workspace...
[WS-CLEANUP] Done
The recommended git tool is: NONE
No credentials specified
 > git rev-parse --resolve-git-dir <https://ci-builds.apache.org/job/JMeter/job/JMeter-trunk/ws/.git> # timeout=10
Fetching changes from the remote Git repository
 > git config remote.origin.url https://github.com/apache/jmeter.git # timeout=10
Fetching upstream changes from https://github.com/apache/jmeter.git
 > git --version # timeout=10
 > git --version # 'git version 2.34.1'
 > git fetch --tags --force --progress -- https://github.com/apache/jmeter.git +refs/heads/*:refs/remotes/origin/* # timeout=10
 > git rev-parse refs/remotes/origin/master^{commit} # timeout=10
Checking out Revision 4bed942058fbf7fa472a40703ccd8d850db3d43f (refs/remotes/origin/master)
 > git config core.sparsecheckout # timeout=10
 > git checkout -f 4bed942058fbf7fa472a40703ccd8d850db3d43f # timeout=10
Commit message: "fix: replace checksum-dependency-plugin with Gradle dependency verification"
 > git rev-list --no-walk 2b09e2e74b34face75e6594538ebdd6b15323a77 # timeout=10
Xvfb starting$ /usr/bin/Xvfb :1 -fbdir <https://ci-builds.apache.org/job/JMeter/job/JMeter-trunk/ws/.xvfb-813-..fbdir8839031051817820312>
[EnvInject] - Executing scripts and injecting environment variables after the SCM step.
[EnvInject] - Injecting as environment variables the properties content 
SONAR_HOST_URL=https://sonarcloud.io

[EnvInject] - Variables injected successfully.
[EnvInject] - Mask passwords that will be passed as build parameters.
[Gradle] - Launching build.
[JMeter-trunk] $ <https://ci-builds.apache.org/job/JMeter/job/JMeter-trunk/ws/gradlew> "-Dorg.gradle.jvmargs=-Xmx2g -XX:MaxMetaspaceSize=1g" -Pcoverage=true -PignoreSpotBugsFailures=true -Pasf=true -PCI=true -Pspotbugs=true --profile --no-daemon publish cleanTest check assemble
To honour the JVM settings for this build a single-use Daemon process will be forked. For more on this, please refer to https://docs.gradle.org/8.9/userguide/gradle_daemon.html#sec:disabling_the_daemon in the Gradle documentation.
Daemon will be stopped at the end of the build 
Using the build cache is enabled, but no build caches are configured or enabled.
Type-safe project accessors is an incubating feature.
Invalid Java installation found at '/usr/local/asfpackages/java/oraclejdk-j2sdk1.4.2-19' (Maven Toolchains) auto-detected. It will be re-checked in the next build. This might have performance impact if it keeps failing. Run the 'javaToolchains' task for more details.
> Task :build-logic-commons:gradle-plugin:checkKotlinGradlePluginConfigurationErrors
> Task :build-logic-commons:gradle-plugin:generateExternalPluginSpecBuilders UP-TO-DATE
> Task :build-logic-commons:gradle-plugin:extractPrecompiledScriptPluginPlugins UP-TO-DATE
> Task :build-logic-commons:gradle-plugin:compilePluginsBlocks UP-TO-DATE
> Task :build-logic-commons:gradle-plugin:generatePrecompiledScriptPluginAccessors UP-TO-DATE
> Task :build-logic-commons:gradle-plugin:generateScriptPluginAdapters UP-TO-DATE
> Task :build-logic-commons:gradle-plugin:compileKotlin UP-TO-DATE
> Task :build-logic-commons:gradle-plugin:compileJava NO-SOURCE
> Task :build-logic-commons:gradle-plugin:pluginDescriptors UP-TO-DATE
> Task :build-logic-commons:gradle-plugin:processResources UP-TO-DATE
> Task :build-logic-commons:gradle-plugin:classes UP-TO-DATE
> Task :build-logic-commons:gradle-plugin:jar UP-TO-DATE
> Task :build-logic:build-parameters:checkKotlinGradlePluginConfigurationErrors
> Task :build-logic:verification:checkKotlinGradlePluginConfigurationErrors
> Task :build-logic:basics:checkKotlinGradlePluginConfigurationErrors
> Task :build-logic:root-build:checkKotlinGradlePluginConfigurationErrors
> Task :build-logic:basics:extractPrecompiledScriptPluginPlugins UP-TO-DATE
> Task :build-logic:root-build:extractPrecompiledScriptPluginPlugins UP-TO-DATE
> Task :build-logic:basics:generateScriptPluginAdapters UP-TO-DATE
> Task :build-logic:verification:extractPrecompiledScriptPluginPlugins UP-TO-DATE
> Task :build-logic:root-build:generateScriptPluginAdapters UP-TO-DATE
> Task :build-logic:basics:pluginDescriptors UP-TO-DATE
> Task :build-logic:root-build:pluginDescriptors UP-TO-DATE
> Task :build-logic:verification:generateScriptPluginAdapters UP-TO-DATE
> Task :build-logic:basics:processResources UP-TO-DATE
> Task :build-logic:verification:pluginDescriptors UP-TO-DATE
> Task :build-logic:root-build:processResources UP-TO-DATE
> Task :build-logic:verification:processResources UP-TO-DATE
> Task :build-logic:build-parameters:generatePluginCode
> Task :build-logic:build-parameters:compileKotlin NO-SOURCE
> Task :build-logic:build-parameters:compileJava UP-TO-DATE
> Task :build-logic:build-parameters:pluginDescriptors UP-TO-DATE
> Task :build-logic:build-parameters:processResources UP-TO-DATE
> Task :build-logic:basics:generateExternalPluginSpecBuilders UP-TO-DATE
> Task :build-logic:build-parameters:classes UP-TO-DATE
> Task :build-logic:build-parameters:jar UP-TO-DATE
> Task :build-logic:basics:compilePluginsBlocks UP-TO-DATE
> Task :build-logic:basics:generatePrecompiledScriptPluginAccessors UP-TO-DATE
> Task :build-logic:basics:compileKotlin
> Task :build-logic:basics:compileJava NO-SOURCE
> Task :build-logic:basics:classes UP-TO-DATE
> Task :build-logic:basics:jar UP-TO-DATE
> Task :build-logic:verification:generateExternalPluginSpecBuilders UP-TO-DATE
> Task :build-logic:verification:compilePluginsBlocks UP-TO-DATE
> Task :build-logic:verification:generatePrecompiledScriptPluginAccessors UP-TO-DATE
> Task :build-logic:verification:compileKotlin
> Task :build-logic:verification:compileJava NO-SOURCE
> Task :build-logic:verification:classes UP-TO-DATE
> Task :build-logic:verification:jar UP-TO-DATE
> Task :build-logic:root-build:generateExternalPluginSpecBuilders UP-TO-DATE
> Task :build-logic:root-build:compilePluginsBlocks UP-TO-DATE
> Task :build-logic:root-build:generatePrecompiledScriptPluginAccessors UP-TO-DATE
> Task :build-logic:root-build:compileKotlin
> Task :build-logic:root-build:compileJava NO-SOURCE
> Task :build-logic:root-build:classes UP-TO-DATE
> Task :build-logic:root-build:jar UP-TO-DATE

> Configure project :
Building JMeter 6.0.0-SNAPSHOT

> Task :build-logic:publishing:checkKotlinGradlePluginConfigurationErrors
> Task :build-logic:jvm:checkKotlinGradlePluginConfigurationErrors
> Task :build-logic:publishing:extractPrecompiledScriptPluginPlugins UP-TO-DATE
> Task :build-logic:publishing:generateScriptPluginAdapters UP-TO-DATE
> Task :build-logic:publishing:pluginDescriptors UP-TO-DATE
> Task :build-logic:publishing:processResources UP-TO-DATE
> Task :build-logic:jvm:generateExternalPluginSpecBuilders UP-TO-DATE
> Task :build-logic:jvm:extractPrecompiledScriptPluginPlugins UP-TO-DATE
> Task :build-logic:jvm:compilePluginsBlocks UP-TO-DATE
> Task :build-logic:jvm:generatePrecompiledScriptPluginAccessors UP-TO-DATE
> Task :build-logic:jvm:generateScriptPluginAdapters UP-TO-DATE
> Task :build-logic:jvm:pluginDescriptors UP-TO-DATE
> Task :build-logic:jvm:processResources UP-TO-DATE
> Task :build-logic:jvm:compileKotlin
> Task :build-logic:jvm:compileJava NO-SOURCE
> Task :build-logic:jvm:classes UP-TO-DATE
> Task :build-logic:publishing:generateExternalPluginSpecBuilders UP-TO-DATE
> Task :build-logic:jvm:jar UP-TO-DATE
> Task :build-logic:publishing:compilePluginsBlocks UP-TO-DATE
> Task :build-logic:publishing:generatePrecompiledScriptPluginAccessors UP-TO-DATE
> Task :build-logic:publishing:compileKotlin
> Task :build-logic:publishing:compileJava NO-SOURCE
> Task :build-logic:publishing:classes UP-TO-DATE
> Task :build-logic:publishing:jar UP-TO-DATE

> Configure project :src:components
RenderInBrowser is excluded from compilation. If you want to compile it, add -PenableJavaFx

> Configure project :src:dist
w: file://<https://ci-builds.apache.org/job/JMeter/job/JMeter-trunk/ws/src/dist/build.gradle.kts>:189:72: 'getter for isCurrentBuild: Boolean' is deprecated. Deprecated in Java

> Task :build-logic:batchtest:checkKotlinGradlePluginConfigurationErrors
> Task :build-logic:batchtest:generateExternalPluginSpecBuilders UP-TO-DATE
> Task :build-logic:batchtest:extractPrecompiledScriptPluginPlugins UP-TO-DATE
> Task :build-logic:batchtest:compilePluginsBlocks UP-TO-DATE
> Task :build-logic:batchtest:generatePrecompiledScriptPluginAccessors UP-TO-DATE
> Task :build-logic:batchtest:generateScriptPluginAdapters UP-TO-DATE
> Task :build-logic:batchtest:pluginDescriptors UP-TO-DATE
> Task :build-logic:batchtest:processResources UP-TO-DATE
> Task :build-logic:batchtest:compileKotlin
> Task :build-logic:batchtest:compileJava NO-SOURCE
> Task :build-logic:batchtest:classes UP-TO-DATE
> Task :build-logic:batchtest:jar UP-TO-DATE

FAILURE: Build failed with an exception.

* What went wrong:
A problem occurred configuring project ':src:dist-check'.
> A build operation failed.
      Could not read workspace metadata from /home/jenkins/.gradle/caches/8.9/transforms/6c4f0dbe42731c70a60109d1d62a2374/metadata.bin
   > Could not read workspace metadata from /home/jenkins/.gradle/caches/8.9/transforms/6c4f0dbe42731c70a60109d1d62a2374/metadata.bin

* Try:
> Run with --stacktrace option to get the stack trace.
> Run with --info or --debug option to get more log output.
> Get more help at https://help.gradle.org.

BUILD FAILED in 2m 8s
76 actionable tasks: 15 executed, 61 up-to-date

See the profiling report at: file://<https://ci-builds.apache.org/job/JMeter/job/JMeter-trunk/ws/build/reports/profile/profile-2025-07-18-13-26-25.html>
A fine-grained performance profile is available: use the --scan option.
Build step 'Invoke Gradle script' changed build result to FAILURE
Build step 'Invoke Gradle script' marked build as failure
Xvfb stopping
Archiving artifacts
Recording test results
ERROR: Step ‘Publish JUnit test result report’ failed: No test report files were found. Configuration error?

Build failed in Jenkins: JMeter » JMeter-trunk #814

Posted by Apache Jenkins Server <je...@builds.apache.org>.
See <https://ci-builds.apache.org/job/JMeter/job/JMeter-trunk/814/display/redirect?page=changes>

Changes:

[Vladimir Sitnikov] chore: run Errorprone verifications by default


------------------------------------------
[...truncated 77.99 KiB...]
            These files failed verification:
              - GRADLE_USER_HOME/caches/modules-2/files-2.1/io.projectreactor/reactor-bom/2023.0.1/f349d03212fed601daa993168058c2b82ebb68af/reactor-bom-2023.0.1.module (signature: GRADLE_USER_HOME/caches/modules-2/files-2.1/io.projectreactor/reactor-bom/2023.0.1/2c0bf93c8a4a7e33ae5b028e6697e26a288e83f7/reactor-bom-2023.0.1.module.asc)
            
            GRADLE_USER_HOME = /home/jenkins/.gradle
            
            These files failed verification:
              - GRADLE_USER_HOME/caches/modules-2/files-2.1/io.projectreactor/reactor-bom/2023.0.1/f349d03212fed601daa993168058c2b82ebb68af/reactor-bom-2023.0.1.module (signature: GRADLE_USER_HOME/caches/modules-2/files-2.1/io.projectreactor/reactor-bom/2023.0.1/2c0bf93c8a4a7e33ae5b028e6697e26a288e83f7/reactor-bom-2023.0.1.module.asc)
            
            GRADLE_USER_HOME = /home/jenkins/.gradle
            
            Open this report for more details: file://<https://ci-builds.apache.org/job/JMeter/job/JMeter-trunk/ws/build/reports/dependency-verification/at-1752846071713/dependency-verification-report.html>
                at org.gradle.api.internal.artifacts.ivyservice.ivyresolve.verification.ChecksumAndSignatureVerificationOverride.artifactsAccessed(ChecksumAndSignatureVerificationOverride.java:194)
                at org.gradle.api.internal.artifacts.ivyservice.resolveengine.artifact.ResolvedArtifactSetResolver$1.run(ResolvedArtifactSetResolver.java:66)
                at org.gradle.internal.operations.DefaultBuildOperationRunner$1.execute(DefaultBuildOperationRunner.java:29)
                at org.gradle.internal.operations.DefaultBuildOperationRunner$1.execute(DefaultBuildOperationRunner.java:26)
                at org.gradle.internal.operations.DefaultBuildOperationRunner$2.execute(DefaultBuildOperationRunner.java:66)
                at org.gradle.internal.operations.DefaultBuildOperationRunner$2.execute(DefaultBuildOperationRunner.java:59)
                at org.gradle.internal.operations.DefaultBuildOperationRunner.execute(DefaultBuildOperationRunner.java:166)
                at org.gradle.internal.operations.DefaultBuildOperationRunner.execute(DefaultBuildOperationRunner.java:59)
                at org.gradle.internal.operations.DefaultBuildOperationRunner.run(DefaultBuildOperationRunner.java:47)
                at org.gradle.api.internal.artifacts.ivyservice.resolveengine.artifact.ResolvedArtifactSetResolver.visitArtifacts(ResolvedArtifactSetResolver.java:62)
                at org.gradle.api.internal.artifacts.ivyservice.resolveengine.artifact.ResolvedArtifactSetResolver.lambda$visitInUnmanagedWorkerThread$0(ResolvedArtifactSetResolver.java:58)
                at org.gradle.internal.work.DefaultWorkerLeaseService.runAsUnmanagedWorkerThread(DefaultWorkerLeaseService.java:143)
                at org.gradle.api.internal.artifacts.ivyservice.resolveengine.artifact.ResolvedArtifactSetResolver.visitInUnmanagedWorkerThread(ResolvedArtifactSetResolver.java:58)
                at org.gradle.api.internal.artifacts.ivyservice.resolveengine.artifact.DefaultSelectedArtifactSet.visitArtifacts(DefaultSelectedArtifactSet.java:59)
                at org.gradle.api.internal.artifacts.ivyservice.resolveengine.artifact.SelectedArtifactSet.visitFiles(SelectedArtifactSet.java:34)
                at org.gradle.api.internal.artifacts.configurations.ResolutionBackedFileCollection.visitContents(ResolutionBackedFileCollection.java:73)
                at org.gradle.api.internal.file.AbstractFileCollection.visitStructure(AbstractFileCollection.java:360)
                at org.gradle.api.internal.artifacts.configurations.DefaultConfiguration.visitContents(DefaultConfiguration.java:541)
                at org.gradle.api.internal.file.AbstractFileCollection.visitStructure(AbstractFileCollection.java:360)
                at org.gradle.api.internal.file.CompositeFileCollection.lambda$visitContents$0(CompositeFileCollection.java:113)
                at org.gradle.api.internal.file.collections.UnpackingVisitor.add(UnpackingVisitor.java:67)
                at org.gradle.api.internal.file.collections.UnpackingVisitor.add(UnpackingVisitor.java:92)
                at org.gradle.api.internal.file.DefaultFileCollectionFactory$ResolvingFileCollection.visitChildren(DefaultFileCollectionFactory.java:306)
                at org.gradle.api.internal.file.CompositeFileCollection.visitContents(CompositeFileCollection.java:113)
                at org.gradle.api.internal.file.AbstractFileCollection.visitStructure(AbstractFileCollection.java:360)
                at org.gradle.api.internal.file.CompositeFileCollection.lambda$visitContents$0(CompositeFileCollection.java:113)
                at org.gradle.api.internal.tasks.PropertyFileCollection.visitChildren(PropertyFileCollection.java:48)
                at org.gradle.api.internal.file.CompositeFileCollection.visitContents(CompositeFileCollection.java:113)
                at org.gradle.api.internal.file.AbstractFileCollection.visitStructure(AbstractFileCollection.java:360)
                at org.gradle.internal.fingerprint.impl.DefaultFileCollectionSnapshotter.snapshot(DefaultFileCollectionSnapshotter.java:47)
                at org.gradle.internal.execution.impl.DefaultInputFingerprinter$InputCollectingVisitor.visitInputFileProperty(DefaultInputFingerprinter.java:133)
                at org.gradle.api.internal.tasks.execution.TaskExecution.visitRegularInputs(TaskExecution.java:324)
                at org.gradle.internal.execution.impl.DefaultInputFingerprinter.fingerprintInputProperties(DefaultInputFingerprinter.java:63)
                at org.gradle.internal.execution.steps.AbstractCaptureStateBeforeExecutionStep.captureExecutionStateWithOutputs(AbstractCaptureStateBeforeExecutionStep.java:109)
                at org.gradle.internal.execution.steps.AbstractCaptureStateBeforeExecutionStep.lambda$captureExecutionState$0(AbstractCaptureStateBeforeExecutionStep.java:74)
                at org.gradle.internal.execution.steps.BuildOperationStep$1.call(BuildOperationStep.java:37)
                at org.gradle.internal.operations.DefaultBuildOperationRunner$CallableBuildOperationWorker.execute(DefaultBuildOperationRunner.java:209)
                at org.gradle.internal.operations.DefaultBuildOperationRunner$CallableBuildOperationWorker.execute(DefaultBuildOperationRunner.java:204)
                at org.gradle.internal.operations.DefaultBuildOperationRunner$2.execute(DefaultBuildOperationRunner.java:66)
                at org.gradle.internal.operations.DefaultBuildOperationRunner$2.execute(DefaultBuildOperationRunner.java:59)
                at org.gradle.internal.operations.DefaultBuildOperationRunner.execute(DefaultBuildOperationRunner.java:166)
                at org.gradle.internal.operations.DefaultBuildOperationRunner.execute(DefaultBuildOperationRunner.java:59)
                at org.gradle.internal.operations.DefaultBuildOperationRunner.call(DefaultBuildOperationRunner.java:53)
                at org.gradle.internal.execution.steps.BuildOperationStep.operation(BuildOperationStep.java:34)
                at org.gradle.internal.execution.steps.AbstractCaptureStateBeforeExecutionStep.captureExecutionState(AbstractCaptureStateBeforeExecutionStep.java:69)
                at org.gradle.internal.execution.steps.AbstractCaptureStateBeforeExecutionStep.execute(AbstractCaptureStateBeforeExecutionStep.java:62)
                at org.gradle.internal.execution.steps.AbstractCaptureStateBeforeExecutionStep.execute(AbstractCaptureStateBeforeExecutionStep.java:43)
                at org.gradle.internal.execution.steps.AbstractSkipEmptyWorkStep.executeWithNonEmptySources(AbstractSkipEmptyWorkStep.java:125)
                at org.gradle.internal.execution.steps.AbstractSkipEmptyWorkStep.execute(AbstractSkipEmptyWorkStep.java:61)
                at org.gradle.internal.execution.steps.AbstractSkipEmptyWorkStep.execute(AbstractSkipEmptyWorkStep.java:36)
                at org.gradle.internal.execution.steps.legacy.MarkSnapshottingInputsStartedStep.execute(MarkSnapshottingInputsStartedStep.java:38)
                at org.gradle.internal.execution.steps.LoadPreviousExecutionStateStep.execute(LoadPreviousExecutionStateStep.java:36)
                at org.gradle.internal.execution.steps.LoadPreviousExecutionStateStep.execute(LoadPreviousExecutionStateStep.java:23)
                at org.gradle.internal.execution.steps.HandleStaleOutputsStep.execute(HandleStaleOutputsStep.java:75)
                at org.gradle.internal.execution.steps.HandleStaleOutputsStep.execute(HandleStaleOutputsStep.java:41)
                at org.gradle.internal.execution.steps.AssignMutableWorkspaceStep.lambda$execute$0(AssignMutableWorkspaceStep.java:35)
                at org.gradle.api.internal.tasks.execution.TaskExecution$4.withWorkspace(TaskExecution.java:289)
                at org.gradle.internal.execution.steps.AssignMutableWorkspaceStep.execute(AssignMutableWorkspaceStep.java:31)
                at org.gradle.internal.execution.steps.AssignMutableWorkspaceStep.execute(AssignMutableWorkspaceStep.java:22)
                at org.gradle.internal.execution.steps.ChoosePipelineStep.execute(ChoosePipelineStep.java:40)
                at org.gradle.internal.execution.steps.ChoosePipelineStep.execute(ChoosePipelineStep.java:23)
                at org.gradle.internal.execution.steps.ExecuteWorkBuildOperationFiringStep.lambda$execute$2(ExecuteWorkBuildOperationFiringStep.java:67)
                at java.base/java.util.Optional.orElseGet(Optional.java:364)
                at org.gradle.internal.execution.steps.ExecuteWorkBuildOperationFiringStep.execute(ExecuteWorkBuildOperationFiringStep.java:67)
                at org.gradle.internal.execution.steps.ExecuteWorkBuildOperationFiringStep.execute(ExecuteWorkBuildOperationFiringStep.java:39)
                at org.gradle.internal.execution.steps.IdentityCacheStep.execute(IdentityCacheStep.java:46)
                at org.gradle.internal.execution.steps.IdentityCacheStep.execute(IdentityCacheStep.java:34)
                at org.gradle.internal.execution.steps.IdentifyStep.execute(IdentifyStep.java:48)
                at org.gradle.internal.execution.steps.IdentifyStep.execute(IdentifyStep.java:35)
        Caused by: org.gradle.api.internal.artifacts.verification.exceptions.DependencyVerificationException: Dependency verification failed for configuration ':src:jorphan:kapt':
          - On artifact reactor-bom-2023.0.1.module (io.projectreactor:reactor-bom:2023.0.1) in repository 'MavenRepo': Artifact was signed with key '48B086A7D843CFA258E83286928FBF39003C0425' (Spring Builds (JAR Signing) <sp...@vmware.com>) and passed verification but the key isn't in your trusted keys list.
        
        If the artifacts are trustworthy, you will need to update the gradle/verification-metadata.xml file. For more on how to do this, please refer to https://docs.gradle.org/8.9/userguide/dependency_verification.html#sec:troubleshooting-verification in the Gradle documentation.
        
        These files failed verification:
          - GRADLE_USER_HOME/caches/modules-2/files-2.1/io.projectreactor/reactor-bom/2023.0.1/f349d03212fed601daa993168058c2b82ebb68af/reactor-bom-2023.0.1.module (signature: GRADLE_USER_HOME/caches/modules-2/files-2.1/io.projectreactor/reactor-bom/2023.0.1/2c0bf93c8a4a7e33ae5b028e6697e26a288e83f7/reactor-bom-2023.0.1.module.asc)
        
        GRADLE_USER_HOME = /home/jenkins/.gradle
        
        These files failed verification:
          - GRADLE_USER_HOME/caches/modules-2/files-2.1/io.projectreactor/reactor-bom/2023.0.1/f349d03212fed601daa993168058c2b82ebb68af/reactor-bom-2023.0.1.module (signature: GRADLE_USER_HOME/caches/modules-2/files-2.1/io.projectreactor/reactor-bom/2023.0.1/2c0bf93c8a4a7e33ae5b028e6697e26a288e83f7/reactor-bom-2023.0.1.module.asc)
        
        GRADLE_USER_HOME = /home/jenkins/.gradle
        
        Open this report for more details: file://<https://ci-builds.apache.org/job/JMeter/job/JMeter-trunk/ws/build/reports/dependency-verification/at-1752846071713/dependency-verification-report.html>
            at org.gradle.api.internal.artifacts.ivyservice.ivyresolve.verification.ChecksumAndSignatureVerificationOverride.artifactsAccessed(ChecksumAndSignatureVerificationOverride.java:194)
            at org.gradle.api.internal.artifacts.ivyservice.resolveengine.artifact.ResolvedArtifactSetResolver$1.run(ResolvedArtifactSetResolver.java:66)
            at org.gradle.internal.operations.DefaultBuildOperationRunner$1.execute(DefaultBuildOperationRunner.java:29)
            at org.gradle.internal.operations.DefaultBuildOperationRunner$1.execute(DefaultBuildOperationRunner.java:26)
            at org.gradle.internal.operations.DefaultBuildOperationRunner$2.execute(DefaultBuildOperationRunner.java:66)
            at org.gradle.internal.operations.DefaultBuildOperationRunner$2.execute(DefaultBuildOperationRunner.java:59)
            at org.gradle.internal.operations.DefaultBuildOperationRunner.execute(DefaultBuildOperationRunner.java:166)
            at org.gradle.internal.operations.DefaultBuildOperationRunner.execute(DefaultBuildOperationRunner.java:59)
            at org.gradle.internal.operations.DefaultBuildOperationRunner.run(DefaultBuildOperationRunner.java:47)
            at org.gradle.api.internal.artifacts.ivyservice.resolveengine.artifact.ResolvedArtifactSetResolver.visitArtifacts(ResolvedArtifactSetResolver.java:62)
            at org.gradle.api.internal.artifacts.ivyservice.resolveengine.artifact.ResolvedArtifactSetResolver.lambda$visitInUnmanagedWorkerThread$0(ResolvedArtifactSetResolver.java:58)
            at org.gradle.internal.work.DefaultWorkerLeaseService.runAsUnmanagedWorkerThread(DefaultWorkerLeaseService.java:143)
            at org.gradle.api.internal.artifacts.ivyservice.resolveengine.artifact.ResolvedArtifactSetResolver.visitInUnmanagedWorkerThread(ResolvedArtifactSetResolver.java:58)
            at org.gradle.api.internal.artifacts.ivyservice.resolveengine.artifact.DefaultSelectedArtifactSet.visitArtifacts(DefaultSelectedArtifactSet.java:59)
            at org.gradle.api.internal.artifacts.ivyservice.resolveengine.artifact.SelectedArtifactSet.visitFiles(SelectedArtifactSet.java:34)
            at org.gradle.api.internal.artifacts.configurations.ResolutionBackedFileCollection.visitContents(ResolutionBackedFileCollection.java:73)
            at org.gradle.api.internal.file.AbstractFileCollection.getFiles(AbstractFileCollection.java:123)
            at org.gradle.api.internal.file.AbstractFileCollection.isEmpty(AbstractFileCollection.java:336)
            at org.gradle.api.internal.artifacts.configurations.DefaultConfiguration.isEmpty(DefaultConfiguration.java:563)
            at org.gradle.api.internal.file.CompositeFileCollection.isEmpty(CompositeFileCollection.java:66)
            at org.jetbrains.kotlin.gradle.tasks.configuration.KaptGenerateStubsConfig$configureFromExtension$1$1.isSatisfiedBy(KaptGenerateStubsConfig.kt:57)
            at org.jetbrains.kotlin.gradle.tasks.configuration.KaptGenerateStubsConfig$configureFromExtension$1$1.isSatisfiedBy(KaptGenerateStubsConfig.kt:56)
            at org.gradle.api.internal.tasks.execution.SelfDescribingSpec.isSatisfiedBy(SelfDescribingSpec.java:40)
            at org.gradle.api.specs.AndSpec.findUnsatisfiedSpec(AndSpec.java:67)
            at org.gradle.api.internal.tasks.execution.DescribingAndSpec.findUnsatisfiedSpec(DescribingAndSpec.java:58)
            at org.gradle.api.internal.tasks.execution.SkipOnlyIfTaskExecuter.execute(SkipOnlyIfTaskExecuter.java:50)
            at org.gradle.api.internal.tasks.execution.CatchExceptionTaskExecuter.execute(CatchExceptionTaskExecuter.java:36)
            at org.gradle.api.internal.tasks.execution.EventFiringTaskExecuter$1.executeTask(EventFiringTaskExecuter.java:77)
            at org.gradle.api.internal.tasks.execution.EventFiringTaskExecuter$1.call(EventFiringTaskExecuter.java:55)
            at org.gradle.api.internal.tasks.execution.EventFiringTaskExecuter$1.call(EventFiringTaskExecuter.java:52)
            at org.gradle.internal.operations.DefaultBuildOperationRunner$CallableBuildOperationWorker.execute(DefaultBuildOperationRunner.java:209)
            at org.gradle.internal.operations.DefaultBuildOperationRunner$CallableBuildOperationWorker.execute(DefaultBuildOperationRunner.java:204)
            at org.gradle.internal.operations.DefaultBuildOperationRunner$2.execute(DefaultBuildOperationRunner.java:66)
            at org.gradle.internal.operations.DefaultBuildOperationRunner$2.execute(DefaultBuildOperationRunner.java:59)
            at org.gradle.internal.operations.DefaultBuildOperationRunner.execute(DefaultBuildOperationRunner.java:166)
            at org.gradle.internal.operations.DefaultBuildOperationRunner.execute(DefaultBuildOperationRunner.java:59)
            at org.gradle.internal.operations.DefaultBuildOperationRunner.call(DefaultBuildOperationRunner.java:53)
            at org.gradle.api.internal.tasks.execution.EventFiringTaskExecuter.execute(EventFiringTaskExecuter.java:52)
            at org.gradle.execution.plan.LocalTaskNodeExecutor.execute(LocalTaskNodeExecutor.java:42)
            at org.gradle.execution.taskgraph.DefaultTaskExecutionGraph$InvokeNodeExecutorsAction.execute(DefaultTaskExecutionGraph.java:331)
            at org.gradle.execution.taskgraph.DefaultTaskExecutionGraph$InvokeNodeExecutorsAction.execute(DefaultTaskExecutionGraph.java:318)
            at org.gradle.execution.taskgraph.DefaultTaskExecutionGraph$BuildOperationAwareExecutionAction.lambda$execute$0(DefaultTaskExecutionGraph.java:314)
            at org.gradle.internal.operations.CurrentBuildOperationRef.with(CurrentBuildOperationRef.java:85)
            at org.gradle.execution.taskgraph.DefaultTaskExecutionGraph$BuildOperationAwareExecutionAction.execute(DefaultTaskExecutionGraph.java:314)
            at org.gradle.execution.taskgraph.DefaultTaskExecutionGraph$BuildOperationAwareExecutionAction.execute(DefaultTaskExecutionGraph.java:303)
            at org.gradle.execution.plan.DefaultPlanExecutor$ExecutorWorker.execute(DefaultPlanExecutor.java:459)
            at org.gradle.execution.plan.DefaultPlanExecutor$ExecutorWorker.run(DefaultPlanExecutor.java:376)
            at org.gradle.internal.concurrent.ExecutorPolicy$CatchAndRecordFailures.onExecute(ExecutorPolicy.java:64)
            at org.gradle.internal.concurrent.AbstractManagedExecutor$1.run(AbstractManagedExecutor.java:48)
            at java.base/java.util.concurrent.ThreadPoolExecutor.runWorker(ThreadPoolExecutor.java:1136)
            at java.base/java.util.concurrent.ThreadPoolExecutor$Worker.run(ThreadPoolExecutor.java:635)
            at java.base/java.lang.Thread.run(Thread.java:840)


FAILURE: Build completed with 3 failures.

1: Task failed with an exception.
-----------
* What went wrong:
Execution failed for task ':src:launcher:compileJava'.
> Dependency verification failed for configuration ':src:launcher:annotationProcessor':
    - On artifact reactor-bom-2023.0.1.module (io.projectreactor:reactor-bom:2023.0.1) in repository 'MavenRepo': Artifact was signed with key '48B086A7D843CFA258E83286928FBF39003C0425' (Spring Builds (JAR Signing) <sp...@vmware.com>) and passed verification but the key isn't in your trusted keys list.
  
  If the artifacts are trustworthy, you will need to update the gradle/verification-metadata.xml file. For more on how to do this, please refer to https://docs.gradle.org/8.9/userguide/dependency_verification.html#sec:troubleshooting-verification in the Gradle documentation.
  
  These files failed verification:
    - GRADLE_USER_HOME/caches/modules-2/files-2.1/io.projectreactor/reactor-bom/2023.0.1/f349d03212fed601daa993168058c2b82ebb68af/reactor-bom-2023.0.1.module (signature: GRADLE_USER_HOME/caches/modules-2/files-2.1/io.projectreactor/reactor-bom/2023.0.1/2c0bf93c8a4a7e33ae5b028e6697e26a288e83f7/reactor-bom-2023.0.1.module.asc)
  
  GRADLE_USER_HOME = /home/jenkins/.gradle
  
  These files failed verification:
    - GRADLE_USER_HOME/caches/modules-2/files-2.1/io.projectreactor/reactor-bom/2023.0.1/f349d03212fed601daa993168058c2b82ebb68af/reactor-bom-2023.0.1.module (signature: GRADLE_USER_HOME/caches/modules-2/files-2.1/io.projectreactor/reactor-bom/2023.0.1/2c0bf93c8a4a7e33ae5b028e6697e26a288e83f7/reactor-bom-2023.0.1.module.asc)
  
  GRADLE_USER_HOME = /home/jenkins/.gradle
  
  Open this report for more details: file://<https://ci-builds.apache.org/job/JMeter/job/JMeter-trunk/ws/build/reports/dependency-verification/at-1752846071713/dependency-verification-report.html>

* Try:
> Run with --stacktrace option to get the stack trace.
> Run with --info or --debug option to get more log output.
> Get more help at https://help.gradle.org.
==============================================================================

2: Task failed with an exception.
-----------
* What went wrong:
Execution failed for task ':src:testkit:compileJava'.
> Dependency verification failed for configuration ':src:testkit:annotationProcessor':
    - On artifact reactor-bom-2023.0.1.module (io.projectreactor:reactor-bom:2023.0.1) in repository 'MavenRepo': Artifact was signed with key '48B086A7D843CFA258E83286928FBF39003C0425' (Spring Builds (JAR Signing) <sp...@vmware.com>) and passed verification but the key isn't in your trusted keys list.
  
  If the artifacts are trustworthy, you will need to update the gradle/verification-metadata.xml file. For more on how to do this, please refer to https://docs.gradle.org/8.9/userguide/dependency_verification.html#sec:troubleshooting-verification in the Gradle documentation.
  
  These files failed verification:
    - GRADLE_USER_HOME/caches/modules-2/files-2.1/io.projectreactor/reactor-bom/2023.0.1/f349d03212fed601daa993168058c2b82ebb68af/reactor-bom-2023.0.1.module (signature: GRADLE_USER_HOME/caches/modules-2/files-2.1/io.projectreactor/reactor-bom/2023.0.1/2c0bf93c8a4a7e33ae5b028e6697e26a288e83f7/reactor-bom-2023.0.1.module.asc)
  
  GRADLE_USER_HOME = /home/jenkins/.gradle
  
  These files failed verification:
    - GRADLE_USER_HOME/caches/modules-2/files-2.1/io.projectreactor/reactor-bom/2023.0.1/f349d03212fed601daa993168058c2b82ebb68af/reactor-bom-2023.0.1.module (signature: GRADLE_USER_HOME/caches/modules-2/files-2.1/io.projectreactor/reactor-bom/2023.0.1/2c0bf93c8a4a7e33ae5b028e6697e26a288e83f7/reactor-bom-2023.0.1.module.asc)
  
  GRADLE_USER_HOME = /home/jenkins/.gradle
  
  Open this report for more details: file://<https://ci-builds.apache.org/job/JMeter/job/JMeter-trunk/ws/build/reports/dependency-verification/at-1752846071713/dependency-verification-report.html>

* Try:
> Run with --stacktrace option to get the stack trace.
> Run with --info or --debug option to get more log output.
> Get more help at https://help.gradle.org.
==============================================================================

3: Task failed with an exception.
-----------
* What went wrong:
Dependency verification failed for configuration ':src:jorphan:kapt':
  - On artifact reactor-bom-2023.0.1.module (io.projectreactor:reactor-bom:2023.0.1) in repository 'MavenRepo': Artifact was signed with key '48B086A7D843CFA258E83286928FBF39003C0425' (Spring Builds (JAR Signing) <sp...@vmware.com>) and passed verification but the key isn't in your trusted keys list.

If the artifacts are trustworthy, you will need to update the gradle/verification-metadata.xml file. For more on how to do this, please refer to https://docs.gradle.org/8.9/userguide/dependency_verification.html#sec:troubleshooting-verification in the Gradle documentation.

These files failed verification:
  - GRADLE_USER_HOME/caches/modules-2/files-2.1/io.projectreactor/reactor-bom/2023.0.1/f349d03212fed601daa993168058c2b82ebb68af/reactor-bom-2023.0.1.module (signature: GRADLE_USER_HOME/caches/modules-2/files-2.1/io.projectreactor/reactor-bom/2023.0.1/2c0bf93c8a4a7e33ae5b028e6697e26a288e83f7/reactor-bom-2023.0.1.module.asc)

GRADLE_USER_HOME = /home/jenkins/.gradle

These files failed verification:
  - GRADLE_USER_HOME/caches/modules-2/files-2.1/io.projectreactor/reactor-bom/2023.0.1/f349d03212fed601daa993168058c2b82ebb68af/reactor-bom-2023.0.1.module (signature: GRADLE_USER_HOME/caches/modules-2/files-2.1/io.projectreactor/reactor-bom/2023.0.1/2c0bf93c8a4a7e33ae5b028e6697e26a288e83f7/reactor-bom-2023.0.1.module.asc)

GRADLE_USER_HOME = /home/jenkins/.gradle

Open this report for more details: file://<https://ci-builds.apache.org/job/JMeter/job/JMeter-trunk/ws/build/reports/dependency-verification/at-1752846071713/dependency-verification-report.html>

* Try:
> Run with --stacktrace option to get the stack trace.
> Run with --info or --debug option to get more log output.
> Get more help at https://help.gradle.org.
==============================================================================

Deprecated Gradle features were used in this build, making it incompatible with Gradle 9.0.

You can use '--warning-mode all' to show the individual deprecation warnings and determine if they come from your own scripts or plugins.

For more on this, please refer to https://docs.gradle.org/8.9/userguide/command_line_interface.html#sec:command_line_warnings in the Gradle documentation.

BUILD FAILED in 4m 16s
160 actionable tasks: 93 executed, 67 up-to-date

See the profiling report at: file://<https://ci-builds.apache.org/job/JMeter/job/JMeter-trunk/ws/build/reports/profile/profile-2025-07-18-13-41-32.html>
A fine-grained performance profile is available: use the --scan option.
Build step 'Invoke Gradle script' changed build result to FAILURE
Build step 'Invoke Gradle script' marked build as failure
Xvfb stopping
Archiving artifacts
Recording test results
ERROR: Step ‘Publish JUnit test result report’ failed: No test report files were found. Configuration error?