You are viewing a plain text version of this content. The canonical link for it is here.
Posted to builds@solr.apache.org by Apache Jenkins Server <je...@builds.apache.org> on 2025/12/05 17:21:32 UTC

[JENKINS] Solr » Solr-Test-10.x - Build # 498 - Still Failing!

Build: https://ci-builds.apache.org/job/Solr/job/Solr-Test-10.x/498/

No tests ran.

Build Log:
[...truncated 168 lines...]
BUILD FAILED in 1m 26s
54 actionable tasks: 54 executed

Publishing build scan...
https://develocity.apache.org/s/taldhnjfag2cu

Build step 'Invoke Gradle script' changed build result to FAILURE
Build step 'Invoke Gradle script' marked build as failure
Archiving artifacts
Recording test results
ERROR: Step ‘Publish JUnit test result report’ failed: No test report files were found. Configuration error?
Email was triggered for: Failure - Any
Sending email for trigger: Failure - Any

[JENKINS] Solr » Solr-Test-10.x - Build # 501 - Still Failing!

Posted by Apache Jenkins Server <je...@builds.apache.org>.
Build: https://ci-builds.apache.org/job/Solr/job/Solr-Test-10.x/501/

No tests ran.

Build Log:
[...truncated 168 lines...]
BUILD FAILED in 1m 26s
54 actionable tasks: 54 executed

Publishing build scan...
https://develocity.apache.org/s/qymzcnphhhbnw

Build step 'Invoke Gradle script' changed build result to FAILURE
Build step 'Invoke Gradle script' marked build as failure
Archiving artifacts
Recording test results
ERROR: Step ‘Publish JUnit test result report’ failed: No test report files were found. Configuration error?
Email was triggered for: Failure - Any
Sending email for trigger: Failure - Any

[JENKINS] Solr » Solr-Test-10.x - Build # 500 - Still Failing!

Posted by Apache Jenkins Server <je...@builds.apache.org>.
Build: https://ci-builds.apache.org/job/Solr/job/Solr-Test-10.x/500/

No tests ran.

Build Log:
[...truncated 168 lines...]
BUILD FAILED in 1m 25s
54 actionable tasks: 54 executed

Publishing build scan...
https://develocity.apache.org/s/pcfztjoivgodk

Build step 'Invoke Gradle script' changed build result to FAILURE
Build step 'Invoke Gradle script' marked build as failure
Archiving artifacts
Recording test results
ERROR: Step ‘Publish JUnit test result report’ failed: No test report files were found. Configuration error?
Email was triggered for: Failure - Any
Sending email for trigger: Failure - Any

[JENKINS] Solr » Solr-Test-10.x - Build # 499 - Still Failing!

Posted by Apache Jenkins Server <je...@builds.apache.org>.
Build: https://ci-builds.apache.org/job/Solr/job/Solr-Test-10.x/499/

No tests ran.

Build Log:
[...truncated 168 lines...]
BUILD FAILED in 1m 25s
54 actionable tasks: 54 executed

Publishing build scan...
https://develocity.apache.org/s/xwadi5gg44qjs

Build step 'Invoke Gradle script' changed build result to FAILURE
Build step 'Invoke Gradle script' marked build as failure
Archiving artifacts
Recording test results
ERROR: Step ‘Publish JUnit test result report’ failed: No test report files were found. Configuration error?
Email was triggered for: Failure - Any
Sending email for trigger: Failure - Any