You are viewing a plain text version of this content. The canonical link for it is here.
Posted to builds@beam.apache.org by Apache Jenkins Server <je...@builds.apache.org> on 2023/05/07 06:43:41 UTC
Build failed in Jenkins: beam_PostCommit_Java_DataflowV2 #3010
See <https://ci-beam.apache.org/job/beam_PostCommit_Java_DataflowV2/3010/display/redirect>
Changes:
------------------------------------------
[...truncated 64.42 KB...]
+ go-licenses save github.com/apache/beam/sdks/v2/java/container --save_path=/output/licenses
W0507 03:58:53.076901 38 library.go:101] "golang.org/x/sys/unix" contains non-Go code that can't be inspected for further dependencies:
/go/pkg/mod/golang.org/x/sys@v0.5.0/unix/asm_linux_amd64.s
+ go-licenses csv github.com/apache/beam/sdks/v2/java/container
+ tee /output/licenses/list.csv
W0507 03:58:57.183171 83 library.go:101] "golang.org/x/sys/unix" contains non-Go code that can't be inspected for further dependencies:
/go/pkg/mod/golang.org/x/sys@v0.5.0/unix/asm_linux_amd64.s
github.com/apache/beam/sdks/v2/go/pkg/beam,https://github.com/apache/beam/blob/sdks/v2.46.0/sdks/go/README.md,Apache-2.0
github.com/apache/beam/sdks/v2/java/container,https://github.com/apache/beam/blob/sdks/v2.46.0/sdks/LICENSE,Apache-2.0
github.com/golang/protobuf,https://github.com/golang/protobuf/blob/v1.5.2/LICENSE,BSD-3-Clause
golang.org/x/net,https://cs.opensource.google/go/x/net/+/v0.5.0:LICENSE,BSD-3-Clause
golang.org/x/sys/unix,https://cs.opensource.google/go/x/sys/+/v0.5.0:LICENSE,BSD-3-Clause
golang.org/x/text,https://cs.opensource.google/go/x/text/+/v0.7.0:LICENSE,BSD-3-Clause
google.golang.org/genproto/googleapis/rpc/status,https://github.com/googleapis/go-genproto/blob/76db0878b65f/LICENSE,Apache-2.0
google.golang.org/grpc,https://github.com/grpc/grpc-go/blob/v1.52.3/LICENSE,Apache-2.0
google.golang.org/protobuf,https://github.com/protocolbuffers/protobuf-go/blob/v1.28.1/LICENSE,BSD-3-Clause
+ chmod -R a+w /output/licenses
> Task :release:go-licenses:java:createLicenses
> Task :sdks:java:container:java8:copyGolangLicenses
> Task :sdks:java:container:java8:dockerPrepare
> Task :sdks:java:container:java8:docker
#1 [internal] load build definition from Dockerfile
#1 transferring dockerfile: 2.58kB done
#1 DONE 0.0s
#2 [internal] load .dockerignore
#2 transferring context: 2B done
#2 DONE 0.0s
#3 [internal] load metadata for docker.io/library/eclipse-temurin:8
#3 DONE 0.3s
#4 [ 1/16] FROM docker.io/library/eclipse-temurin:8@sha256:a473a9395cb524db4e40f110da1b96f2b357937e9a8ffb56920f97b85de80967
#4 CACHED
#5 [internal] load build context
#5 transferring context: 46.96MB 0.4s done
#5 DONE 0.4s
#6 [ 2/16] ADD target/slf4j-api.jar /opt/apache/beam/jars/
#6 DONE 1.0s
#7 [ 3/16] ADD target/slf4j-jdk14.jar /opt/apache/beam/jars/
#7 DONE 0.1s
#8 [ 4/16] ADD target/jcl-over-slf4j.jar /opt/apache/beam/jars/
#8 DONE 0.1s
#9 [ 5/16] ADD target/log4j-over-slf4j.jar /opt/apache/beam/jars/
#9 DONE 0.1s
#10 [ 6/16] ADD target/log4j-to-slf4j.jar /opt/apache/beam/jars/
#10 DONE 0.1s
#11 [ 7/16] ADD target/beam-sdks-java-harness.jar /opt/apache/beam/jars/
#11 DONE 0.1s
#12 [ 8/16] COPY target/jamm.jar target/open-module-agent*.jar /opt/apache/beam/jars/
#12 DONE 0.1s
#13 [ 9/16] COPY target/linux_amd64/boot /opt/apache/beam/
#13 DONE 0.2s
#14 [10/16] COPY target/LICENSE /opt/apache/beam/
#14 DONE 0.0s
#15 [11/16] COPY target/NOTICE /opt/apache/beam/
#15 DONE 0.0s
#16 [12/16] ADD target/third_party_licenses /opt/apache/beam/third_party_licenses/
#16 DONE 0.2s
#17 [13/16] COPY target/LICENSE target/options/* /opt/apache/beam/options/
#17 DONE 0.1s
#18 [14/16] COPY target/go-licenses/* /opt/apache/beam/third_party_licenses/golang/
#18 DONE 0.1s
#19 [15/16] RUN if [ "true" = "false" ] ; then rm -rf /opt/apache/beam/third_party_licenses ; fi
#19 DONE 0.4s
#20 [16/16] COPY target/profiler/* /opt/google_cloud_profiler/
#20 DONE 0.1s
#21 exporting to image
#21 exporting layers
#21 exporting layers 0.2s done
#21 writing image sha256:f91a4ae047dc8c0db711f2b91e05ad1d49afcfe3fee3e44e176c8a9c4a4414d9 done
#21 naming to docker.io/apache/beam_java8_sdk:2.48.0.dev done
#21 DONE 0.2s
> Task :runners:google-cloud-dataflow-java:buildAndPushDockerJavaContainer
WARNING: `gcloud docker` will not be supported for Docker client versions above 18.03.
As an alternative, use `gcloud auth configure-docker` to configure `docker` to
use `gcloud` as a credential helper, then use `docker` as you would for non-GCR
registries, e.g. `docker pull gcr.io/project-id/my-image`. Add
`--verbosity=error` to silence this warning: `gcloud docker
--verbosity=error -- pull gcr.io/project-id/my-image`.
See: https://cloud.google.com/container-registry/docs/support/deprecation-notices#gcloud-docker
The push refers to repository [us.gcr.io/apache-beam-testing/java-postcommit-it/java]
8bb792055351: Preparing
5f70bf18a086: Preparing
776006c7d2a3: Preparing
c90169760d84: Preparing
d99bcc50f9b0: Preparing
303febc1189d: Preparing
c36ef18f5bc6: Preparing
f1e7b6ac8944: Preparing
9508c1c50e16: Preparing
66b363195c2e: Preparing
7bbe834dc0b0: Preparing
24c5e0e89b22: Preparing
8aa56a7e6213: Preparing
13783ab85ad3: Preparing
cb854060bdea: Preparing
3eb3677be944: Preparing
303febc1189d: Waiting
9091f97c3a30: Preparing
c45c46033aa8: Preparing
b8a36d10656a: Preparing
24c5e0e89b22: Waiting
8aa56a7e6213: Waiting
13783ab85ad3: Waiting
cb854060bdea: Waiting
c36ef18f5bc6: Waiting
f1e7b6ac8944: Waiting
3eb3677be944: Waiting
b8a36d10656a: Waiting
9508c1c50e16: Waiting
9091f97c3a30: Waiting
7bbe834dc0b0: Waiting
5f70bf18a086: Layer already exists
c90169760d84: Pushed
776006c7d2a3: Pushed
303febc1189d: Pushed
8bb792055351: Pushed
d99bcc50f9b0: Pushed
c36ef18f5bc6: Pushed
9508c1c50e16: Pushed
7bbe834dc0b0: Pushed
f1e7b6ac8944: Pushed
24c5e0e89b22: Pushed
66b363195c2e: Pushed
8aa56a7e6213: Pushed
3eb3677be944: Layer already exists
9091f97c3a30: Layer already exists
c45c46033aa8: Layer already exists
b8a36d10656a: Layer already exists
13783ab85ad3: Pushed
cb854060bdea: Pushed
20230507035739: digest: sha256:875c747279e7a7540679f244975dce0a7f5e6b0d604a89d2145a29b00f585dd3 size: 4296
> Task :runners:google-cloud-dataflow-java:coreSDKJavaRunnerV2IntegrationTest NO-SOURCE
> Task :runners:google-cloud-dataflow-java:examplesJavaRunnerV2IntegrationTest
***********************************************************
***********************************************************
**********************Set Up Pubsub************************
The Pub/Sub topic has been set up for this example: projects/apache-beam-testing/topics/testpipeline-jenkins-0507035919-a17151d8
The Pub/Sub subscription has been set up for this example: projects/apache-beam-testing/subscriptions/testpipeline-jenkins-0507035919-a17151d8
*************************Tear Down*************************
The Pub/Sub topic has been deleted: projects/apache-beam-testing/topics/testpipeline-jenkins-0507035919-a17151d8
The Pub/Sub subscription has been deleted: projects/apache-beam-testing/subscriptions/testpipeline-jenkins-0507035919-a17151d8
***********************************************************
***********************************************************
***********************************************************
***********************************************************
**********************Set Up Pubsub************************
The Pub/Sub topic has been set up for this example: projects/apache-beam-testing/topics/testpipeline-jenkins-0507035919-4038d4a3
The Pub/Sub subscription has been set up for this example: projects/apache-beam-testing/subscriptions/testpipeline-jenkins-0507035919-4038d4a3
*************************Tear Down*************************
The Pub/Sub topic has been deleted: projects/apache-beam-testing/topics/testpipeline-jenkins-0507035919-4038d4a3
The Pub/Sub subscription has been deleted: projects/apache-beam-testing/subscriptions/testpipeline-jenkins-0507035919-4038d4a3
***********************************************************
***********************************************************
> Task :runners:google-cloud-dataflow-java:googleCloudPlatformRunnerV2IntegrationTest
org.apache.beam.sdk.io.gcp.spanner.changestreams.it.SpannerChangeStreamOrderedWithinKeyGloballyIT > testOrderedWithinKey FAILED
java.lang.RuntimeException at SpannerChangeStreamOrderedWithinKeyGloballyIT.java:195
89 tests completed, 1 failed, 2 skipped
> Task :runners:google-cloud-dataflow-java:googleCloudPlatformRunnerV2IntegrationTest FAILED
> Task :runners:google-cloud-dataflow-java:cleanUpDockerJavaImages
Untagged: us.gcr.io/apache-beam-testing/java-postcommit-it/java:20230507035739
Untagged: us.gcr.io/apache-beam-testing/java-postcommit-it/java@sha256:875c747279e7a7540679f244975dce0a7f5e6b0d604a89d2145a29b00f585dd3
WARNING: Successfully resolved tag to sha256, but it is recommended to use sha256 directly.
Tag: [us.gcr.io/apache-beam-testing/java-postcommit-it/java:20230507035739]
- referencing digest: [us.gcr.io/apache-beam-testing/java-postcommit-it/java@sha256:875c747279e7a7540679f244975dce0a7f5e6b0d604a89d2145a29b00f585dd3]
Deleted [[us.gcr.io/apache-beam-testing/java-postcommit-it/java:20230507035739] (referencing [us.gcr.io/apache-beam-testing/java-postcommit-it/java@sha256:875c747279e7a7540679f244975dce0a7f5e6b0d604a89d2145a29b00f585dd3])].
Removing untagged image us.gcr.io/apache-beam-testing/java-postcommit-it/java@sha256:875c747279e7a7540679f244975dce0a7f5e6b0d604a89d2145a29b00f585dd3
Digests:
- us.gcr.io/apache-beam-testing/java-postcommit-it/java@sha256:875c747279e7a7540679f244975dce0a7f5e6b0d604a89d2145a29b00f585dd3
Deleted [us.gcr.io/apache-beam-testing/java-postcommit-it/java@sha256:875c747279e7a7540679f244975dce0a7f5e6b0d604a89d2145a29b00f585dd3].
FAILURE: Build failed with an exception.
* What went wrong:
Execution failed for task ':runners:google-cloud-dataflow-java:googleCloudPlatformRunnerV2IntegrationTest'.
> There were failing tests. See the report at: file://<https://ci-beam.apache.org/job/beam_PostCommit_Java_DataflowV2/ws/src/runners/google-cloud-dataflow-java/build/reports/tests/googleCloudPlatformRunnerV2IntegrationTest/index.html>
* Try:
> Run with --stacktrace option to get the stack trace.
> Run with --info or --debug option to get more log output.
* Get more help at https://help.gradle.org
Deprecated Gradle features were used in this build, making it incompatible with Gradle 8.0.
You can use '--warning-mode all' to show the individual deprecation warnings and determine if they come from your own scripts or plugins.
See https://docs.gradle.org/7.5.1/userguide/command_line_interface.html#sec:command_line_warnings
Execution optimizations have been disabled for 1 invalid unit(s) of work during this build to ensure correctness.
Please consult deprecation warnings for more details.
BUILD FAILED in 2h 46m 15s
152 actionable tasks: 98 executed, 50 from cache, 4 up-to-date
Build scan background action failed.
java.lang.IllegalArgumentException: com.gradle.enterprise.gradleplugin.internal.extension.a is not an interface
at java.lang.reflect.Proxy$ProxyClassFactory.apply(Proxy.java:590)
at java.lang.reflect.Proxy$ProxyClassFactory.apply(Proxy.java:557)
at java.lang.reflect.WeakCache$Factory.get(WeakCache.java:230)
at java.lang.reflect.WeakCache.get(WeakCache.java:127)
at java.lang.reflect.Proxy.getProxyClass0(Proxy.java:419)
at java.lang.reflect.Proxy.newProxyInstance(Proxy.java:719)
at com.gradle.ProxyFactory$ProxyingInvocationHandler.createLocalProxy(ProxyFactory.java:66)
at com.gradle.ProxyFactory$ProxyingInvocationHandler.lambda$adaptActionArg$1(ProxyFactory.java:61)
at com.gradle.enterprise.gradleplugin.internal.extension.b$3.run(SourceFile:100)
at java.util.concurrent.Executors$RunnableAdapter.call(Executors.java:511)
at java.util.concurrent.FutureTask.run(FutureTask.java:266)
at java.util.concurrent.ThreadPoolExecutor.runWorker(ThreadPoolExecutor.java:1149)
at java.util.concurrent.ThreadPoolExecutor$Worker.run(ThreadPoolExecutor.java:624)
at java.lang.Thread.run(Thread.java:750)
Publishing build scan...
https://ge.apache.org/s/hlx6ckarqibge
Build step 'Invoke Gradle script' changed build result to FAILURE
Build step 'Invoke Gradle script' marked build as failure
---------------------------------------------------------------------
To unsubscribe, e-mail: builds-unsubscribe@beam.apache.org
For additional commands, e-mail: builds-help@beam.apache.org
Jenkins build is back to normal : beam_PostCommit_Java_DataflowV2 #3011
Posted by Apache Jenkins Server <je...@builds.apache.org>.
See <https://ci-beam.apache.org/job/beam_PostCommit_Java_DataflowV2/3011/display/redirect>
---------------------------------------------------------------------
To unsubscribe, e-mail: builds-unsubscribe@beam.apache.org
For additional commands, e-mail: builds-help@beam.apache.org