You are viewing a plain text version of this content. The canonical link for it is here.
Posted to dev@cloudstack.apache.org by je...@cloudstack.org on 2014/10/01 22:15:05 UTC
Build failed in Jenkins: simulator-singlerun #485
See <http://jenkins.buildacloud.org/job/simulator-singlerun/485/changes>
Changes:
[Rohit Yadav] CLOUDSTACK-7664: [UI] Handle change in API response for listloadbalancer
------------------------------------------
[...truncated 8938 lines...]
[INFO] Final Memory: 44M/192M
[INFO] ------------------------------------------------------------------------
[WARNING] The requested profile "simulator" could not be activated because it does not exist.
[simulator-singlerun] $ mvn -P developer -pl developer -Ddeploydb-simulator
[INFO] Scanning for projects...
[INFO]
[INFO] ------------------------------------------------------------------------
[INFO] Building Apache CloudStack Developer Mode 4.5.0-SNAPSHOT
[INFO] ------------------------------------------------------------------------
[INFO]
[INFO] --- maven-checkstyle-plugin:2.11:check (cloudstack-checkstyle) @ cloud-developer ---
[INFO] Starting audit...
Audit done.
[INFO]
[INFO] --- properties-maven-plugin:1.0-alpha-2:read-project-properties (default) @ cloud-developer ---
[WARNING] Ignoring missing properties file: <http://jenkins.buildacloud.org/job/simulator-singlerun/ws/developer/../utils/conf/db.properties.override>
[INFO]
[INFO] --- maven-remote-resources-plugin:1.3:process (default) @ cloud-developer ---
[INFO]
[INFO] --- maven-antrun-plugin:1.7:run (default) @ cloud-developer ---
[INFO] Executing tasks
main:
[INFO] Executed tasks
[INFO]
[INFO] >>> exec-maven-plugin:1.2.1:java (create-schema-simulator) @ cloud-developer >>>
[INFO]
[INFO] --- maven-checkstyle-plugin:2.11:check (cloudstack-checkstyle) @ cloud-developer ---
[INFO] Starting audit...
Audit done.
[INFO]
[INFO] <<< exec-maven-plugin:1.2.1:java (create-schema-simulator) @ cloud-developer <<<
[INFO]
[INFO] --- exec-maven-plugin:1.2.1:java (create-schema-simulator) @ cloud-developer ---
log4j:WARN No appenders could be found for logger (org.springframework.core.env.StandardEnvironment).
log4j:WARN Please initialize the log4j system properly.
log4j:WARN See http://logging.apache.org/log4j/1.2/faq.html#noconfig for more info.
========> WARNING: Provided file does not exist: <http://jenkins.buildacloud.org/job/simulator-singlerun/ws/developer/../utils/conf/db.properties.override>
========> Initializing database=simulator with host=localhost port=3306 username=cloud password=cloud
============> Running query: drop database if exists `simulator`
============> Running query: create database `simulator`
============> Running query: GRANT ALL ON simulator.* to 'cloud'@`localhost` identified by 'cloud'
============> Running query: GRANT ALL ON simulator.* to 'cloud'@`%` identified by 'cloud'
========> Processing SQL file at <http://jenkins.buildacloud.org/job/simulator-singlerun/ws/developer/target/db/create-schema-simulator.sql>
========> Processing SQL file at <http://jenkins.buildacloud.org/job/simulator-singlerun/ws/developer/target/db/templates.simulator.sql>
========> Processing SQL file at <http://jenkins.buildacloud.org/job/simulator-singlerun/ws/developer/target/db/hypervisor_capabilities.simulator.sql>
========> Processing upgrade: com.cloud.upgrade.DatabaseUpgradeChecker
[INFO]
[INFO] --- maven-site-plugin:3.3:attach-descriptor (attach-descriptor) @ cloud-developer ---
[INFO]
[INFO] --- maven-install-plugin:2.3.1:install (default-install) @ cloud-developer ---
[INFO] Installing <http://jenkins.buildacloud.org/job/simulator-singlerun/ws/developer/pom.xml> to /var/lib/jenkins/.m2/repository/org/apache/cloudstack/cloud-developer/4.5.0-SNAPSHOT/cloud-developer-4.5.0-SNAPSHOT.pom
[INFO] ------------------------------------------------------------------------
[INFO] BUILD SUCCESS
[INFO] ------------------------------------------------------------------------
[INFO] Total time: 39.554s
[INFO] Finished at: Wed Oct 01 15:58:32 EDT 2014
[INFO] Final Memory: 43M/171M
[INFO] ------------------------------------------------------------------------
[simulator-singlerun] $ /bin/bash -x /tmp/hudson2342136899674022504.sh
+ jps -l
+ grep -q Launcher
+ echo ''
+ rm -rf /tmp/MarvinLogs
+ echo Check for initialization of the management server
Check for initialization of the management server
+ COUNTER=0
+ SERVER_PID=308
+ '[' 0 -lt 44 ']'
+ grep -q 'Management server node 127.0.0.1 is up' jetty-output.out
+ mvn -P systemvm,simulator -pl :cloud-client-ui jetty:run
+ sleep 5
+ COUNTER=1
+ '[' 1 -lt 44 ']'
+ grep -q 'Management server node 127.0.0.1 is up' jetty-output.out
+ sleep 5
+ COUNTER=2
+ '[' 2 -lt 44 ']'
+ grep -q 'Management server node 127.0.0.1 is up' jetty-output.out
+ sleep 5
+ COUNTER=3
+ '[' 3 -lt 44 ']'
+ grep -q 'Management server node 127.0.0.1 is up' jetty-output.out
+ sleep 5
+ COUNTER=4
+ '[' 4 -lt 44 ']'
+ grep -q 'Management server node 127.0.0.1 is up' jetty-output.out
+ sleep 5
+ COUNTER=5
+ '[' 5 -lt 44 ']'
+ grep -q 'Management server node 127.0.0.1 is up' jetty-output.out
+ sleep 5
+ COUNTER=6
+ '[' 6 -lt 44 ']'
+ grep -q 'Management server node 127.0.0.1 is up' jetty-output.out
+ sleep 5
+ COUNTER=7
+ '[' 7 -lt 44 ']'
+ grep -q 'Management server node 127.0.0.1 is up' jetty-output.out
+ sleep 5
+ COUNTER=8
+ '[' 8 -lt 44 ']'
+ grep -q 'Management server node 127.0.0.1 is up' jetty-output.out
+ sleep 5
+ COUNTER=9
+ '[' 9 -lt 44 ']'
+ grep -q 'Management server node 127.0.0.1 is up' jetty-output.out
+ sleep 5
+ COUNTER=10
+ '[' 10 -lt 44 ']'
+ grep -q 'Management server node 127.0.0.1 is up' jetty-output.out
+ sleep 5
+ COUNTER=11
+ '[' 11 -lt 44 ']'
+ grep -q 'Management server node 127.0.0.1 is up' jetty-output.out
+ sleep 5
+ COUNTER=12
+ '[' 12 -lt 44 ']'
+ grep -q 'Management server node 127.0.0.1 is up' jetty-output.out
+ sleep 5
+ COUNTER=13
+ '[' 13 -lt 44 ']'
+ grep -q 'Management server node 127.0.0.1 is up' jetty-output.out
+ sleep 5
+ COUNTER=14
+ '[' 14 -lt 44 ']'
+ grep -q 'Management server node 127.0.0.1 is up' jetty-output.out
+ sleep 5
+ COUNTER=15
+ '[' 15 -lt 44 ']'
+ grep -q 'Management server node 127.0.0.1 is up' jetty-output.out
+ sleep 5
+ COUNTER=16
+ '[' 16 -lt 44 ']'
+ grep -q 'Management server node 127.0.0.1 is up' jetty-output.out
+ sleep 5
+ COUNTER=17
+ '[' 17 -lt 44 ']'
+ grep -q 'Management server node 127.0.0.1 is up' jetty-output.out
+ sleep 5
+ COUNTER=18
+ '[' 18 -lt 44 ']'
+ grep -q 'Management server node 127.0.0.1 is up' jetty-output.out
+ sleep 5
+ COUNTER=19
+ '[' 19 -lt 44 ']'
+ grep -q 'Management server node 127.0.0.1 is up' jetty-output.out
+ sleep 5
+ COUNTER=20
+ '[' 20 -lt 44 ']'
+ grep -q 'Management server node 127.0.0.1 is up' jetty-output.out
+ sleep 5
+ COUNTER=21
+ '[' 21 -lt 44 ']'
+ grep -q 'Management server node 127.0.0.1 is up' jetty-output.out
+ sleep 5
+ COUNTER=22
+ '[' 22 -lt 44 ']'
+ grep -q 'Management server node 127.0.0.1 is up' jetty-output.out
+ sleep 5
+ COUNTER=23
+ '[' 23 -lt 44 ']'
+ grep -q 'Management server node 127.0.0.1 is up' jetty-output.out
+ sleep 5
+ COUNTER=24
+ '[' 24 -lt 44 ']'
+ grep -q 'Management server node 127.0.0.1 is up' jetty-output.out
+ sleep 5
+ COUNTER=25
+ '[' 25 -lt 44 ']'
+ grep -q 'Management server node 127.0.0.1 is up' jetty-output.out
+ sleep 5
+ COUNTER=26
+ '[' 26 -lt 44 ']'
+ grep -q 'Management server node 127.0.0.1 is up' jetty-output.out
+ sleep 5
+ COUNTER=27
+ '[' 27 -lt 44 ']'
+ grep -q 'Management server node 127.0.0.1 is up' jetty-output.out
+ sleep 5
+ COUNTER=28
+ '[' 28 -lt 44 ']'
+ grep -q 'Management server node 127.0.0.1 is up' jetty-output.out
+ sleep 5
+ COUNTER=29
+ '[' 29 -lt 44 ']'
+ grep -q 'Management server node 127.0.0.1 is up' jetty-output.out
+ break
+ grep -q 'Management server node 127.0.0.1 is up' jetty-output.out
+ echo Started OK pid 308
Started OK pid 308
+ sleep 20
+ export PYTHONPATH=<http://jenkins.buildacloud.org/job/simulator-singlerun/ws/tools/marvin>
+ PYTHONPATH=<http://jenkins.buildacloud.org/job/simulator-singlerun/ws/tools/marvin>
+ python2.6 tools/marvin/marvin/deployDataCenter.py -i setup/dev/advanced.cfg
/usr/lib/python2.6/site-packages/pycrypto-2.6-py2.6-linux-x86_64.egg/Crypto/Util/number.py:57: PowmInsecureWarning: Not using mpz_powm_sec. You should rebuild using libgmp >= 5 to avoid timing attack vulnerability.
_warn("Not using mpz_powm_sec. You should rebuild using libgmp >= 5 to avoid timing attack vulnerability.", PowmInsecureWarning)
==== Log Folder Path: /tmp//MarvinLogs//DeployDataCenter__Oct_01_2014_16_01_22_9SM5XS. All logs will be available here ====
==== Deploy DC Started ====
=== Data Center Settings are dumped to /tmp//MarvinLogs//DeployDataCenter__Oct_01_2014_16_01_22_9SM5XS/dc_entries.obj===
====Deploy DC Successful=====
+ sleep 60
+ /usr/local/bin/nosetests-2.7 -v --with-marvin --marvin-config=setup/dev/advanced.cfg --with-xunit --xunit-file=xunit.xml -a tags=advanced,required_hardware=false --zone=Sandbox-simulator --hypervisor=simulator -w test/integration/smoke
==== Marvin Init Started ====
=== Marvin Parse Config Successful ===
=== Marvin Setting TestData Successful===
==== Log Folder Path: /tmp//MarvinLogs//Oct_01_2014_16_05_10_VQCF55. All logs will be available here ====
=== Marvin Init Logging Successful===
==== Marvin Init Successful ====
+ mvn -P systemvm,simulator -pl :cloud-client-ui jetty:stop
[INFO] Scanning for projects...
[INFO]
[INFO] ------------------------------------------------------------------------
[INFO] Building Apache CloudStack Client UI 4.5.0-SNAPSHOT
[INFO] ------------------------------------------------------------------------
[INFO]
[INFO] --- maven-jetty-plugin:6.1.26:stop (default-cli) @ cloud-client-ui ---
[INFO] ------------------------------------------------------------------------
[INFO] BUILD SUCCESS
[INFO] ------------------------------------------------------------------------
[INFO] Total time: 5.551s
[INFO] Finished at: Wed Oct 01 16:14:50 EDT 2014
[INFO] Final Memory: 25M/121M
[INFO] ------------------------------------------------------------------------
+ sleep 10
+ kill -KILL 308
/tmp/hudson2342136899674022504.sh: line 44: kill: (308) - No such process
[locks-and-latches] Releasing all the locks
[locks-and-latches] All the locks released
[xUnit] [INFO] - Starting to record.
[xUnit] [INFO] - Processing JUnit
[xUnit] [INFO] - [JUnit] - 1 test report file(s) were found with the pattern 'xunit.xml' relative to '<http://jenkins.buildacloud.org/job/simulator-singlerun/ws/'> for the testing framework 'JUnit'.
[xUnit] [INFO] - Check 'Failed Tests' threshold.
[xUnit] [INFO] - The total number of tests for this category exceeds the specified 'failure' threshold value.
[xUnit] [INFO] - Setting the build status to FAILURE
[xUnit] [INFO] - Stopping recording.
Build step 'Publish xUnit test result report' changed build result to FAILURE
Jenkins build is back to normal : simulator-singlerun #493
Posted by je...@cloudstack.org.
See <http://jenkins.buildacloud.org/job/simulator-singlerun/493/changes>
Build failed in Jenkins: simulator-singlerun #492
Posted by je...@cloudstack.org.
See <http://jenkins.buildacloud.org/job/simulator-singlerun/492/>
------------------------------------------
[...truncated 8934 lines...]
========> Processing SQL file at <http://jenkins.buildacloud.org/job/simulator-singlerun/ws/developer/developer-prefill.sql>
========> Processing upgrade: com.cloud.upgrade.DatabaseUpgradeChecker
[INFO]
[INFO] --- maven-site-plugin:3.3:attach-descriptor (attach-descriptor) @ cloud-developer ---
[INFO]
[INFO] --- maven-install-plugin:2.3.1:install (default-install) @ cloud-developer ---
[INFO] Installing <http://jenkins.buildacloud.org/job/simulator-singlerun/ws/developer/pom.xml> to /var/lib/jenkins/.m2/repository/org/apache/cloudstack/cloud-developer/4.5.0-SNAPSHOT/cloud-developer-4.5.0-SNAPSHOT.pom
[INFO] ------------------------------------------------------------------------
[INFO] BUILD SUCCESS
[INFO] ------------------------------------------------------------------------
[INFO] Total time: 1:59.234s
[INFO] Finished at: Thu Oct 02 16:03:37 EDT 2014
[INFO] Final Memory: 42M/178M
[INFO] ------------------------------------------------------------------------
[WARNING] The requested profile "simulator" could not be activated because it does not exist.
[simulator-singlerun] $ mvn -P developer -pl developer -Ddeploydb-simulator
[INFO] Scanning for projects...
[INFO]
[INFO] ------------------------------------------------------------------------
[INFO] Building Apache CloudStack Developer Mode 4.5.0-SNAPSHOT
[INFO] ------------------------------------------------------------------------
[INFO]
[INFO] --- maven-checkstyle-plugin:2.11:check (cloudstack-checkstyle) @ cloud-developer ---
[INFO] Starting audit...
Audit done.
[INFO]
[INFO] --- properties-maven-plugin:1.0-alpha-2:read-project-properties (default) @ cloud-developer ---
[WARNING] Ignoring missing properties file: <http://jenkins.buildacloud.org/job/simulator-singlerun/ws/developer/../utils/conf/db.properties.override>
[INFO]
[INFO] --- maven-remote-resources-plugin:1.3:process (default) @ cloud-developer ---
[INFO]
[INFO] --- maven-antrun-plugin:1.7:run (default) @ cloud-developer ---
[INFO] Executing tasks
main:
[INFO] Executed tasks
[INFO]
[INFO] >>> exec-maven-plugin:1.2.1:java (create-schema-simulator) @ cloud-developer >>>
[INFO]
[INFO] --- maven-checkstyle-plugin:2.11:check (cloudstack-checkstyle) @ cloud-developer ---
[INFO] Starting audit...
Audit done.
[INFO]
[INFO] <<< exec-maven-plugin:1.2.1:java (create-schema-simulator) @ cloud-developer <<<
[INFO]
[INFO] --- exec-maven-plugin:1.2.1:java (create-schema-simulator) @ cloud-developer ---
log4j:WARN No appenders could be found for logger (org.springframework.core.env.StandardEnvironment).
log4j:WARN Please initialize the log4j system properly.
log4j:WARN See http://logging.apache.org/log4j/1.2/faq.html#noconfig for more info.
========> WARNING: Provided file does not exist: <http://jenkins.buildacloud.org/job/simulator-singlerun/ws/developer/../utils/conf/db.properties.override>
========> Initializing database=simulator with host=localhost port=3306 username=cloud password=cloud
============> Running query: drop database if exists `simulator`
============> Running query: create database `simulator`
============> Running query: GRANT ALL ON simulator.* to 'cloud'@`localhost` identified by 'cloud'
============> Running query: GRANT ALL ON simulator.* to 'cloud'@`%` identified by 'cloud'
========> Processing SQL file at <http://jenkins.buildacloud.org/job/simulator-singlerun/ws/developer/target/db/create-schema-simulator.sql>
========> Processing SQL file at <http://jenkins.buildacloud.org/job/simulator-singlerun/ws/developer/target/db/templates.simulator.sql>
========> Processing SQL file at <http://jenkins.buildacloud.org/job/simulator-singlerun/ws/developer/target/db/hypervisor_capabilities.simulator.sql>
========> Processing upgrade: com.cloud.upgrade.DatabaseUpgradeChecker
[INFO]
[INFO] --- maven-site-plugin:3.3:attach-descriptor (attach-descriptor) @ cloud-developer ---
[INFO]
[INFO] --- maven-install-plugin:2.3.1:install (default-install) @ cloud-developer ---
[INFO] Installing <http://jenkins.buildacloud.org/job/simulator-singlerun/ws/developer/pom.xml> to /var/lib/jenkins/.m2/repository/org/apache/cloudstack/cloud-developer/4.5.0-SNAPSHOT/cloud-developer-4.5.0-SNAPSHOT.pom
[INFO] ------------------------------------------------------------------------
[INFO] BUILD SUCCESS
[INFO] ------------------------------------------------------------------------
[INFO] Total time: 21.598s
[INFO] Finished at: Thu Oct 02 16:04:03 EDT 2014
[INFO] Final Memory: 41M/177M
[INFO] ------------------------------------------------------------------------
[simulator-singlerun] $ /bin/bash -x /tmp/hudson8617049623362444007.sh
+ jps -l
+ grep -q Launcher
+ echo ''
+ rm -rf /tmp/MarvinLogs
+ echo Check for initialization of the management server
Check for initialization of the management server
+ COUNTER=0
+ SERVER_PID=2284
+ mvn -P systemvm,simulator -pl :cloud-client-ui jetty:run
+ '[' 0 -lt 44 ']'
+ grep -q 'Management server node 127.0.0.1 is up' jetty-output.out
+ sleep 5
+ COUNTER=1
+ '[' 1 -lt 44 ']'
+ grep -q 'Management server node 127.0.0.1 is up' jetty-output.out
+ sleep 5
+ COUNTER=2
+ '[' 2 -lt 44 ']'
+ grep -q 'Management server node 127.0.0.1 is up' jetty-output.out
+ sleep 5
+ COUNTER=3
+ '[' 3 -lt 44 ']'
+ grep -q 'Management server node 127.0.0.1 is up' jetty-output.out
+ sleep 5
+ COUNTER=4
+ '[' 4 -lt 44 ']'
+ grep -q 'Management server node 127.0.0.1 is up' jetty-output.out
+ sleep 5
+ COUNTER=5
+ '[' 5 -lt 44 ']'
+ grep -q 'Management server node 127.0.0.1 is up' jetty-output.out
+ sleep 5
+ COUNTER=6
+ '[' 6 -lt 44 ']'
+ grep -q 'Management server node 127.0.0.1 is up' jetty-output.out
+ sleep 5
+ COUNTER=7
+ '[' 7 -lt 44 ']'
+ grep -q 'Management server node 127.0.0.1 is up' jetty-output.out
+ sleep 5
+ COUNTER=8
+ '[' 8 -lt 44 ']'
+ grep -q 'Management server node 127.0.0.1 is up' jetty-output.out
+ sleep 5
+ COUNTER=9
+ '[' 9 -lt 44 ']'
+ grep -q 'Management server node 127.0.0.1 is up' jetty-output.out
+ sleep 5
+ COUNTER=10
+ '[' 10 -lt 44 ']'
+ grep -q 'Management server node 127.0.0.1 is up' jetty-output.out
+ sleep 5
+ COUNTER=11
+ '[' 11 -lt 44 ']'
+ grep -q 'Management server node 127.0.0.1 is up' jetty-output.out
+ sleep 5
+ COUNTER=12
+ '[' 12 -lt 44 ']'
+ grep -q 'Management server node 127.0.0.1 is up' jetty-output.out
+ sleep 5
+ COUNTER=13
+ '[' 13 -lt 44 ']'
+ grep -q 'Management server node 127.0.0.1 is up' jetty-output.out
+ sleep 5
+ COUNTER=14
+ '[' 14 -lt 44 ']'
+ grep -q 'Management server node 127.0.0.1 is up' jetty-output.out
+ sleep 5
+ COUNTER=15
+ '[' 15 -lt 44 ']'
+ grep -q 'Management server node 127.0.0.1 is up' jetty-output.out
+ sleep 5
+ COUNTER=16
+ '[' 16 -lt 44 ']'
+ grep -q 'Management server node 127.0.0.1 is up' jetty-output.out
+ sleep 5
+ COUNTER=17
+ '[' 17 -lt 44 ']'
+ grep -q 'Management server node 127.0.0.1 is up' jetty-output.out
+ sleep 5
+ COUNTER=18
+ '[' 18 -lt 44 ']'
+ grep -q 'Management server node 127.0.0.1 is up' jetty-output.out
+ sleep 5
+ COUNTER=19
+ '[' 19 -lt 44 ']'
+ grep -q 'Management server node 127.0.0.1 is up' jetty-output.out
+ sleep 5
+ COUNTER=20
+ '[' 20 -lt 44 ']'
+ grep -q 'Management server node 127.0.0.1 is up' jetty-output.out
+ sleep 5
+ COUNTER=21
+ '[' 21 -lt 44 ']'
+ grep -q 'Management server node 127.0.0.1 is up' jetty-output.out
+ sleep 5
+ COUNTER=22
+ '[' 22 -lt 44 ']'
+ grep -q 'Management server node 127.0.0.1 is up' jetty-output.out
+ sleep 5
+ COUNTER=23
+ '[' 23 -lt 44 ']'
+ grep -q 'Management server node 127.0.0.1 is up' jetty-output.out
+ sleep 5
+ COUNTER=24
+ '[' 24 -lt 44 ']'
+ grep -q 'Management server node 127.0.0.1 is up' jetty-output.out
+ sleep 5
+ COUNTER=25
+ '[' 25 -lt 44 ']'
+ grep -q 'Management server node 127.0.0.1 is up' jetty-output.out
+ sleep 5
+ COUNTER=26
+ '[' 26 -lt 44 ']'
+ grep -q 'Management server node 127.0.0.1 is up' jetty-output.out
+ break
+ grep -q 'Management server node 127.0.0.1 is up' jetty-output.out
+ echo Started OK pid 2284
Started OK pid 2284
+ sleep 20
+ export PYTHONPATH=<http://jenkins.buildacloud.org/job/simulator-singlerun/ws/tools/marvin>
+ PYTHONPATH=<http://jenkins.buildacloud.org/job/simulator-singlerun/ws/tools/marvin>
+ python2.6 tools/marvin/marvin/deployDataCenter.py -i setup/dev/advanced.cfg
/usr/lib/python2.6/site-packages/pycrypto-2.6-py2.6-linux-x86_64.egg/Crypto/Util/number.py:57: PowmInsecureWarning: Not using mpz_powm_sec. You should rebuild using libgmp >= 5 to avoid timing attack vulnerability.
_warn("Not using mpz_powm_sec. You should rebuild using libgmp >= 5 to avoid timing attack vulnerability.", PowmInsecureWarning)
==== Log Folder Path: /tmp//MarvinLogs//DeployDataCenter__Oct_02_2014_16_06_38_V1JCDH. All logs will be available here ====
==== Deploy DC Started ====
=== Data Center Settings are dumped to /tmp//MarvinLogs//DeployDataCenter__Oct_02_2014_16_06_38_V1JCDH/dc_entries.obj===
====Deploy DC Successful=====
+ sleep 60
+ /usr/local/bin/nosetests-2.7 -v --with-marvin --marvin-config=setup/dev/advanced.cfg --with-xunit --xunit-file=xunit.xml -a tags=advanced,required_hardware=false --zone=Sandbox-simulator --hypervisor=simulator -w test/integration/smoke
==== Marvin Init Started ====
=== Marvin Parse Config Successful ===
=== Marvin Setting TestData Successful===
==== Log Folder Path: /tmp//MarvinLogs//Oct_02_2014_16_10_36_BC51AS. All logs will be available here ====
=== Marvin Init Logging Successful===
==== Marvin Init Successful ====
+ mvn -P systemvm,simulator -pl :cloud-client-ui jetty:stop
[INFO] Scanning for projects...
[INFO]
[INFO] ------------------------------------------------------------------------
[INFO] Building Apache CloudStack Client UI 4.5.0-SNAPSHOT
[INFO] ------------------------------------------------------------------------
[INFO]
[INFO] --- maven-jetty-plugin:6.1.26:stop (default-cli) @ cloud-client-ui ---
[INFO] ------------------------------------------------------------------------
[INFO] BUILD SUCCESS
[INFO] ------------------------------------------------------------------------
[INFO] Total time: 5.821s
[INFO] Finished at: Thu Oct 02 16:20:16 EDT 2014
[INFO] Final Memory: 25M/148M
[INFO] ------------------------------------------------------------------------
+ sleep 10
+ kill -KILL 2284
/tmp/hudson8617049623362444007.sh: line 44: kill: (2284) - No such process
[locks-and-latches] Releasing all the locks
[locks-and-latches] All the locks released
[xUnit] [INFO] - Starting to record.
[xUnit] [INFO] - Processing JUnit
[xUnit] [INFO] - [JUnit] - 1 test report file(s) were found with the pattern 'xunit.xml' relative to '<http://jenkins.buildacloud.org/job/simulator-singlerun/ws/'> for the testing framework 'JUnit'.
[xUnit] [INFO] - Check 'Failed Tests' threshold.
[xUnit] [INFO] - The total number of tests for this category exceeds the specified 'failure' threshold value.
[xUnit] [INFO] - Setting the build status to FAILURE
[xUnit] [INFO] - Stopping recording.
Build step 'Publish xUnit test result report' changed build result to FAILURE
Build failed in Jenkins: simulator-singlerun #491
Posted by je...@cloudstack.org.
See <http://jenkins.buildacloud.org/job/simulator-singlerun/491/changes>
Changes:
[amogh.vasekar] Remove adding implicit tags in DB schema so that management server starts, original commit 39fe766c2b6fb6edd4c1 needs review
------------------------------------------
[...truncated 8956 lines...]
[WARNING] Ignoring missing properties file: <http://jenkins.buildacloud.org/job/simulator-singlerun/ws/developer/../utils/conf/db.properties.override>
[INFO]
[INFO] --- maven-remote-resources-plugin:1.3:process (default) @ cloud-developer ---
[INFO]
[INFO] --- maven-antrun-plugin:1.7:run (default) @ cloud-developer ---
[INFO] Executing tasks
main:
[INFO] Executed tasks
[INFO]
[INFO] >>> exec-maven-plugin:1.2.1:java (create-schema-simulator) @ cloud-developer >>>
[INFO]
[INFO] --- maven-checkstyle-plugin:2.11:check (cloudstack-checkstyle) @ cloud-developer ---
[INFO] Starting audit...
Audit done.
[INFO]
[INFO] <<< exec-maven-plugin:1.2.1:java (create-schema-simulator) @ cloud-developer <<<
[INFO]
[INFO] --- exec-maven-plugin:1.2.1:java (create-schema-simulator) @ cloud-developer ---
log4j:WARN No appenders could be found for logger (org.springframework.core.env.StandardEnvironment).
log4j:WARN Please initialize the log4j system properly.
log4j:WARN See http://logging.apache.org/log4j/1.2/faq.html#noconfig for more info.
========> WARNING: Provided file does not exist: <http://jenkins.buildacloud.org/job/simulator-singlerun/ws/developer/../utils/conf/db.properties.override>
========> Initializing database=simulator with host=localhost port=3306 username=cloud password=cloud
============> Running query: drop database if exists `simulator`
============> Running query: create database `simulator`
============> Running query: GRANT ALL ON simulator.* to 'cloud'@`localhost` identified by 'cloud'
============> Running query: GRANT ALL ON simulator.* to 'cloud'@`%` identified by 'cloud'
========> Processing SQL file at <http://jenkins.buildacloud.org/job/simulator-singlerun/ws/developer/target/db/create-schema-simulator.sql>
========> Processing SQL file at <http://jenkins.buildacloud.org/job/simulator-singlerun/ws/developer/target/db/templates.simulator.sql>
========> Processing SQL file at <http://jenkins.buildacloud.org/job/simulator-singlerun/ws/developer/target/db/hypervisor_capabilities.simulator.sql>
========> Processing upgrade: com.cloud.upgrade.DatabaseUpgradeChecker
[INFO]
[INFO] --- maven-site-plugin:3.3:attach-descriptor (attach-descriptor) @ cloud-developer ---
[INFO]
[INFO] --- maven-install-plugin:2.3.1:install (default-install) @ cloud-developer ---
[INFO] Installing <http://jenkins.buildacloud.org/job/simulator-singlerun/ws/developer/pom.xml> to /var/lib/jenkins/.m2/repository/org/apache/cloudstack/cloud-developer/4.5.0-SNAPSHOT/cloud-developer-4.5.0-SNAPSHOT.pom
[INFO] ------------------------------------------------------------------------
[INFO] BUILD SUCCESS
[INFO] ------------------------------------------------------------------------
[INFO] Total time: 21.584s
[INFO] Finished at: Thu Oct 02 15:30:43 EDT 2014
[INFO] Final Memory: 42M/199M
[INFO] ------------------------------------------------------------------------
[simulator-singlerun] $ /bin/bash -x /tmp/hudson7022483728646878232.sh
+ jps -l
+ grep -q Launcher
+ echo ''
+ rm -rf /tmp/MarvinLogs
+ echo Check for initialization of the management server
Check for initialization of the management server
+ COUNTER=0
+ SERVER_PID=27688
+ mvn -P systemvm,simulator -pl :cloud-client-ui jetty:run
+ '[' 0 -lt 44 ']'
+ grep -q 'Management server node 127.0.0.1 is up' jetty-output.out
+ sleep 5
+ COUNTER=1
+ '[' 1 -lt 44 ']'
+ grep -q 'Management server node 127.0.0.1 is up' jetty-output.out
+ sleep 5
+ COUNTER=2
+ '[' 2 -lt 44 ']'
+ grep -q 'Management server node 127.0.0.1 is up' jetty-output.out
+ sleep 5
+ COUNTER=3
+ '[' 3 -lt 44 ']'
+ grep -q 'Management server node 127.0.0.1 is up' jetty-output.out
+ sleep 5
+ COUNTER=4
+ '[' 4 -lt 44 ']'
+ grep -q 'Management server node 127.0.0.1 is up' jetty-output.out
+ sleep 5
+ COUNTER=5
+ '[' 5 -lt 44 ']'
+ grep -q 'Management server node 127.0.0.1 is up' jetty-output.out
+ sleep 5
+ COUNTER=6
+ '[' 6 -lt 44 ']'
+ grep -q 'Management server node 127.0.0.1 is up' jetty-output.out
+ sleep 5
+ COUNTER=7
+ '[' 7 -lt 44 ']'
+ grep -q 'Management server node 127.0.0.1 is up' jetty-output.out
+ sleep 5
+ COUNTER=8
+ '[' 8 -lt 44 ']'
+ grep -q 'Management server node 127.0.0.1 is up' jetty-output.out
+ sleep 5
+ COUNTER=9
+ '[' 9 -lt 44 ']'
+ grep -q 'Management server node 127.0.0.1 is up' jetty-output.out
+ sleep 5
+ COUNTER=10
+ '[' 10 -lt 44 ']'
+ grep -q 'Management server node 127.0.0.1 is up' jetty-output.out
+ sleep 5
+ COUNTER=11
+ '[' 11 -lt 44 ']'
+ grep -q 'Management server node 127.0.0.1 is up' jetty-output.out
+ sleep 5
+ COUNTER=12
+ '[' 12 -lt 44 ']'
+ grep -q 'Management server node 127.0.0.1 is up' jetty-output.out
+ sleep 5
+ COUNTER=13
+ '[' 13 -lt 44 ']'
+ grep -q 'Management server node 127.0.0.1 is up' jetty-output.out
+ sleep 5
+ COUNTER=14
+ '[' 14 -lt 44 ']'
+ grep -q 'Management server node 127.0.0.1 is up' jetty-output.out
+ sleep 5
+ COUNTER=15
+ '[' 15 -lt 44 ']'
+ grep -q 'Management server node 127.0.0.1 is up' jetty-output.out
+ sleep 5
+ COUNTER=16
+ '[' 16 -lt 44 ']'
+ grep -q 'Management server node 127.0.0.1 is up' jetty-output.out
+ sleep 5
+ COUNTER=17
+ '[' 17 -lt 44 ']'
+ grep -q 'Management server node 127.0.0.1 is up' jetty-output.out
+ sleep 5
+ COUNTER=18
+ '[' 18 -lt 44 ']'
+ grep -q 'Management server node 127.0.0.1 is up' jetty-output.out
+ sleep 5
+ COUNTER=19
+ '[' 19 -lt 44 ']'
+ grep -q 'Management server node 127.0.0.1 is up' jetty-output.out
+ sleep 5
+ COUNTER=20
+ '[' 20 -lt 44 ']'
+ grep -q 'Management server node 127.0.0.1 is up' jetty-output.out
+ sleep 5
+ COUNTER=21
+ '[' 21 -lt 44 ']'
+ grep -q 'Management server node 127.0.0.1 is up' jetty-output.out
+ sleep 5
+ COUNTER=22
+ '[' 22 -lt 44 ']'
+ grep -q 'Management server node 127.0.0.1 is up' jetty-output.out
+ sleep 5
+ COUNTER=23
+ '[' 23 -lt 44 ']'
+ grep -q 'Management server node 127.0.0.1 is up' jetty-output.out
+ sleep 5
+ COUNTER=24
+ '[' 24 -lt 44 ']'
+ grep -q 'Management server node 127.0.0.1 is up' jetty-output.out
+ sleep 5
+ COUNTER=25
+ '[' 25 -lt 44 ']'
+ grep -q 'Management server node 127.0.0.1 is up' jetty-output.out
+ sleep 5
+ COUNTER=26
+ '[' 26 -lt 44 ']'
+ grep -q 'Management server node 127.0.0.1 is up' jetty-output.out
+ sleep 5
+ COUNTER=27
+ '[' 27 -lt 44 ']'
+ grep -q 'Management server node 127.0.0.1 is up' jetty-output.out
+ sleep 5
+ COUNTER=28
+ '[' 28 -lt 44 ']'
+ grep -q 'Management server node 127.0.0.1 is up' jetty-output.out
+ sleep 5
+ COUNTER=29
+ '[' 29 -lt 44 ']'
+ grep -q 'Management server node 127.0.0.1 is up' jetty-output.out
+ sleep 5
+ COUNTER=30
+ '[' 30 -lt 44 ']'
+ grep -q 'Management server node 127.0.0.1 is up' jetty-output.out
+ sleep 5
+ COUNTER=31
+ '[' 31 -lt 44 ']'
+ grep -q 'Management server node 127.0.0.1 is up' jetty-output.out
+ sleep 5
+ COUNTER=32
+ '[' 32 -lt 44 ']'
+ grep -q 'Management server node 127.0.0.1 is up' jetty-output.out
+ sleep 5
+ COUNTER=33
+ '[' 33 -lt 44 ']'
+ grep -q 'Management server node 127.0.0.1 is up' jetty-output.out
+ break
+ grep -q 'Management server node 127.0.0.1 is up' jetty-output.out
+ echo Started OK pid 27688
Started OK pid 27688
+ sleep 20
+ export PYTHONPATH=<http://jenkins.buildacloud.org/job/simulator-singlerun/ws/tools/marvin>
+ PYTHONPATH=<http://jenkins.buildacloud.org/job/simulator-singlerun/ws/tools/marvin>
+ python2.6 tools/marvin/marvin/deployDataCenter.py -i setup/dev/advanced.cfg
/usr/lib/python2.6/site-packages/pycrypto-2.6-py2.6-linux-x86_64.egg/Crypto/Util/number.py:57: PowmInsecureWarning: Not using mpz_powm_sec. You should rebuild using libgmp >= 5 to avoid timing attack vulnerability.
_warn("Not using mpz_powm_sec. You should rebuild using libgmp >= 5 to avoid timing attack vulnerability.", PowmInsecureWarning)
==== Log Folder Path: /tmp//MarvinLogs//DeployDataCenter__Oct_02_2014_15_33_53_2IZ8UK. All logs will be available here ====
==== Deploy DC Started ====
=== Data Center Settings are dumped to /tmp//MarvinLogs//DeployDataCenter__Oct_02_2014_15_33_53_2IZ8UK/dc_entries.obj===
====Deploy DC Successful=====
+ sleep 60
+ /usr/local/bin/nosetests-2.7 -v --with-marvin --marvin-config=setup/dev/advanced.cfg --with-xunit --xunit-file=xunit.xml -a tags=advanced,required_hardware=false --zone=Sandbox-simulator --hypervisor=simulator -w test/integration/smoke
==== Marvin Init Started ====
=== Marvin Parse Config Successful ===
=== Marvin Setting TestData Successful===
==== Log Folder Path: /tmp//MarvinLogs//Oct_02_2014_15_37_57_L547HK. All logs will be available here ====
=== Marvin Init Logging Successful===
==== Marvin Init Successful ====
+ mvn -P systemvm,simulator -pl :cloud-client-ui jetty:stop
[INFO] Scanning for projects...
[INFO]
[INFO] ------------------------------------------------------------------------
[INFO] Building Apache CloudStack Client UI 4.5.0-SNAPSHOT
[INFO] ------------------------------------------------------------------------
[INFO]
[INFO] --- maven-jetty-plugin:6.1.26:stop (default-cli) @ cloud-client-ui ---
[INFO] ------------------------------------------------------------------------
[INFO] BUILD SUCCESS
[INFO] ------------------------------------------------------------------------
[INFO] Total time: 5.823s
[INFO] Finished at: Thu Oct 02 15:47:36 EDT 2014
[INFO] Final Memory: 25M/126M
[INFO] ------------------------------------------------------------------------
+ sleep 10
+ kill -KILL 27688
/tmp/hudson7022483728646878232.sh: line 44: kill: (27688) - No such process
[locks-and-latches] Releasing all the locks
[locks-and-latches] All the locks released
[xUnit] [INFO] - Starting to record.
[xUnit] [INFO] - Processing JUnit
[xUnit] [INFO] - [JUnit] - 1 test report file(s) were found with the pattern 'xunit.xml' relative to '<http://jenkins.buildacloud.org/job/simulator-singlerun/ws/'> for the testing framework 'JUnit'.
[xUnit] [INFO] - Check 'Failed Tests' threshold.
[xUnit] [INFO] - The total number of tests for this category exceeds the specified 'failure' threshold value.
[xUnit] [INFO] - Setting the build status to FAILURE
[xUnit] [INFO] - Stopping recording.
Build step 'Publish xUnit test result report' changed build result to FAILURE
Build failed in Jenkins: simulator-singlerun #490
Posted by je...@cloudstack.org.
See <http://jenkins.buildacloud.org/job/simulator-singlerun/490/changes>
Changes:
[brian.federle] CLOUDSTACK-7645: [UI] Fixing incorrect labels, including instances of "???label.*???"
------------------------------------------
[...truncated 8930 lines...]
[INFO]
[INFO] --- maven-install-plugin:2.3.1:install (default-install) @ cloud-developer ---
[INFO] Installing <http://jenkins.buildacloud.org/job/simulator-singlerun/ws/developer/pom.xml> to /var/lib/jenkins/.m2/repository/org/apache/cloudstack/cloud-developer/4.5.0-SNAPSHOT/cloud-developer-4.5.0-SNAPSHOT.pom
[INFO] ------------------------------------------------------------------------
[INFO] BUILD SUCCESS
[INFO] ------------------------------------------------------------------------
[INFO] Total time: 2:07.608s
[INFO] Finished at: Thu Oct 02 14:28:51 EDT 2014
[INFO] Final Memory: 42M/159M
[INFO] ------------------------------------------------------------------------
[WARNING] The requested profile "simulator" could not be activated because it does not exist.
[simulator-singlerun] $ mvn -P developer -pl developer -Ddeploydb-simulator
[INFO] Scanning for projects...
[INFO]
[INFO] ------------------------------------------------------------------------
[INFO] Building Apache CloudStack Developer Mode 4.5.0-SNAPSHOT
[INFO] ------------------------------------------------------------------------
[INFO]
[INFO] --- maven-checkstyle-plugin:2.11:check (cloudstack-checkstyle) @ cloud-developer ---
[INFO] Starting audit...
Audit done.
[INFO]
[INFO] --- properties-maven-plugin:1.0-alpha-2:read-project-properties (default) @ cloud-developer ---
[WARNING] Ignoring missing properties file: <http://jenkins.buildacloud.org/job/simulator-singlerun/ws/developer/../utils/conf/db.properties.override>
[INFO]
[INFO] --- maven-remote-resources-plugin:1.3:process (default) @ cloud-developer ---
[INFO]
[INFO] --- maven-antrun-plugin:1.7:run (default) @ cloud-developer ---
[INFO] Executing tasks
main:
[INFO] Executed tasks
[INFO]
[INFO] >>> exec-maven-plugin:1.2.1:java (create-schema-simulator) @ cloud-developer >>>
[INFO]
[INFO] --- maven-checkstyle-plugin:2.11:check (cloudstack-checkstyle) @ cloud-developer ---
[INFO] Starting audit...
Audit done.
[INFO]
[INFO] <<< exec-maven-plugin:1.2.1:java (create-schema-simulator) @ cloud-developer <<<
[INFO]
[INFO] --- exec-maven-plugin:1.2.1:java (create-schema-simulator) @ cloud-developer ---
log4j:WARN No appenders could be found for logger (org.springframework.core.env.StandardEnvironment).
log4j:WARN Please initialize the log4j system properly.
log4j:WARN See http://logging.apache.org/log4j/1.2/faq.html#noconfig for more info.
========> WARNING: Provided file does not exist: <http://jenkins.buildacloud.org/job/simulator-singlerun/ws/developer/../utils/conf/db.properties.override>
========> Initializing database=simulator with host=localhost port=3306 username=cloud password=cloud
============> Running query: drop database if exists `simulator`
============> Running query: create database `simulator`
============> Running query: GRANT ALL ON simulator.* to 'cloud'@`localhost` identified by 'cloud'
============> Running query: GRANT ALL ON simulator.* to 'cloud'@`%` identified by 'cloud'
========> Processing SQL file at <http://jenkins.buildacloud.org/job/simulator-singlerun/ws/developer/target/db/create-schema-simulator.sql>
========> Processing SQL file at <http://jenkins.buildacloud.org/job/simulator-singlerun/ws/developer/target/db/templates.simulator.sql>
========> Processing SQL file at <http://jenkins.buildacloud.org/job/simulator-singlerun/ws/developer/target/db/hypervisor_capabilities.simulator.sql>
========> Processing upgrade: com.cloud.upgrade.DatabaseUpgradeChecker
[INFO]
[INFO] --- maven-site-plugin:3.3:attach-descriptor (attach-descriptor) @ cloud-developer ---
[INFO]
[INFO] --- maven-install-plugin:2.3.1:install (default-install) @ cloud-developer ---
[INFO] Installing <http://jenkins.buildacloud.org/job/simulator-singlerun/ws/developer/pom.xml> to /var/lib/jenkins/.m2/repository/org/apache/cloudstack/cloud-developer/4.5.0-SNAPSHOT/cloud-developer-4.5.0-SNAPSHOT.pom
[INFO] ------------------------------------------------------------------------
[INFO] BUILD SUCCESS
[INFO] ------------------------------------------------------------------------
[INFO] Total time: 19.374s
[INFO] Finished at: Thu Oct 02 14:29:14 EDT 2014
[INFO] Final Memory: 42M/214M
[INFO] ------------------------------------------------------------------------
[simulator-singlerun] $ /bin/bash -x /tmp/hudson1062181153607551296.sh
+ jps -l
+ grep -q Launcher
+ echo ''
+ rm -rf /tmp/MarvinLogs
+ echo Check for initialization of the management server
Check for initialization of the management server
+ COUNTER=0
+ SERVER_PID=20626
+ mvn -P systemvm,simulator -pl :cloud-client-ui jetty:run
+ '[' 0 -lt 44 ']'
+ grep -q 'Management server node 127.0.0.1 is up' jetty-output.out
+ sleep 5
+ COUNTER=1
+ '[' 1 -lt 44 ']'
+ grep -q 'Management server node 127.0.0.1 is up' jetty-output.out
+ sleep 5
+ COUNTER=2
+ '[' 2 -lt 44 ']'
+ grep -q 'Management server node 127.0.0.1 is up' jetty-output.out
+ sleep 5
+ COUNTER=3
+ '[' 3 -lt 44 ']'
+ grep -q 'Management server node 127.0.0.1 is up' jetty-output.out
+ sleep 5
+ COUNTER=4
+ '[' 4 -lt 44 ']'
+ grep -q 'Management server node 127.0.0.1 is up' jetty-output.out
+ sleep 5
+ COUNTER=5
+ '[' 5 -lt 44 ']'
+ grep -q 'Management server node 127.0.0.1 is up' jetty-output.out
+ sleep 5
+ COUNTER=6
+ '[' 6 -lt 44 ']'
+ grep -q 'Management server node 127.0.0.1 is up' jetty-output.out
+ sleep 5
+ COUNTER=7
+ '[' 7 -lt 44 ']'
+ grep -q 'Management server node 127.0.0.1 is up' jetty-output.out
+ sleep 5
+ COUNTER=8
+ '[' 8 -lt 44 ']'
+ grep -q 'Management server node 127.0.0.1 is up' jetty-output.out
+ sleep 5
+ COUNTER=9
+ '[' 9 -lt 44 ']'
+ grep -q 'Management server node 127.0.0.1 is up' jetty-output.out
+ sleep 5
+ COUNTER=10
+ '[' 10 -lt 44 ']'
+ grep -q 'Management server node 127.0.0.1 is up' jetty-output.out
+ sleep 5
+ COUNTER=11
+ '[' 11 -lt 44 ']'
+ grep -q 'Management server node 127.0.0.1 is up' jetty-output.out
+ sleep 5
+ COUNTER=12
+ '[' 12 -lt 44 ']'
+ grep -q 'Management server node 127.0.0.1 is up' jetty-output.out
+ sleep 5
+ COUNTER=13
+ '[' 13 -lt 44 ']'
+ grep -q 'Management server node 127.0.0.1 is up' jetty-output.out
+ sleep 5
+ COUNTER=14
+ '[' 14 -lt 44 ']'
+ grep -q 'Management server node 127.0.0.1 is up' jetty-output.out
+ sleep 5
+ COUNTER=15
+ '[' 15 -lt 44 ']'
+ grep -q 'Management server node 127.0.0.1 is up' jetty-output.out
+ sleep 5
+ COUNTER=16
+ '[' 16 -lt 44 ']'
+ grep -q 'Management server node 127.0.0.1 is up' jetty-output.out
+ sleep 5
+ COUNTER=17
+ '[' 17 -lt 44 ']'
+ grep -q 'Management server node 127.0.0.1 is up' jetty-output.out
+ sleep 5
+ COUNTER=18
+ '[' 18 -lt 44 ']'
+ grep -q 'Management server node 127.0.0.1 is up' jetty-output.out
+ sleep 5
+ COUNTER=19
+ '[' 19 -lt 44 ']'
+ grep -q 'Management server node 127.0.0.1 is up' jetty-output.out
+ sleep 5
+ COUNTER=20
+ '[' 20 -lt 44 ']'
+ grep -q 'Management server node 127.0.0.1 is up' jetty-output.out
+ sleep 5
+ COUNTER=21
+ '[' 21 -lt 44 ']'
+ grep -q 'Management server node 127.0.0.1 is up' jetty-output.out
+ sleep 5
+ COUNTER=22
+ '[' 22 -lt 44 ']'
+ grep -q 'Management server node 127.0.0.1 is up' jetty-output.out
+ sleep 5
+ COUNTER=23
+ '[' 23 -lt 44 ']'
+ grep -q 'Management server node 127.0.0.1 is up' jetty-output.out
+ sleep 5
+ COUNTER=24
+ '[' 24 -lt 44 ']'
+ grep -q 'Management server node 127.0.0.1 is up' jetty-output.out
+ sleep 5
+ COUNTER=25
+ '[' 25 -lt 44 ']'
+ grep -q 'Management server node 127.0.0.1 is up' jetty-output.out
+ sleep 5
+ COUNTER=26
+ '[' 26 -lt 44 ']'
+ grep -q 'Management server node 127.0.0.1 is up' jetty-output.out
+ sleep 5
+ COUNTER=27
+ '[' 27 -lt 44 ']'
+ grep -q 'Management server node 127.0.0.1 is up' jetty-output.out
+ break
+ grep -q 'Management server node 127.0.0.1 is up' jetty-output.out
+ echo Started OK pid 20626
Started OK pid 20626
+ sleep 20
+ export PYTHONPATH=<http://jenkins.buildacloud.org/job/simulator-singlerun/ws/tools/marvin>
+ PYTHONPATH=<http://jenkins.buildacloud.org/job/simulator-singlerun/ws/tools/marvin>
+ python2.6 tools/marvin/marvin/deployDataCenter.py -i setup/dev/advanced.cfg
/usr/lib/python2.6/site-packages/pycrypto-2.6-py2.6-linux-x86_64.egg/Crypto/Util/number.py:57: PowmInsecureWarning: Not using mpz_powm_sec. You should rebuild using libgmp >= 5 to avoid timing attack vulnerability.
_warn("Not using mpz_powm_sec. You should rebuild using libgmp >= 5 to avoid timing attack vulnerability.", PowmInsecureWarning)
==== Log Folder Path: /tmp//MarvinLogs//DeployDataCenter__Oct_02_2014_14_31_55_573PPH. All logs will be available here ====
==== Deploy DC Started ====
=== Data Center Settings are dumped to /tmp//MarvinLogs//DeployDataCenter__Oct_02_2014_14_31_55_573PPH/dc_entries.obj===
====Deploy DC Successful=====
+ sleep 60
+ /usr/local/bin/nosetests-2.7 -v --with-marvin --marvin-config=setup/dev/advanced.cfg --with-xunit --xunit-file=xunit.xml -a tags=advanced,required_hardware=false --zone=Sandbox-simulator --hypervisor=simulator -w test/integration/smoke
==== Marvin Init Started ====
=== Marvin Parse Config Successful ===
=== Marvin Setting TestData Successful===
==== Log Folder Path: /tmp//MarvinLogs//Oct_02_2014_14_35_49_0DAQN7. All logs will be available here ====
=== Marvin Init Logging Successful===
==== Marvin Init Successful ====
+ mvn -P systemvm,simulator -pl :cloud-client-ui jetty:stop
[INFO] Scanning for projects...
[INFO]
[INFO] ------------------------------------------------------------------------
[INFO] Building Apache CloudStack Client UI 4.5.0-SNAPSHOT
[INFO] ------------------------------------------------------------------------
[INFO]
[INFO] --- maven-jetty-plugin:6.1.26:stop (default-cli) @ cloud-client-ui ---
[INFO] ------------------------------------------------------------------------
[INFO] BUILD SUCCESS
[INFO] ------------------------------------------------------------------------
[INFO] Total time: 7.271s
[INFO] Finished at: Thu Oct 02 14:45:36 EDT 2014
[INFO] Final Memory: 25M/121M
[INFO] ------------------------------------------------------------------------
+ sleep 10
+ kill -KILL 20626
/tmp/hudson1062181153607551296.sh: line 44: kill: (20626) - No such process
[locks-and-latches] Releasing all the locks
[locks-and-latches] All the locks released
[xUnit] [INFO] - Starting to record.
[xUnit] [INFO] - Processing JUnit
[xUnit] [INFO] - [JUnit] - 1 test report file(s) were found with the pattern 'xunit.xml' relative to '<http://jenkins.buildacloud.org/job/simulator-singlerun/ws/'> for the testing framework 'JUnit'.
[xUnit] [INFO] - Check 'Failed Tests' threshold.
[xUnit] [INFO] - The total number of tests for this category exceeds the specified 'failure' threshold value.
[xUnit] [INFO] - Setting the build status to FAILURE
[xUnit] [INFO] - Stopping recording.
Build step 'Publish xUnit test result report' changed build result to FAILURE
Build failed in Jenkins: simulator-singlerun #489
Posted by je...@cloudstack.org.
See <http://jenkins.buildacloud.org/job/simulator-singlerun/489/>
------------------------------------------
[...truncated 8936 lines...]
[INFO] BUILD SUCCESS
[INFO] ------------------------------------------------------------------------
[INFO] Total time: 1:59.751s
[INFO] Finished at: Thu Oct 02 05:30:56 EDT 2014
[INFO] Final Memory: 40M/196M
[INFO] ------------------------------------------------------------------------
[WARNING] The requested profile "simulator" could not be activated because it does not exist.
[simulator-singlerun] $ mvn -P developer -pl developer -Ddeploydb-simulator
[INFO] Scanning for projects...
[INFO]
[INFO] ------------------------------------------------------------------------
[INFO] Building Apache CloudStack Developer Mode 4.5.0-SNAPSHOT
[INFO] ------------------------------------------------------------------------
[INFO]
[INFO] --- maven-checkstyle-plugin:2.11:check (cloudstack-checkstyle) @ cloud-developer ---
[INFO] Starting audit...
Audit done.
[INFO]
[INFO] --- properties-maven-plugin:1.0-alpha-2:read-project-properties (default) @ cloud-developer ---
[WARNING] Ignoring missing properties file: <http://jenkins.buildacloud.org/job/simulator-singlerun/ws/developer/../utils/conf/db.properties.override>
[INFO]
[INFO] --- maven-remote-resources-plugin:1.3:process (default) @ cloud-developer ---
[INFO]
[INFO] --- maven-antrun-plugin:1.7:run (default) @ cloud-developer ---
[INFO] Executing tasks
main:
[INFO] Executed tasks
[INFO]
[INFO] >>> exec-maven-plugin:1.2.1:java (create-schema-simulator) @ cloud-developer >>>
[INFO]
[INFO] --- maven-checkstyle-plugin:2.11:check (cloudstack-checkstyle) @ cloud-developer ---
[INFO] Starting audit...
Audit done.
[INFO]
[INFO] <<< exec-maven-plugin:1.2.1:java (create-schema-simulator) @ cloud-developer <<<
[INFO]
[INFO] --- exec-maven-plugin:1.2.1:java (create-schema-simulator) @ cloud-developer ---
log4j:WARN No appenders could be found for logger (org.springframework.core.env.StandardEnvironment).
log4j:WARN Please initialize the log4j system properly.
log4j:WARN See http://logging.apache.org/log4j/1.2/faq.html#noconfig for more info.
========> WARNING: Provided file does not exist: <http://jenkins.buildacloud.org/job/simulator-singlerun/ws/developer/../utils/conf/db.properties.override>
========> Initializing database=simulator with host=localhost port=3306 username=cloud password=cloud
============> Running query: drop database if exists `simulator`
============> Running query: create database `simulator`
============> Running query: GRANT ALL ON simulator.* to 'cloud'@`localhost` identified by 'cloud'
============> Running query: GRANT ALL ON simulator.* to 'cloud'@`%` identified by 'cloud'
========> Processing SQL file at <http://jenkins.buildacloud.org/job/simulator-singlerun/ws/developer/target/db/create-schema-simulator.sql>
========> Processing SQL file at <http://jenkins.buildacloud.org/job/simulator-singlerun/ws/developer/target/db/templates.simulator.sql>
========> Processing SQL file at <http://jenkins.buildacloud.org/job/simulator-singlerun/ws/developer/target/db/hypervisor_capabilities.simulator.sql>
========> Processing upgrade: com.cloud.upgrade.DatabaseUpgradeChecker
[INFO]
[INFO] --- maven-site-plugin:3.3:attach-descriptor (attach-descriptor) @ cloud-developer ---
[INFO]
[INFO] --- maven-install-plugin:2.3.1:install (default-install) @ cloud-developer ---
[INFO] Installing <http://jenkins.buildacloud.org/job/simulator-singlerun/ws/developer/pom.xml> to /var/lib/jenkins/.m2/repository/org/apache/cloudstack/cloud-developer/4.5.0-SNAPSHOT/cloud-developer-4.5.0-SNAPSHOT.pom
[INFO] ------------------------------------------------------------------------
[INFO] BUILD SUCCESS
[INFO] ------------------------------------------------------------------------
[INFO] Total time: 21.044s
[INFO] Finished at: Thu Oct 02 05:31:20 EDT 2014
[INFO] Final Memory: 42M/177M
[INFO] ------------------------------------------------------------------------
[simulator-singlerun] $ /bin/bash -x /tmp/hudson695743496495376742.sh
+ jps -l
+ grep -q Launcher
+ echo ''
+ rm -rf /tmp/MarvinLogs
+ echo Check for initialization of the management server
Check for initialization of the management server
+ COUNTER=0
+ SERVER_PID=4722
+ '[' 0 -lt 44 ']'
+ grep -q 'Management server node 127.0.0.1 is up' jetty-output.out
+ mvn -P systemvm,simulator -pl :cloud-client-ui jetty:run
+ sleep 5
+ COUNTER=1
+ '[' 1 -lt 44 ']'
+ grep -q 'Management server node 127.0.0.1 is up' jetty-output.out
+ sleep 5
+ COUNTER=2
+ '[' 2 -lt 44 ']'
+ grep -q 'Management server node 127.0.0.1 is up' jetty-output.out
+ sleep 5
+ COUNTER=3
+ '[' 3 -lt 44 ']'
+ grep -q 'Management server node 127.0.0.1 is up' jetty-output.out
+ sleep 5
+ COUNTER=4
+ '[' 4 -lt 44 ']'
+ grep -q 'Management server node 127.0.0.1 is up' jetty-output.out
+ sleep 5
+ COUNTER=5
+ '[' 5 -lt 44 ']'
+ grep -q 'Management server node 127.0.0.1 is up' jetty-output.out
+ sleep 5
+ COUNTER=6
+ '[' 6 -lt 44 ']'
+ grep -q 'Management server node 127.0.0.1 is up' jetty-output.out
+ sleep 5
+ COUNTER=7
+ '[' 7 -lt 44 ']'
+ grep -q 'Management server node 127.0.0.1 is up' jetty-output.out
+ sleep 5
+ COUNTER=8
+ '[' 8 -lt 44 ']'
+ grep -q 'Management server node 127.0.0.1 is up' jetty-output.out
+ sleep 5
+ COUNTER=9
+ '[' 9 -lt 44 ']'
+ grep -q 'Management server node 127.0.0.1 is up' jetty-output.out
+ sleep 5
+ COUNTER=10
+ '[' 10 -lt 44 ']'
+ grep -q 'Management server node 127.0.0.1 is up' jetty-output.out
+ sleep 5
+ COUNTER=11
+ '[' 11 -lt 44 ']'
+ grep -q 'Management server node 127.0.0.1 is up' jetty-output.out
+ sleep 5
+ COUNTER=12
+ '[' 12 -lt 44 ']'
+ grep -q 'Management server node 127.0.0.1 is up' jetty-output.out
+ sleep 5
+ COUNTER=13
+ '[' 13 -lt 44 ']'
+ grep -q 'Management server node 127.0.0.1 is up' jetty-output.out
+ sleep 5
+ COUNTER=14
+ '[' 14 -lt 44 ']'
+ grep -q 'Management server node 127.0.0.1 is up' jetty-output.out
+ sleep 5
+ COUNTER=15
+ '[' 15 -lt 44 ']'
+ grep -q 'Management server node 127.0.0.1 is up' jetty-output.out
+ sleep 5
+ COUNTER=16
+ '[' 16 -lt 44 ']'
+ grep -q 'Management server node 127.0.0.1 is up' jetty-output.out
+ sleep 5
+ COUNTER=17
+ '[' 17 -lt 44 ']'
+ grep -q 'Management server node 127.0.0.1 is up' jetty-output.out
+ sleep 5
+ COUNTER=18
+ '[' 18 -lt 44 ']'
+ grep -q 'Management server node 127.0.0.1 is up' jetty-output.out
+ sleep 5
+ COUNTER=19
+ '[' 19 -lt 44 ']'
+ grep -q 'Management server node 127.0.0.1 is up' jetty-output.out
+ sleep 5
+ COUNTER=20
+ '[' 20 -lt 44 ']'
+ grep -q 'Management server node 127.0.0.1 is up' jetty-output.out
+ sleep 5
+ COUNTER=21
+ '[' 21 -lt 44 ']'
+ grep -q 'Management server node 127.0.0.1 is up' jetty-output.out
+ sleep 5
+ COUNTER=22
+ '[' 22 -lt 44 ']'
+ grep -q 'Management server node 127.0.0.1 is up' jetty-output.out
+ sleep 5
+ COUNTER=23
+ '[' 23 -lt 44 ']'
+ grep -q 'Management server node 127.0.0.1 is up' jetty-output.out
+ sleep 5
+ COUNTER=24
+ '[' 24 -lt 44 ']'
+ grep -q 'Management server node 127.0.0.1 is up' jetty-output.out
+ sleep 5
+ COUNTER=25
+ '[' 25 -lt 44 ']'
+ grep -q 'Management server node 127.0.0.1 is up' jetty-output.out
+ sleep 5
+ COUNTER=26
+ '[' 26 -lt 44 ']'
+ grep -q 'Management server node 127.0.0.1 is up' jetty-output.out
+ sleep 5
+ COUNTER=27
+ '[' 27 -lt 44 ']'
+ grep -q 'Management server node 127.0.0.1 is up' jetty-output.out
+ sleep 5
+ COUNTER=28
+ '[' 28 -lt 44 ']'
+ grep -q 'Management server node 127.0.0.1 is up' jetty-output.out
+ break
+ grep -q 'Management server node 127.0.0.1 is up' jetty-output.out
+ echo Started OK pid 4722
Started OK pid 4722
+ sleep 20
+ export PYTHONPATH=<http://jenkins.buildacloud.org/job/simulator-singlerun/ws/tools/marvin>
+ PYTHONPATH=<http://jenkins.buildacloud.org/job/simulator-singlerun/ws/tools/marvin>
+ python2.6 tools/marvin/marvin/deployDataCenter.py -i setup/dev/advanced.cfg
/usr/lib/python2.6/site-packages/pycrypto-2.6-py2.6-linux-x86_64.egg/Crypto/Util/number.py:57: PowmInsecureWarning: Not using mpz_powm_sec. You should rebuild using libgmp >= 5 to avoid timing attack vulnerability.
_warn("Not using mpz_powm_sec. You should rebuild using libgmp >= 5 to avoid timing attack vulnerability.", PowmInsecureWarning)
==== Log Folder Path: /tmp//MarvinLogs//DeployDataCenter__Oct_02_2014_05_34_05_ZLOR26. All logs will be available here ====
==== Deploy DC Started ====
=== Data Center Settings are dumped to /tmp//MarvinLogs//DeployDataCenter__Oct_02_2014_05_34_05_ZLOR26/dc_entries.obj===
====Deploy DC Successful=====
+ sleep 60
+ /usr/local/bin/nosetests-2.7 -v --with-marvin --marvin-config=setup/dev/advanced.cfg --with-xunit --xunit-file=xunit.xml -a tags=advanced,required_hardware=false --zone=Sandbox-simulator --hypervisor=simulator -w test/integration/smoke
==== Marvin Init Started ====
=== Marvin Parse Config Successful ===
=== Marvin Setting TestData Successful===
==== Log Folder Path: /tmp//MarvinLogs//Oct_02_2014_05_37_58_8FJG7N. All logs will be available here ====
=== Marvin Init Logging Successful===
==== Marvin Init Successful ====
+ mvn -P systemvm,simulator -pl :cloud-client-ui jetty:stop
[INFO] Scanning for projects...
[INFO]
[INFO] ------------------------------------------------------------------------
[INFO] Building Apache CloudStack Client UI 4.5.0-SNAPSHOT
[INFO] ------------------------------------------------------------------------
[INFO]
[INFO] --- maven-jetty-plugin:6.1.26:stop (default-cli) @ cloud-client-ui ---
[INFO] ------------------------------------------------------------------------
[INFO] BUILD SUCCESS
[INFO] ------------------------------------------------------------------------
[INFO] Total time: 10.132s
[INFO] Finished at: Thu Oct 02 05:47:45 EDT 2014
[INFO] Final Memory: 25M/119M
[INFO] ------------------------------------------------------------------------
+ sleep 10
+ kill -KILL 4722
/tmp/hudson695743496495376742.sh: line 44: kill: (4722) - No such process
[locks-and-latches] Releasing all the locks
[locks-and-latches] All the locks released
[xUnit] [INFO] - Starting to record.
[xUnit] [INFO] - Processing JUnit
[xUnit] [INFO] - [JUnit] - 1 test report file(s) were found with the pattern 'xunit.xml' relative to '<http://jenkins.buildacloud.org/job/simulator-singlerun/ws/'> for the testing framework 'JUnit'.
[xUnit] [INFO] - Check 'Failed Tests' threshold.
[xUnit] [INFO] - The total number of tests for this category exceeds the specified 'failure' threshold value.
[xUnit] [INFO] - Setting the build status to FAILURE
[xUnit] [INFO] - Stopping recording.
Build step 'Publish xUnit test result report' changed build result to FAILURE
Build failed in Jenkins: simulator-singlerun #488
Posted by je...@cloudstack.org.
See <http://jenkins.buildacloud.org/job/simulator-singlerun/488/changes>
Changes:
[htrippaers] CLOUDSTACK-7665 File.separator shouldn't be used in this case, the
[htrippaers] CLOUDSTACK-7624 The value field of the configuration table is not big enough for some values
------------------------------------------
[...truncated 8942 lines...]
[INFO] Scanning for projects...
[INFO]
[INFO] ------------------------------------------------------------------------
[INFO] Building Apache CloudStack Developer Mode 4.5.0-SNAPSHOT
[INFO] ------------------------------------------------------------------------
[INFO]
[INFO] --- maven-checkstyle-plugin:2.11:check (cloudstack-checkstyle) @ cloud-developer ---
[INFO] Starting audit...
Audit done.
[INFO]
[INFO] --- properties-maven-plugin:1.0-alpha-2:read-project-properties (default) @ cloud-developer ---
[WARNING] Ignoring missing properties file: <http://jenkins.buildacloud.org/job/simulator-singlerun/ws/developer/../utils/conf/db.properties.override>
[INFO]
[INFO] --- maven-remote-resources-plugin:1.3:process (default) @ cloud-developer ---
[INFO]
[INFO] --- maven-antrun-plugin:1.7:run (default) @ cloud-developer ---
[INFO] Executing tasks
main:
[INFO] Executed tasks
[INFO]
[INFO] >>> exec-maven-plugin:1.2.1:java (create-schema-simulator) @ cloud-developer >>>
[INFO]
[INFO] --- maven-checkstyle-plugin:2.11:check (cloudstack-checkstyle) @ cloud-developer ---
[INFO] Starting audit...
Audit done.
[INFO]
[INFO] <<< exec-maven-plugin:1.2.1:java (create-schema-simulator) @ cloud-developer <<<
[INFO]
[INFO] --- exec-maven-plugin:1.2.1:java (create-schema-simulator) @ cloud-developer ---
log4j:WARN No appenders could be found for logger (org.springframework.core.env.StandardEnvironment).
log4j:WARN Please initialize the log4j system properly.
log4j:WARN See http://logging.apache.org/log4j/1.2/faq.html#noconfig for more info.
========> WARNING: Provided file does not exist: <http://jenkins.buildacloud.org/job/simulator-singlerun/ws/developer/../utils/conf/db.properties.override>
========> Initializing database=simulator with host=localhost port=3306 username=cloud password=cloud
============> Running query: drop database if exists `simulator`
============> Running query: create database `simulator`
============> Running query: GRANT ALL ON simulator.* to 'cloud'@`localhost` identified by 'cloud'
============> Running query: GRANT ALL ON simulator.* to 'cloud'@`%` identified by 'cloud'
========> Processing SQL file at <http://jenkins.buildacloud.org/job/simulator-singlerun/ws/developer/target/db/create-schema-simulator.sql>
========> Processing SQL file at <http://jenkins.buildacloud.org/job/simulator-singlerun/ws/developer/target/db/templates.simulator.sql>
========> Processing SQL file at <http://jenkins.buildacloud.org/job/simulator-singlerun/ws/developer/target/db/hypervisor_capabilities.simulator.sql>
========> Processing upgrade: com.cloud.upgrade.DatabaseUpgradeChecker
[INFO]
[INFO] --- maven-site-plugin:3.3:attach-descriptor (attach-descriptor) @ cloud-developer ---
[INFO]
[INFO] --- maven-install-plugin:2.3.1:install (default-install) @ cloud-developer ---
[INFO] Installing <http://jenkins.buildacloud.org/job/simulator-singlerun/ws/developer/pom.xml> to /var/lib/jenkins/.m2/repository/org/apache/cloudstack/cloud-developer/4.5.0-SNAPSHOT/cloud-developer-4.5.0-SNAPSHOT.pom
[INFO] ------------------------------------------------------------------------
[INFO] BUILD SUCCESS
[INFO] ------------------------------------------------------------------------
[INFO] Total time: 23.435s
[INFO] Finished at: Thu Oct 02 04:58:27 EDT 2014
[INFO] Final Memory: 41M/187M
[INFO] ------------------------------------------------------------------------
[simulator-singlerun] $ /bin/bash -x /tmp/hudson1362628062460044507.sh
+ jps -l
+ grep -q Launcher
+ echo ''
+ rm -rf /tmp/MarvinLogs
+ echo Check for initialization of the management server
Check for initialization of the management server
+ COUNTER=0
+ SERVER_PID=30137
+ '[' 0 -lt 44 ']'
+ mvn -P systemvm,simulator -pl :cloud-client-ui jetty:run
+ grep -q 'Management server node 127.0.0.1 is up' jetty-output.out
+ sleep 5
+ COUNTER=1
+ '[' 1 -lt 44 ']'
+ grep -q 'Management server node 127.0.0.1 is up' jetty-output.out
+ sleep 5
+ COUNTER=2
+ '[' 2 -lt 44 ']'
+ grep -q 'Management server node 127.0.0.1 is up' jetty-output.out
+ sleep 5
+ COUNTER=3
+ '[' 3 -lt 44 ']'
+ grep -q 'Management server node 127.0.0.1 is up' jetty-output.out
+ sleep 5
+ COUNTER=4
+ '[' 4 -lt 44 ']'
+ grep -q 'Management server node 127.0.0.1 is up' jetty-output.out
+ sleep 5
+ COUNTER=5
+ '[' 5 -lt 44 ']'
+ grep -q 'Management server node 127.0.0.1 is up' jetty-output.out
+ sleep 5
+ COUNTER=6
+ '[' 6 -lt 44 ']'
+ grep -q 'Management server node 127.0.0.1 is up' jetty-output.out
+ sleep 5
+ COUNTER=7
+ '[' 7 -lt 44 ']'
+ grep -q 'Management server node 127.0.0.1 is up' jetty-output.out
+ sleep 5
+ COUNTER=8
+ '[' 8 -lt 44 ']'
+ grep -q 'Management server node 127.0.0.1 is up' jetty-output.out
+ sleep 5
+ COUNTER=9
+ '[' 9 -lt 44 ']'
+ grep -q 'Management server node 127.0.0.1 is up' jetty-output.out
+ sleep 5
+ COUNTER=10
+ '[' 10 -lt 44 ']'
+ grep -q 'Management server node 127.0.0.1 is up' jetty-output.out
+ sleep 5
+ COUNTER=11
+ '[' 11 -lt 44 ']'
+ grep -q 'Management server node 127.0.0.1 is up' jetty-output.out
+ sleep 5
+ COUNTER=12
+ '[' 12 -lt 44 ']'
+ grep -q 'Management server node 127.0.0.1 is up' jetty-output.out
+ sleep 5
+ COUNTER=13
+ '[' 13 -lt 44 ']'
+ grep -q 'Management server node 127.0.0.1 is up' jetty-output.out
+ sleep 5
+ COUNTER=14
+ '[' 14 -lt 44 ']'
+ grep -q 'Management server node 127.0.0.1 is up' jetty-output.out
+ sleep 5
+ COUNTER=15
+ '[' 15 -lt 44 ']'
+ grep -q 'Management server node 127.0.0.1 is up' jetty-output.out
+ sleep 5
+ COUNTER=16
+ '[' 16 -lt 44 ']'
+ grep -q 'Management server node 127.0.0.1 is up' jetty-output.out
+ sleep 5
+ COUNTER=17
+ '[' 17 -lt 44 ']'
+ grep -q 'Management server node 127.0.0.1 is up' jetty-output.out
+ sleep 5
+ COUNTER=18
+ '[' 18 -lt 44 ']'
+ grep -q 'Management server node 127.0.0.1 is up' jetty-output.out
+ sleep 5
+ COUNTER=19
+ '[' 19 -lt 44 ']'
+ grep -q 'Management server node 127.0.0.1 is up' jetty-output.out
+ sleep 5
+ COUNTER=20
+ '[' 20 -lt 44 ']'
+ grep -q 'Management server node 127.0.0.1 is up' jetty-output.out
+ sleep 5
+ COUNTER=21
+ '[' 21 -lt 44 ']'
+ grep -q 'Management server node 127.0.0.1 is up' jetty-output.out
+ sleep 5
+ COUNTER=22
+ '[' 22 -lt 44 ']'
+ grep -q 'Management server node 127.0.0.1 is up' jetty-output.out
+ sleep 5
+ COUNTER=23
+ '[' 23 -lt 44 ']'
+ grep -q 'Management server node 127.0.0.1 is up' jetty-output.out
+ sleep 5
+ COUNTER=24
+ '[' 24 -lt 44 ']'
+ grep -q 'Management server node 127.0.0.1 is up' jetty-output.out
+ sleep 5
+ COUNTER=25
+ '[' 25 -lt 44 ']'
+ grep -q 'Management server node 127.0.0.1 is up' jetty-output.out
+ sleep 5
+ COUNTER=26
+ '[' 26 -lt 44 ']'
+ grep -q 'Management server node 127.0.0.1 is up' jetty-output.out
+ sleep 5
+ COUNTER=27
+ '[' 27 -lt 44 ']'
+ grep -q 'Management server node 127.0.0.1 is up' jetty-output.out
+ sleep 5
+ COUNTER=28
+ '[' 28 -lt 44 ']'
+ grep -q 'Management server node 127.0.0.1 is up' jetty-output.out
+ sleep 5
+ COUNTER=29
+ '[' 29 -lt 44 ']'
+ grep -q 'Management server node 127.0.0.1 is up' jetty-output.out
+ sleep 5
+ COUNTER=30
+ '[' 30 -lt 44 ']'
+ grep -q 'Management server node 127.0.0.1 is up' jetty-output.out
+ break
+ grep -q 'Management server node 127.0.0.1 is up' jetty-output.out
+ echo Started OK pid 30137
Started OK pid 30137
+ sleep 20
+ export PYTHONPATH=<http://jenkins.buildacloud.org/job/simulator-singlerun/ws/tools/marvin>
+ PYTHONPATH=<http://jenkins.buildacloud.org/job/simulator-singlerun/ws/tools/marvin>
+ python2.6 tools/marvin/marvin/deployDataCenter.py -i setup/dev/advanced.cfg
/usr/lib/python2.6/site-packages/pycrypto-2.6-py2.6-linux-x86_64.egg/Crypto/Util/number.py:57: PowmInsecureWarning: Not using mpz_powm_sec. You should rebuild using libgmp >= 5 to avoid timing attack vulnerability.
_warn("Not using mpz_powm_sec. You should rebuild using libgmp >= 5 to avoid timing attack vulnerability.", PowmInsecureWarning)
==== Log Folder Path: /tmp//MarvinLogs//DeployDataCenter__Oct_02_2014_05_01_22_59ZC6E. All logs will be available here ====
==== Deploy DC Started ====
=== Data Center Settings are dumped to /tmp//MarvinLogs//DeployDataCenter__Oct_02_2014_05_01_22_59ZC6E/dc_entries.obj===
====Deploy DC Successful=====
+ sleep 60
+ /usr/local/bin/nosetests-2.7 -v --with-marvin --marvin-config=setup/dev/advanced.cfg --with-xunit --xunit-file=xunit.xml -a tags=advanced,required_hardware=false --zone=Sandbox-simulator --hypervisor=simulator -w test/integration/smoke
==== Marvin Init Started ====
=== Marvin Parse Config Successful ===
=== Marvin Setting TestData Successful===
==== Log Folder Path: /tmp//MarvinLogs//Oct_02_2014_05_05_15_X8F2ZP. All logs will be available here ====
=== Marvin Init Logging Successful===
==== Marvin Init Successful ====
+ mvn -P systemvm,simulator -pl :cloud-client-ui jetty:stop
[INFO] Scanning for projects...
[INFO]
[INFO] ------------------------------------------------------------------------
[INFO] Building Apache CloudStack Client UI 4.5.0-SNAPSHOT
[INFO] ------------------------------------------------------------------------
[INFO]
[INFO] --- maven-jetty-plugin:6.1.26:stop (default-cli) @ cloud-client-ui ---
[INFO] ------------------------------------------------------------------------
[INFO] BUILD SUCCESS
[INFO] ------------------------------------------------------------------------
[INFO] Total time: 5.479s
[INFO] Finished at: Thu Oct 02 05:14:55 EDT 2014
[INFO] Final Memory: 25M/124M
[INFO] ------------------------------------------------------------------------
+ sleep 10
+ kill -KILL 30137
/tmp/hudson1362628062460044507.sh: line 44: kill: (30137) - No such process
[locks-and-latches] Releasing all the locks
[locks-and-latches] All the locks released
[xUnit] [INFO] - Starting to record.
[xUnit] [INFO] - Processing JUnit
[xUnit] [INFO] - [JUnit] - 1 test report file(s) were found with the pattern 'xunit.xml' relative to '<http://jenkins.buildacloud.org/job/simulator-singlerun/ws/'> for the testing framework 'JUnit'.
[xUnit] [INFO] - Check 'Failed Tests' threshold.
[xUnit] [INFO] - The total number of tests for this category exceeds the specified 'failure' threshold value.
[xUnit] [INFO] - Setting the build status to FAILURE
[xUnit] [INFO] - Stopping recording.
Build step 'Publish xUnit test result report' changed build result to FAILURE
Build failed in Jenkins: simulator-singlerun #487
Posted by je...@cloudstack.org.
See <http://jenkins.buildacloud.org/job/simulator-singlerun/487/>
------------------------------------------
[...truncated 8932 lines...]
[INFO]
[INFO] --- maven-install-plugin:2.3.1:install (default-install) @ cloud-developer ---
[INFO] Installing <http://jenkins.buildacloud.org/job/simulator-singlerun/ws/developer/pom.xml> to /var/lib/jenkins/.m2/repository/org/apache/cloudstack/cloud-developer/4.5.0-SNAPSHOT/cloud-developer-4.5.0-SNAPSHOT.pom
[INFO] ------------------------------------------------------------------------
[INFO] BUILD SUCCESS
[INFO] ------------------------------------------------------------------------
[INFO] Total time: 2:00.849s
[INFO] Finished at: Wed Oct 01 20:20:35 EDT 2014
[INFO] Final Memory: 42M/206M
[INFO] ------------------------------------------------------------------------
[WARNING] The requested profile "simulator" could not be activated because it does not exist.
[simulator-singlerun] $ mvn -P developer -pl developer -Ddeploydb-simulator
[INFO] Scanning for projects...
[INFO]
[INFO] ------------------------------------------------------------------------
[INFO] Building Apache CloudStack Developer Mode 4.5.0-SNAPSHOT
[INFO] ------------------------------------------------------------------------
[INFO]
[INFO] --- maven-checkstyle-plugin:2.11:check (cloudstack-checkstyle) @ cloud-developer ---
[INFO] Starting audit...
Audit done.
[INFO]
[INFO] --- properties-maven-plugin:1.0-alpha-2:read-project-properties (default) @ cloud-developer ---
[WARNING] Ignoring missing properties file: <http://jenkins.buildacloud.org/job/simulator-singlerun/ws/developer/../utils/conf/db.properties.override>
[INFO]
[INFO] --- maven-remote-resources-plugin:1.3:process (default) @ cloud-developer ---
[INFO]
[INFO] --- maven-antrun-plugin:1.7:run (default) @ cloud-developer ---
[INFO] Executing tasks
main:
[INFO] Executed tasks
[INFO]
[INFO] >>> exec-maven-plugin:1.2.1:java (create-schema-simulator) @ cloud-developer >>>
[INFO]
[INFO] --- maven-checkstyle-plugin:2.11:check (cloudstack-checkstyle) @ cloud-developer ---
[INFO] Starting audit...
Audit done.
[INFO]
[INFO] <<< exec-maven-plugin:1.2.1:java (create-schema-simulator) @ cloud-developer <<<
[INFO]
[INFO] --- exec-maven-plugin:1.2.1:java (create-schema-simulator) @ cloud-developer ---
log4j:WARN No appenders could be found for logger (org.springframework.core.env.StandardEnvironment).
log4j:WARN Please initialize the log4j system properly.
log4j:WARN See http://logging.apache.org/log4j/1.2/faq.html#noconfig for more info.
========> WARNING: Provided file does not exist: <http://jenkins.buildacloud.org/job/simulator-singlerun/ws/developer/../utils/conf/db.properties.override>
========> Initializing database=simulator with host=localhost port=3306 username=cloud password=cloud
============> Running query: drop database if exists `simulator`
============> Running query: create database `simulator`
============> Running query: GRANT ALL ON simulator.* to 'cloud'@`localhost` identified by 'cloud'
============> Running query: GRANT ALL ON simulator.* to 'cloud'@`%` identified by 'cloud'
========> Processing SQL file at <http://jenkins.buildacloud.org/job/simulator-singlerun/ws/developer/target/db/create-schema-simulator.sql>
========> Processing SQL file at <http://jenkins.buildacloud.org/job/simulator-singlerun/ws/developer/target/db/templates.simulator.sql>
========> Processing SQL file at <http://jenkins.buildacloud.org/job/simulator-singlerun/ws/developer/target/db/hypervisor_capabilities.simulator.sql>
========> Processing upgrade: com.cloud.upgrade.DatabaseUpgradeChecker
[INFO]
[INFO] --- maven-site-plugin:3.3:attach-descriptor (attach-descriptor) @ cloud-developer ---
[INFO]
[INFO] --- maven-install-plugin:2.3.1:install (default-install) @ cloud-developer ---
[INFO] Installing <http://jenkins.buildacloud.org/job/simulator-singlerun/ws/developer/pom.xml> to /var/lib/jenkins/.m2/repository/org/apache/cloudstack/cloud-developer/4.5.0-SNAPSHOT/cloud-developer-4.5.0-SNAPSHOT.pom
[INFO] ------------------------------------------------------------------------
[INFO] BUILD SUCCESS
[INFO] ------------------------------------------------------------------------
[INFO] Total time: 21.569s
[INFO] Finished at: Wed Oct 01 20:21:01 EDT 2014
[INFO] Final Memory: 44M/209M
[INFO] ------------------------------------------------------------------------
[simulator-singlerun] $ /bin/bash -x /tmp/hudson6466251777204795605.sh
+ grep -q Launcher
+ jps -l
+ echo ''
+ rm -rf /tmp/MarvinLogs
+ echo Check for initialization of the management server
Check for initialization of the management server
+ COUNTER=0
+ SERVER_PID=14858
+ '[' 0 -lt 44 ']'
+ mvn -P systemvm,simulator -pl :cloud-client-ui jetty:run
+ grep -q 'Management server node 127.0.0.1 is up' jetty-output.out
+ sleep 5
+ COUNTER=1
+ '[' 1 -lt 44 ']'
+ grep -q 'Management server node 127.0.0.1 is up' jetty-output.out
+ sleep 5
+ COUNTER=2
+ '[' 2 -lt 44 ']'
+ grep -q 'Management server node 127.0.0.1 is up' jetty-output.out
+ sleep 5
+ COUNTER=3
+ '[' 3 -lt 44 ']'
+ grep -q 'Management server node 127.0.0.1 is up' jetty-output.out
+ sleep 5
+ COUNTER=4
+ '[' 4 -lt 44 ']'
+ grep -q 'Management server node 127.0.0.1 is up' jetty-output.out
+ sleep 5
+ COUNTER=5
+ '[' 5 -lt 44 ']'
+ grep -q 'Management server node 127.0.0.1 is up' jetty-output.out
+ sleep 5
+ COUNTER=6
+ '[' 6 -lt 44 ']'
+ grep -q 'Management server node 127.0.0.1 is up' jetty-output.out
+ sleep 5
+ COUNTER=7
+ '[' 7 -lt 44 ']'
+ grep -q 'Management server node 127.0.0.1 is up' jetty-output.out
+ sleep 5
+ COUNTER=8
+ '[' 8 -lt 44 ']'
+ grep -q 'Management server node 127.0.0.1 is up' jetty-output.out
+ sleep 5
+ COUNTER=9
+ '[' 9 -lt 44 ']'
+ grep -q 'Management server node 127.0.0.1 is up' jetty-output.out
+ sleep 5
+ COUNTER=10
+ '[' 10 -lt 44 ']'
+ grep -q 'Management server node 127.0.0.1 is up' jetty-output.out
+ sleep 5
+ COUNTER=11
+ '[' 11 -lt 44 ']'
+ grep -q 'Management server node 127.0.0.1 is up' jetty-output.out
+ sleep 5
+ COUNTER=12
+ '[' 12 -lt 44 ']'
+ grep -q 'Management server node 127.0.0.1 is up' jetty-output.out
+ sleep 5
+ COUNTER=13
+ '[' 13 -lt 44 ']'
+ grep -q 'Management server node 127.0.0.1 is up' jetty-output.out
+ sleep 5
+ COUNTER=14
+ '[' 14 -lt 44 ']'
+ grep -q 'Management server node 127.0.0.1 is up' jetty-output.out
+ sleep 5
+ COUNTER=15
+ '[' 15 -lt 44 ']'
+ grep -q 'Management server node 127.0.0.1 is up' jetty-output.out
+ sleep 5
+ COUNTER=16
+ '[' 16 -lt 44 ']'
+ grep -q 'Management server node 127.0.0.1 is up' jetty-output.out
+ sleep 5
+ COUNTER=17
+ '[' 17 -lt 44 ']'
+ grep -q 'Management server node 127.0.0.1 is up' jetty-output.out
+ sleep 5
+ COUNTER=18
+ '[' 18 -lt 44 ']'
+ grep -q 'Management server node 127.0.0.1 is up' jetty-output.out
+ sleep 5
+ COUNTER=19
+ '[' 19 -lt 44 ']'
+ grep -q 'Management server node 127.0.0.1 is up' jetty-output.out
+ sleep 5
+ COUNTER=20
+ '[' 20 -lt 44 ']'
+ grep -q 'Management server node 127.0.0.1 is up' jetty-output.out
+ sleep 5
+ COUNTER=21
+ '[' 21 -lt 44 ']'
+ grep -q 'Management server node 127.0.0.1 is up' jetty-output.out
+ sleep 5
+ COUNTER=22
+ '[' 22 -lt 44 ']'
+ grep -q 'Management server node 127.0.0.1 is up' jetty-output.out
+ sleep 5
+ COUNTER=23
+ '[' 23 -lt 44 ']'
+ grep -q 'Management server node 127.0.0.1 is up' jetty-output.out
+ sleep 5
+ COUNTER=24
+ '[' 24 -lt 44 ']'
+ grep -q 'Management server node 127.0.0.1 is up' jetty-output.out
+ sleep 5
+ COUNTER=25
+ '[' 25 -lt 44 ']'
+ grep -q 'Management server node 127.0.0.1 is up' jetty-output.out
+ sleep 5
+ COUNTER=26
+ '[' 26 -lt 44 ']'
+ grep -q 'Management server node 127.0.0.1 is up' jetty-output.out
+ sleep 5
+ COUNTER=27
+ '[' 27 -lt 44 ']'
+ grep -q 'Management server node 127.0.0.1 is up' jetty-output.out
+ break
+ grep -q 'Management server node 127.0.0.1 is up' jetty-output.out
+ echo Started OK pid 14858
Started OK pid 14858
+ sleep 20
+ export PYTHONPATH=<http://jenkins.buildacloud.org/job/simulator-singlerun/ws/tools/marvin>
+ PYTHONPATH=<http://jenkins.buildacloud.org/job/simulator-singlerun/ws/tools/marvin>
+ python2.6 tools/marvin/marvin/deployDataCenter.py -i setup/dev/advanced.cfg
/usr/lib/python2.6/site-packages/pycrypto-2.6-py2.6-linux-x86_64.egg/Crypto/Util/number.py:57: PowmInsecureWarning: Not using mpz_powm_sec. You should rebuild using libgmp >= 5 to avoid timing attack vulnerability.
_warn("Not using mpz_powm_sec. You should rebuild using libgmp >= 5 to avoid timing attack vulnerability.", PowmInsecureWarning)
==== Log Folder Path: /tmp//MarvinLogs//DeployDataCenter__Oct_01_2014_20_23_41_0IG0VP. All logs will be available here ====
==== Deploy DC Started ====
=== Data Center Settings are dumped to /tmp//MarvinLogs//DeployDataCenter__Oct_01_2014_20_23_41_0IG0VP/dc_entries.obj===
====Deploy DC Successful=====
+ sleep 60
+ /usr/local/bin/nosetests-2.7 -v --with-marvin --marvin-config=setup/dev/advanced.cfg --with-xunit --xunit-file=xunit.xml -a tags=advanced,required_hardware=false --zone=Sandbox-simulator --hypervisor=simulator -w test/integration/smoke
==== Marvin Init Started ====
=== Marvin Parse Config Successful ===
=== Marvin Setting TestData Successful===
==== Log Folder Path: /tmp//MarvinLogs//Oct_01_2014_20_27_29_Z7IE9L. All logs will be available here ====
=== Marvin Init Logging Successful===
==== Marvin Init Successful ====
+ mvn -P systemvm,simulator -pl :cloud-client-ui jetty:stop
[INFO] Scanning for projects...
[INFO]
[INFO] ------------------------------------------------------------------------
[INFO] Building Apache CloudStack Client UI 4.5.0-SNAPSHOT
[INFO] ------------------------------------------------------------------------
[INFO]
[INFO] --- maven-jetty-plugin:6.1.26:stop (default-cli) @ cloud-client-ui ---
[INFO] ------------------------------------------------------------------------
[INFO] BUILD SUCCESS
[INFO] ------------------------------------------------------------------------
[INFO] Total time: 6.151s
[INFO] Finished at: Wed Oct 01 20:37:12 EDT 2014
[INFO] Final Memory: 25M/146M
[INFO] ------------------------------------------------------------------------
+ sleep 10
+ kill -KILL 14858
/tmp/hudson6466251777204795605.sh: line 44: kill: (14858) - No such process
[locks-and-latches] Releasing all the locks
[locks-and-latches] All the locks released
[xUnit] [INFO] - Starting to record.
[xUnit] [INFO] - Processing JUnit
[xUnit] [INFO] - [JUnit] - 1 test report file(s) were found with the pattern 'xunit.xml' relative to '<http://jenkins.buildacloud.org/job/simulator-singlerun/ws/'> for the testing framework 'JUnit'.
[xUnit] [INFO] - Check 'Failed Tests' threshold.
[xUnit] [INFO] - The total number of tests for this category exceeds the specified 'failure' threshold value.
[xUnit] [INFO] - Setting the build status to FAILURE
[xUnit] [INFO] - Stopping recording.
Build step 'Publish xUnit test result report' changed build result to FAILURE
Build failed in Jenkins: simulator-singlerun #486
Posted by je...@cloudstack.org.
See <http://jenkins.buildacloud.org/job/simulator-singlerun/486/changes>
Changes:
[anthony.xu] added more log for create vm snapshot
------------------------------------------
[...truncated 8942 lines...]
[INFO] Scanning for projects...
[INFO]
[INFO] ------------------------------------------------------------------------
[INFO] Building Apache CloudStack Developer Mode 4.5.0-SNAPSHOT
[INFO] ------------------------------------------------------------------------
[INFO]
[INFO] --- maven-checkstyle-plugin:2.11:check (cloudstack-checkstyle) @ cloud-developer ---
[INFO] Starting audit...
Audit done.
[INFO]
[INFO] --- properties-maven-plugin:1.0-alpha-2:read-project-properties (default) @ cloud-developer ---
[WARNING] Ignoring missing properties file: <http://jenkins.buildacloud.org/job/simulator-singlerun/ws/developer/../utils/conf/db.properties.override>
[INFO]
[INFO] --- maven-remote-resources-plugin:1.3:process (default) @ cloud-developer ---
[INFO]
[INFO] --- maven-antrun-plugin:1.7:run (default) @ cloud-developer ---
[INFO] Executing tasks
main:
[INFO] Executed tasks
[INFO]
[INFO] >>> exec-maven-plugin:1.2.1:java (create-schema-simulator) @ cloud-developer >>>
[INFO]
[INFO] --- maven-checkstyle-plugin:2.11:check (cloudstack-checkstyle) @ cloud-developer ---
[INFO] Starting audit...
Audit done.
[INFO]
[INFO] <<< exec-maven-plugin:1.2.1:java (create-schema-simulator) @ cloud-developer <<<
[INFO]
[INFO] --- exec-maven-plugin:1.2.1:java (create-schema-simulator) @ cloud-developer ---
log4j:WARN No appenders could be found for logger (org.springframework.core.env.StandardEnvironment).
log4j:WARN Please initialize the log4j system properly.
log4j:WARN See http://logging.apache.org/log4j/1.2/faq.html#noconfig for more info.
========> WARNING: Provided file does not exist: <http://jenkins.buildacloud.org/job/simulator-singlerun/ws/developer/../utils/conf/db.properties.override>
========> Initializing database=simulator with host=localhost port=3306 username=cloud password=cloud
============> Running query: drop database if exists `simulator`
============> Running query: create database `simulator`
============> Running query: GRANT ALL ON simulator.* to 'cloud'@`localhost` identified by 'cloud'
============> Running query: GRANT ALL ON simulator.* to 'cloud'@`%` identified by 'cloud'
========> Processing SQL file at <http://jenkins.buildacloud.org/job/simulator-singlerun/ws/developer/target/db/create-schema-simulator.sql>
========> Processing SQL file at <http://jenkins.buildacloud.org/job/simulator-singlerun/ws/developer/target/db/templates.simulator.sql>
========> Processing SQL file at <http://jenkins.buildacloud.org/job/simulator-singlerun/ws/developer/target/db/hypervisor_capabilities.simulator.sql>
========> Processing upgrade: com.cloud.upgrade.DatabaseUpgradeChecker
[INFO]
[INFO] --- maven-site-plugin:3.3:attach-descriptor (attach-descriptor) @ cloud-developer ---
[INFO]
[INFO] --- maven-install-plugin:2.3.1:install (default-install) @ cloud-developer ---
[INFO] Installing <http://jenkins.buildacloud.org/job/simulator-singlerun/ws/developer/pom.xml> to /var/lib/jenkins/.m2/repository/org/apache/cloudstack/cloud-developer/4.5.0-SNAPSHOT/cloud-developer-4.5.0-SNAPSHOT.pom
[INFO] ------------------------------------------------------------------------
[INFO] BUILD SUCCESS
[INFO] ------------------------------------------------------------------------
[INFO] Total time: 31.388s
[INFO] Finished at: Wed Oct 01 19:48:12 EDT 2014
[INFO] Final Memory: 42M/190M
[INFO] ------------------------------------------------------------------------
[simulator-singlerun] $ /bin/bash -x /tmp/hudson1226411314090527542.sh
+ grep -q Launcher
+ jps -l
+ echo ''
+ rm -rf /tmp/MarvinLogs
+ echo Check for initialization of the management server
Check for initialization of the management server
+ COUNTER=0
+ SERVER_PID=7885
+ '[' 0 -lt 44 ']'
+ mvn -P systemvm,simulator -pl :cloud-client-ui jetty:run
+ grep -q 'Management server node 127.0.0.1 is up' jetty-output.out
+ sleep 5
+ COUNTER=1
+ '[' 1 -lt 44 ']'
+ grep -q 'Management server node 127.0.0.1 is up' jetty-output.out
+ sleep 5
+ COUNTER=2
+ '[' 2 -lt 44 ']'
+ grep -q 'Management server node 127.0.0.1 is up' jetty-output.out
+ sleep 5
+ COUNTER=3
+ '[' 3 -lt 44 ']'
+ grep -q 'Management server node 127.0.0.1 is up' jetty-output.out
+ sleep 5
+ COUNTER=4
+ '[' 4 -lt 44 ']'
+ grep -q 'Management server node 127.0.0.1 is up' jetty-output.out
+ sleep 5
+ COUNTER=5
+ '[' 5 -lt 44 ']'
+ grep -q 'Management server node 127.0.0.1 is up' jetty-output.out
+ sleep 5
+ COUNTER=6
+ '[' 6 -lt 44 ']'
+ grep -q 'Management server node 127.0.0.1 is up' jetty-output.out
+ sleep 5
+ COUNTER=7
+ '[' 7 -lt 44 ']'
+ grep -q 'Management server node 127.0.0.1 is up' jetty-output.out
+ sleep 5
+ COUNTER=8
+ '[' 8 -lt 44 ']'
+ grep -q 'Management server node 127.0.0.1 is up' jetty-output.out
+ sleep 5
+ COUNTER=9
+ '[' 9 -lt 44 ']'
+ grep -q 'Management server node 127.0.0.1 is up' jetty-output.out
+ sleep 5
+ COUNTER=10
+ '[' 10 -lt 44 ']'
+ grep -q 'Management server node 127.0.0.1 is up' jetty-output.out
+ sleep 5
+ COUNTER=11
+ '[' 11 -lt 44 ']'
+ grep -q 'Management server node 127.0.0.1 is up' jetty-output.out
+ sleep 5
+ COUNTER=12
+ '[' 12 -lt 44 ']'
+ grep -q 'Management server node 127.0.0.1 is up' jetty-output.out
+ sleep 5
+ COUNTER=13
+ '[' 13 -lt 44 ']'
+ grep -q 'Management server node 127.0.0.1 is up' jetty-output.out
+ sleep 5
+ COUNTER=14
+ '[' 14 -lt 44 ']'
+ grep -q 'Management server node 127.0.0.1 is up' jetty-output.out
+ sleep 5
+ COUNTER=15
+ '[' 15 -lt 44 ']'
+ grep -q 'Management server node 127.0.0.1 is up' jetty-output.out
+ sleep 5
+ COUNTER=16
+ '[' 16 -lt 44 ']'
+ grep -q 'Management server node 127.0.0.1 is up' jetty-output.out
+ sleep 5
+ COUNTER=17
+ '[' 17 -lt 44 ']'
+ grep -q 'Management server node 127.0.0.1 is up' jetty-output.out
+ sleep 5
+ COUNTER=18
+ '[' 18 -lt 44 ']'
+ grep -q 'Management server node 127.0.0.1 is up' jetty-output.out
+ sleep 5
+ COUNTER=19
+ '[' 19 -lt 44 ']'
+ grep -q 'Management server node 127.0.0.1 is up' jetty-output.out
+ sleep 5
+ COUNTER=20
+ '[' 20 -lt 44 ']'
+ grep -q 'Management server node 127.0.0.1 is up' jetty-output.out
+ sleep 5
+ COUNTER=21
+ '[' 21 -lt 44 ']'
+ grep -q 'Management server node 127.0.0.1 is up' jetty-output.out
+ sleep 5
+ COUNTER=22
+ '[' 22 -lt 44 ']'
+ grep -q 'Management server node 127.0.0.1 is up' jetty-output.out
+ sleep 5
+ COUNTER=23
+ '[' 23 -lt 44 ']'
+ grep -q 'Management server node 127.0.0.1 is up' jetty-output.out
+ sleep 5
+ COUNTER=24
+ '[' 24 -lt 44 ']'
+ grep -q 'Management server node 127.0.0.1 is up' jetty-output.out
+ sleep 5
+ COUNTER=25
+ '[' 25 -lt 44 ']'
+ grep -q 'Management server node 127.0.0.1 is up' jetty-output.out
+ sleep 5
+ COUNTER=26
+ '[' 26 -lt 44 ']'
+ grep -q 'Management server node 127.0.0.1 is up' jetty-output.out
+ sleep 5
+ COUNTER=27
+ '[' 27 -lt 44 ']'
+ grep -q 'Management server node 127.0.0.1 is up' jetty-output.out
+ sleep 5
+ COUNTER=28
+ '[' 28 -lt 44 ']'
+ grep -q 'Management server node 127.0.0.1 is up' jetty-output.out
+ sleep 5
+ COUNTER=29
+ '[' 29 -lt 44 ']'
+ grep -q 'Management server node 127.0.0.1 is up' jetty-output.out
+ sleep 5
+ COUNTER=30
+ '[' 30 -lt 44 ']'
+ grep -q 'Management server node 127.0.0.1 is up' jetty-output.out
+ break
+ grep -q 'Management server node 127.0.0.1 is up' jetty-output.out
+ echo Started OK pid 7885
Started OK pid 7885
+ sleep 20
+ export PYTHONPATH=<http://jenkins.buildacloud.org/job/simulator-singlerun/ws/tools/marvin>
+ PYTHONPATH=<http://jenkins.buildacloud.org/job/simulator-singlerun/ws/tools/marvin>
+ python2.6 tools/marvin/marvin/deployDataCenter.py -i setup/dev/advanced.cfg
/usr/lib/python2.6/site-packages/pycrypto-2.6-py2.6-linux-x86_64.egg/Crypto/Util/number.py:57: PowmInsecureWarning: Not using mpz_powm_sec. You should rebuild using libgmp >= 5 to avoid timing attack vulnerability.
_warn("Not using mpz_powm_sec. You should rebuild using libgmp >= 5 to avoid timing attack vulnerability.", PowmInsecureWarning)
==== Log Folder Path: /tmp//MarvinLogs//DeployDataCenter__Oct_01_2014_19_51_07_JRDM3M. All logs will be available here ====
==== Deploy DC Started ====
=== Data Center Settings are dumped to /tmp//MarvinLogs//DeployDataCenter__Oct_01_2014_19_51_07_JRDM3M/dc_entries.obj===
====Deploy DC Successful=====
+ sleep 60
+ /usr/local/bin/nosetests-2.7 -v --with-marvin --marvin-config=setup/dev/advanced.cfg --with-xunit --xunit-file=xunit.xml -a tags=advanced,required_hardware=false --zone=Sandbox-simulator --hypervisor=simulator -w test/integration/smoke
==== Marvin Init Started ====
=== Marvin Parse Config Successful ===
=== Marvin Setting TestData Successful===
==== Log Folder Path: /tmp//MarvinLogs//Oct_01_2014_19_55_01_4M8Q8T. All logs will be available here ====
=== Marvin Init Logging Successful===
==== Marvin Init Successful ====
+ mvn -P systemvm,simulator -pl :cloud-client-ui jetty:stop
[INFO] Scanning for projects...
[INFO]
[INFO] ------------------------------------------------------------------------
[INFO] Building Apache CloudStack Client UI 4.5.0-SNAPSHOT
[INFO] ------------------------------------------------------------------------
[INFO]
[INFO] --- maven-jetty-plugin:6.1.26:stop (default-cli) @ cloud-client-ui ---
[INFO] ------------------------------------------------------------------------
[INFO] BUILD SUCCESS
[INFO] ------------------------------------------------------------------------
[INFO] Total time: 5.268s
[INFO] Finished at: Wed Oct 01 20:04:37 EDT 2014
[INFO] Final Memory: 25M/121M
[INFO] ------------------------------------------------------------------------
+ sleep 10
+ kill -KILL 7885
/tmp/hudson1226411314090527542.sh: line 44: kill: (7885) - No such process
[locks-and-latches] Releasing all the locks
[locks-and-latches] All the locks released
[xUnit] [INFO] - Starting to record.
[xUnit] [INFO] - Processing JUnit
[xUnit] [INFO] - [JUnit] - 1 test report file(s) were found with the pattern 'xunit.xml' relative to '<http://jenkins.buildacloud.org/job/simulator-singlerun/ws/'> for the testing framework 'JUnit'.
[xUnit] [INFO] - Check 'Failed Tests' threshold.
[xUnit] [INFO] - The total number of tests for this category exceeds the specified 'failure' threshold value.
[xUnit] [INFO] - Setting the build status to FAILURE
[xUnit] [INFO] - Stopping recording.
Build step 'Publish xUnit test result report' changed build result to FAILURE
Re: Build failed in Jenkins: simulator-singlerun #485
Posted by Nitin Mehta <Ni...@citrix.com>.
Talluri/Hugo/Others with knowledge of Jenkins - Can you please look into
this and check why we keep getting false alarms because of issues on
Jenkins side ?
Thanks,
-Nitin
On 01/10/14 1:15 PM, "jenkins@cloudstack.org" <je...@cloudstack.org>
wrote:
>See <http://jenkins.buildacloud.org/job/simulator-singlerun/485/changes>
>
>Changes:
>
>[Rohit Yadav] CLOUDSTACK-7664: [UI] Handle change in API response for
>listloadbalancer
>
>------------------------------------------
>[...truncated 8938 lines...]
>[INFO] Final Memory: 44M/192M
>[INFO]
>------------------------------------------------------------------------
>[WARNING] The requested profile "simulator" could not be activated
>because it does not exist.
>[simulator-singlerun] $ mvn -P developer -pl developer
>-Ddeploydb-simulator
>[INFO] Scanning for projects...
>[INFO]
>
>[INFO]
>------------------------------------------------------------------------
>[INFO] Building Apache CloudStack Developer Mode 4.5.0-SNAPSHOT
>[INFO]
>------------------------------------------------------------------------
>[INFO]
>[INFO] --- maven-checkstyle-plugin:2.11:check (cloudstack-checkstyle) @
>cloud-developer ---
>[INFO] Starting audit...
>Audit done.
>
>[INFO]
>[INFO] --- properties-maven-plugin:1.0-alpha-2:read-project-properties
>(default) @ cloud-developer ---
>[WARNING] Ignoring missing properties file:
><http://jenkins.buildacloud.org/job/simulator-singlerun/ws/developer/../ut
>ils/conf/db.properties.override>
>[INFO]
>[INFO] --- maven-remote-resources-plugin:1.3:process (default) @
>cloud-developer ---
>[INFO]
>[INFO] --- maven-antrun-plugin:1.7:run (default) @ cloud-developer ---
>[INFO] Executing tasks
>
>main:
>[INFO] Executed tasks
>[INFO]
>[INFO] >>> exec-maven-plugin:1.2.1:java (create-schema-simulator) @
>cloud-developer >>>
>[INFO]
>[INFO] --- maven-checkstyle-plugin:2.11:check (cloudstack-checkstyle) @
>cloud-developer ---
>[INFO] Starting audit...
>Audit done.
>
>[INFO]
>[INFO] <<< exec-maven-plugin:1.2.1:java (create-schema-simulator) @
>cloud-developer <<<
>[INFO]
>[INFO] --- exec-maven-plugin:1.2.1:java (create-schema-simulator) @
>cloud-developer ---
>log4j:WARN No appenders could be found for logger
>(org.springframework.core.env.StandardEnvironment).
>log4j:WARN Please initialize the log4j system properly.
>log4j:WARN See http://logging.apache.org/log4j/1.2/faq.html#noconfig for
>more info.
>========> WARNING: Provided file does not exist:
><http://jenkins.buildacloud.org/job/simulator-singlerun/ws/developer/../ut
>ils/conf/db.properties.override>
>========> Initializing database=simulator with host=localhost port=3306
>username=cloud password=cloud
>============> Running query: drop database if exists `simulator`
>============> Running query: create database `simulator`
>============> Running query: GRANT ALL ON simulator.* to
>'cloud'@`localhost` identified by 'cloud'
>============> Running query: GRANT ALL ON simulator.* to 'cloud'@`%`
>identified by 'cloud'
>========> Processing SQL file at
><http://jenkins.buildacloud.org/job/simulator-singlerun/ws/developer/targe
>t/db/create-schema-simulator.sql>
>========> Processing SQL file at
><http://jenkins.buildacloud.org/job/simulator-singlerun/ws/developer/targe
>t/db/templates.simulator.sql>
>========> Processing SQL file at
><http://jenkins.buildacloud.org/job/simulator-singlerun/ws/developer/targe
>t/db/hypervisor_capabilities.simulator.sql>
>========> Processing upgrade: com.cloud.upgrade.DatabaseUpgradeChecker
>[INFO]
>[INFO] --- maven-site-plugin:3.3:attach-descriptor (attach-descriptor) @
>cloud-developer ---
>[INFO]
>[INFO] --- maven-install-plugin:2.3.1:install (default-install) @
>cloud-developer ---
>[INFO] Installing
><http://jenkins.buildacloud.org/job/simulator-singlerun/ws/developer/pom.x
>ml> to
>/var/lib/jenkins/.m2/repository/org/apache/cloudstack/cloud-developer/4.5.
>0-SNAPSHOT/cloud-developer-4.5.0-SNAPSHOT.pom
>[INFO]
>------------------------------------------------------------------------
>[INFO] BUILD SUCCESS
>[INFO]
>------------------------------------------------------------------------
>[INFO] Total time: 39.554s
>[INFO] Finished at: Wed Oct 01 15:58:32 EDT 2014
>[INFO] Final Memory: 43M/171M
>[INFO]
>------------------------------------------------------------------------
>[simulator-singlerun] $ /bin/bash -x /tmp/hudson2342136899674022504.sh
>+ jps -l
>+ grep -q Launcher
>+ echo ''
>+ rm -rf /tmp/MarvinLogs
>+ echo Check for initialization of the management server
>Check for initialization of the management server
>+ COUNTER=0
>+ SERVER_PID=308
>+ '[' 0 -lt 44 ']'
>+ grep -q 'Management server node 127.0.0.1 is up' jetty-output.out
>+ mvn -P systemvm,simulator -pl :cloud-client-ui jetty:run
>+ sleep 5
>+ COUNTER=1
>+ '[' 1 -lt 44 ']'
>+ grep -q 'Management server node 127.0.0.1 is up' jetty-output.out
>+ sleep 5
>+ COUNTER=2
>+ '[' 2 -lt 44 ']'
>+ grep -q 'Management server node 127.0.0.1 is up' jetty-output.out
>+ sleep 5
>+ COUNTER=3
>+ '[' 3 -lt 44 ']'
>+ grep -q 'Management server node 127.0.0.1 is up' jetty-output.out
>+ sleep 5
>+ COUNTER=4
>+ '[' 4 -lt 44 ']'
>+ grep -q 'Management server node 127.0.0.1 is up' jetty-output.out
>+ sleep 5
>+ COUNTER=5
>+ '[' 5 -lt 44 ']'
>+ grep -q 'Management server node 127.0.0.1 is up' jetty-output.out
>+ sleep 5
>+ COUNTER=6
>+ '[' 6 -lt 44 ']'
>+ grep -q 'Management server node 127.0.0.1 is up' jetty-output.out
>+ sleep 5
>+ COUNTER=7
>+ '[' 7 -lt 44 ']'
>+ grep -q 'Management server node 127.0.0.1 is up' jetty-output.out
>+ sleep 5
>+ COUNTER=8
>+ '[' 8 -lt 44 ']'
>+ grep -q 'Management server node 127.0.0.1 is up' jetty-output.out
>+ sleep 5
>+ COUNTER=9
>+ '[' 9 -lt 44 ']'
>+ grep -q 'Management server node 127.0.0.1 is up' jetty-output.out
>+ sleep 5
>+ COUNTER=10
>+ '[' 10 -lt 44 ']'
>+ grep -q 'Management server node 127.0.0.1 is up' jetty-output.out
>+ sleep 5
>+ COUNTER=11
>+ '[' 11 -lt 44 ']'
>+ grep -q 'Management server node 127.0.0.1 is up' jetty-output.out
>+ sleep 5
>+ COUNTER=12
>+ '[' 12 -lt 44 ']'
>+ grep -q 'Management server node 127.0.0.1 is up' jetty-output.out
>+ sleep 5
>+ COUNTER=13
>+ '[' 13 -lt 44 ']'
>+ grep -q 'Management server node 127.0.0.1 is up' jetty-output.out
>+ sleep 5
>+ COUNTER=14
>+ '[' 14 -lt 44 ']'
>+ grep -q 'Management server node 127.0.0.1 is up' jetty-output.out
>+ sleep 5
>+ COUNTER=15
>+ '[' 15 -lt 44 ']'
>+ grep -q 'Management server node 127.0.0.1 is up' jetty-output.out
>+ sleep 5
>+ COUNTER=16
>+ '[' 16 -lt 44 ']'
>+ grep -q 'Management server node 127.0.0.1 is up' jetty-output.out
>+ sleep 5
>+ COUNTER=17
>+ '[' 17 -lt 44 ']'
>+ grep -q 'Management server node 127.0.0.1 is up' jetty-output.out
>+ sleep 5
>+ COUNTER=18
>+ '[' 18 -lt 44 ']'
>+ grep -q 'Management server node 127.0.0.1 is up' jetty-output.out
>+ sleep 5
>+ COUNTER=19
>+ '[' 19 -lt 44 ']'
>+ grep -q 'Management server node 127.0.0.1 is up' jetty-output.out
>+ sleep 5
>+ COUNTER=20
>+ '[' 20 -lt 44 ']'
>+ grep -q 'Management server node 127.0.0.1 is up' jetty-output.out
>+ sleep 5
>+ COUNTER=21
>+ '[' 21 -lt 44 ']'
>+ grep -q 'Management server node 127.0.0.1 is up' jetty-output.out
>+ sleep 5
>+ COUNTER=22
>+ '[' 22 -lt 44 ']'
>+ grep -q 'Management server node 127.0.0.1 is up' jetty-output.out
>+ sleep 5
>+ COUNTER=23
>+ '[' 23 -lt 44 ']'
>+ grep -q 'Management server node 127.0.0.1 is up' jetty-output.out
>+ sleep 5
>+ COUNTER=24
>+ '[' 24 -lt 44 ']'
>+ grep -q 'Management server node 127.0.0.1 is up' jetty-output.out
>+ sleep 5
>+ COUNTER=25
>+ '[' 25 -lt 44 ']'
>+ grep -q 'Management server node 127.0.0.1 is up' jetty-output.out
>+ sleep 5
>+ COUNTER=26
>+ '[' 26 -lt 44 ']'
>+ grep -q 'Management server node 127.0.0.1 is up' jetty-output.out
>+ sleep 5
>+ COUNTER=27
>+ '[' 27 -lt 44 ']'
>+ grep -q 'Management server node 127.0.0.1 is up' jetty-output.out
>+ sleep 5
>+ COUNTER=28
>+ '[' 28 -lt 44 ']'
>+ grep -q 'Management server node 127.0.0.1 is up' jetty-output.out
>+ sleep 5
>+ COUNTER=29
>+ '[' 29 -lt 44 ']'
>+ grep -q 'Management server node 127.0.0.1 is up' jetty-output.out
>+ break
>+ grep -q 'Management server node 127.0.0.1 is up' jetty-output.out
>+ echo Started OK pid 308
>Started OK pid 308
>+ sleep 20
>+ export
>PYTHONPATH=<http://jenkins.buildacloud.org/job/simulator-singlerun/ws/tool
>s/marvin>
>+
>PYTHONPATH=<http://jenkins.buildacloud.org/job/simulator-singlerun/ws/tool
>s/marvin>
>+ python2.6 tools/marvin/marvin/deployDataCenter.py -i
>setup/dev/advanced.cfg
>/usr/lib/python2.6/site-packages/pycrypto-2.6-py2.6-linux-x86_64.egg/Crypt
>o/Util/number.py:57: PowmInsecureWarning: Not using mpz_powm_sec. You
>should rebuild using libgmp >= 5 to avoid timing attack vulnerability.
> _warn("Not using mpz_powm_sec. You should rebuild using libgmp >= 5 to
>avoid timing attack vulnerability.", PowmInsecureWarning)
>
>==== Log Folder Path:
>/tmp//MarvinLogs//DeployDataCenter__Oct_01_2014_16_01_22_9SM5XS. All logs
>will be available here ====
>
>==== Deploy DC Started ====
>
>=== Data Center Settings are dumped to
>/tmp//MarvinLogs//DeployDataCenter__Oct_01_2014_16_01_22_9SM5XS/dc_entries
>.obj===
>
>====Deploy DC Successful=====
>+ sleep 60
>+ /usr/local/bin/nosetests-2.7 -v --with-marvin
>--marvin-config=setup/dev/advanced.cfg --with-xunit
>--xunit-file=xunit.xml -a tags=advanced,required_hardware=false
>--zone=Sandbox-simulator --hypervisor=simulator -w test/integration/smoke
>
>==== Marvin Init Started ====
>
>=== Marvin Parse Config Successful ===
>
>=== Marvin Setting TestData Successful===
>
>==== Log Folder Path: /tmp//MarvinLogs//Oct_01_2014_16_05_10_VQCF55. All
>logs will be available here ====
>
>=== Marvin Init Logging Successful===
>
>==== Marvin Init Successful ====
>+ mvn -P systemvm,simulator -pl :cloud-client-ui jetty:stop
>[INFO] Scanning for projects...
>[INFO]
>
>[INFO]
>------------------------------------------------------------------------
>[INFO] Building Apache CloudStack Client UI 4.5.0-SNAPSHOT
>[INFO]
>------------------------------------------------------------------------
>[INFO]
>[INFO] --- maven-jetty-plugin:6.1.26:stop (default-cli) @ cloud-client-ui
>---
>[INFO]
>------------------------------------------------------------------------
>[INFO] BUILD SUCCESS
>[INFO]
>------------------------------------------------------------------------
>[INFO] Total time: 5.551s
>[INFO] Finished at: Wed Oct 01 16:14:50 EDT 2014
>[INFO] Final Memory: 25M/121M
>[INFO]
>------------------------------------------------------------------------
>+ sleep 10
>+ kill -KILL 308
>/tmp/hudson2342136899674022504.sh: line 44: kill: (308) - No such process
>[locks-and-latches] Releasing all the locks
>[locks-and-latches] All the locks released
>[xUnit] [INFO] - Starting to record.
>[xUnit] [INFO] - Processing JUnit
>[xUnit] [INFO] - [JUnit] - 1 test report file(s) were found with the
>pattern 'xunit.xml' relative to
>'<http://jenkins.buildacloud.org/job/simulator-singlerun/ws/'> for the
>testing framework 'JUnit'.
>[xUnit] [INFO] - Check 'Failed Tests' threshold.
>[xUnit] [INFO] - The total number of tests for this category exceeds the
>specified 'failure' threshold value.
>[xUnit] [INFO] - Setting the build status to FAILURE
>[xUnit] [INFO] - Stopping recording.
>Build step 'Publish xUnit test result report' changed build result to
>FAILURE