You are viewing a plain text version of this content. The canonical link for it is here.
Posted to builds@solr.apache.org by Apache Jenkins Server <je...@builds.apache.org> on 2023/08/30 17:04:39 UTC
[JENKINS] Solr » Solr-BadApples-Tests-main - Build # 1104 - Unstable!
Build: https://ci-builds.apache.org/job/Solr/job/Solr-BadApples-Tests-main/1104/
3 tests failed.
FAILED: org.apache.solr.security.jwt.JWTAuthPluginIntegrationTest.mockOAuth2Server
Error Message:
org.junit.ComparisonFailure: Should have received 401 code expected:<[401]> but was:<[200]>
Stack Trace:
org.junit.ComparisonFailure: Should have received 401 code expected:<[401]> but was:<[200]>
at __randomizedtesting.SeedInfo.seed([75397813C3C4D210:F2399943A6782EFC]:0)
at org.junit.Assert.assertEquals(Assert.java:117)
at org.apache.solr.security.jwt.JWTAuthPluginIntegrationTest.mockOAuth2Server(JWTAuthPluginIntegrationTest.java:137)
at java.base/jdk.internal.reflect.NativeMethodAccessorImpl.invoke0(Native Method)
at java.base/jdk.internal.reflect.NativeMethodAccessorImpl.invoke(NativeMethodAccessorImpl.java:62)
at java.base/jdk.internal.reflect.DelegatingMethodAccessorImpl.invoke(DelegatingMethodAccessorImpl.java:43)
at java.base/java.lang.reflect.Method.invoke(Method.java:566)
at com.carrotsearch.randomizedtesting.RandomizedRunner.invoke(RandomizedRunner.java:1758)
at com.carrotsearch.randomizedtesting.RandomizedRunner$8.evaluate(RandomizedRunner.java:946)
at com.carrotsearch.randomizedtesting.RandomizedRunner$9.evaluate(RandomizedRunner.java:982)
at com.carrotsearch.randomizedtesting.RandomizedRunner$10.evaluate(RandomizedRunner.java:996)
at com.carrotsearch.randomizedtesting.rules.SystemPropertiesRestoreRule$1.evaluate(SystemPropertiesRestoreRule.java:80)
at org.junit.rules.RunRules.evaluate(RunRules.java:20)
at org.apache.lucene.tests.util.TestRuleSetupTeardownChained$1.evaluate(TestRuleSetupTeardownChained.java:48)
at org.apache.lucene.tests.util.AbstractBeforeAfterRule$1.evaluate(AbstractBeforeAfterRule.java:43)
at org.apache.lucene.tests.util.TestRuleThreadAndTestName$1.evaluate(TestRuleThreadAndTestName.java:45)
at org.apache.lucene.tests.util.TestRuleIgnoreAfterMaxFailures$1.evaluate(TestRuleIgnoreAfterMaxFailures.java:60)
at org.apache.lucene.tests.util.TestRuleMarkFailure$1.evaluate(TestRuleMarkFailure.java:44)
at org.junit.rules.RunRules.evaluate(RunRules.java:20)
at com.carrotsearch.randomizedtesting.rules.StatementAdapter.evaluate(StatementAdapter.java:36)
at com.carrotsearch.randomizedtesting.ThreadLeakControl$StatementRunner.run(ThreadLeakControl.java:390)
at com.carrotsearch.randomizedtesting.ThreadLeakControl.forkTimeoutingTask(ThreadLeakControl.java:843)
at com.carrotsearch.randomizedtesting.ThreadLeakControl$3.evaluate(ThreadLeakControl.java:490)
at com.carrotsearch.randomizedtesting.RandomizedRunner.runSingleTest(RandomizedRunner.java:955)
at com.carrotsearch.randomizedtesting.RandomizedRunner$5.evaluate(RandomizedRunner.java:840)
at com.carrotsearch.randomizedtesting.RandomizedRunner$6.evaluate(RandomizedRunner.java:891)
at com.carrotsearch.randomizedtesting.RandomizedRunner$7.evaluate(RandomizedRunner.java:902)
at com.carrotsearch.randomizedtesting.rules.StatementAdapter.evaluate(StatementAdapter.java:36)
at com.carrotsearch.randomizedtesting.rules.StatementAdapter.evaluate(StatementAdapter.java:36)
at org.apache.lucene.tests.util.AbstractBeforeAfterRule$1.evaluate(AbstractBeforeAfterRule.java:43)
at com.carrotsearch.randomizedtesting.rules.SystemPropertiesRestoreRule$1.evaluate(SystemPropertiesRestoreRule.java:80)
at org.junit.rules.RunRules.evaluate(RunRules.java:20)
at org.apache.lucene.tests.util.AbstractBeforeAfterRule$1.evaluate(AbstractBeforeAfterRule.java:43)
at com.carrotsearch.randomizedtesting.rules.StatementAdapter.evaluate(StatementAdapter.java:36)
at org.apache.lucene.tests.util.TestRuleStoreClassName$1.evaluate(TestRuleStoreClassName.java:38)
at com.carrotsearch.randomizedtesting.rules.NoShadowingOrOverridesOnMethodsRule$1.evaluate(NoShadowingOrOverridesOnMethodsRule.java:40)
at com.carrotsearch.randomizedtesting.rules.NoShadowingOrOverridesOnMethodsRule$1.evaluate(NoShadowingOrOverridesOnMethodsRule.java:40)
at com.carrotsearch.randomizedtesting.rules.StatementAdapter.evaluate(StatementAdapter.java:36)
at com.carrotsearch.randomizedtesting.rules.StatementAdapter.evaluate(StatementAdapter.java:36)
at org.apache.lucene.tests.util.TestRuleAssertionsRequired$1.evaluate(TestRuleAssertionsRequired.java:53)
at org.apache.lucene.tests.util.AbstractBeforeAfterRule$1.evaluate(AbstractBeforeAfterRule.java:43)
at org.apache.lucene.tests.util.TestRuleMarkFailure$1.evaluate(TestRuleMarkFailure.java:44)
at org.apache.lucene.tests.util.TestRuleIgnoreAfterMaxFailures$1.evaluate(TestRuleIgnoreAfterMaxFailures.java:60)
at org.apache.lucene.tests.util.TestRuleIgnoreTestSuites$1.evaluate(TestRuleIgnoreTestSuites.java:47)
at org.junit.rules.RunRules.evaluate(RunRules.java:20)
at com.carrotsearch.randomizedtesting.rules.StatementAdapter.evaluate(StatementAdapter.java:36)
at com.carrotsearch.randomizedtesting.ThreadLeakControl$StatementRunner.run(ThreadLeakControl.java:390)
at com.carrotsearch.randomizedtesting.ThreadLeakControl.lambda$forkTimeoutingTask$0(ThreadLeakControl.java:850)
at java.base/java.lang.Thread.run(Thread.java:829)
FAILED: org.apache.solr.security.jwt.JWTAuthPluginIntegrationTest.classMethod
Error Message:
com.carrotsearch.randomizedtesting.ThreadLeakError: 62 threads leaked from SUITE scope at org.apache.solr.security.jwt.JWTAuthPluginIntegrationTest:
1) Thread[id=312, name=h2sc-150-thread-2, state=RUNNABLE, group=TGRP-JWTAuthPluginIntegrationTest]
at java.base@11.0.16.1/sun.nio.ch.EPoll.wait(Native Method)
at java.base@11.0.16.1/sun.nio.ch.EPollSelectorImpl.doSelect(EPollSelectorImpl.java:120)
at java.base@11.0.16.1/sun.nio.ch.SelectorImpl.lockAndDoSelect(SelectorImpl.java:124)
at java.base@11.0.16.1/sun.nio.ch.SelectorImpl.select(SelectorImpl.java:141)
at app//org.eclipse.jetty.io.ManagedSelector.nioSelect(ManagedSelector.java:180)
at app//org.eclipse.jetty.io.ManagedSelector.select(ManagedSelector.java:187)
at app//org.eclipse.jetty.io.ManagedSelector$SelectorProducer.select(ManagedSelector.java:604)
at app//org.eclipse.jetty.io.ManagedSelector$SelectorProducer.produce(ManagedSelector.java:541)
at app//org.eclipse.jetty.util.thread.strategy.AdaptiveExecutionStrategy.produceTask(AdaptiveExecutionStrategy.java:450)
at app//org.eclipse.jetty.util.thread.strategy.AdaptiveExecutionStrategy.tryProduce(AdaptiveExecutionStrategy.java:243)
at app//org.eclipse.jetty.util.thread.strategy.AdaptiveExecutionStrategy.produce(AdaptiveExecutionStrategy.java:194)
at app//org.eclipse.jetty.io.ManagedSelector$$Lambda$356/0x0000000100586040.run(Unknown Source)
at app//org.apache.solr.common.util.ExecutorUtil$MDCAwareThreadPoolExecutor.lambda$execute$0(ExecutorUtil.java:289)
at app//org.apache.solr.common.util.ExecutorUtil$MDCAwareThreadPoolExecutor$$Lambda$275/0x000000010051fc40.run(Unknown Source)
at java.base@11.0.16.1/java.util.concurrent.ThreadPoolExecutor.runWorker(ThreadPoolExecutor.java:1128)
at java.base@11.0.16.1/java.util.concurrent.ThreadPoolExecutor$Worker.run(ThreadPoolExecutor.java:628)
at java.base@11.0.16.1/java.lang.Thread.run(Thread.java:829)
2) Thread[id=296, name=Session-HouseKeeper-6a313039-1, state=TIMED_WAITING, group=TGRP-JWTAuthPluginIntegrationTest]
at java.base@11.0.16.1/jdk.internal.misc.Unsafe.park(Native Method)
at java.base@11.0.16.1/java.util.concurrent.locks.LockSupport.parkNanos(LockSupport.java:234)
at java.base@11.0.16.1/java.util.concurrent.locks.AbstractQueuedSynchronizer$ConditionObject.awaitNanos(AbstractQueuedSynchronizer.java:2123)
at java.base@11.0.16.1/java.util.concurrent.ScheduledThreadPoolExecutor$DelayedWorkQueue.take(ScheduledThreadPoolExecutor.java:1182)
at java.base@11.0.16.1/java.util.concurrent.ScheduledThreadPoolExecutor$DelayedWorkQueue.take(ScheduledThreadPoolExecutor.java:899)
at java.base@11.0.16.1/java.util.concurrent.ThreadPoolExecutor.getTask(ThreadPoolExecutor.java:1054)
at java.base@11.0.16.1/java.util.concurrent.ThreadPoolExecutor.runWorker(ThreadPoolExecutor.java:1114)
at java.base@11.0.16.1/java.util.concurrent.ThreadPoolExecutor$Worker.run(ThreadPoolExecutor.java:628)
at java.base@11.0.16.1/java.lang.Thread.run(Thread.java:829)
3) Thread[id=314, name=h2sc-151-thread-2, state=RUNNABLE, group=TGRP-JWTAuthPluginIntegrationTest]
at java.base@11.0.16.1/sun.nio.ch.EPoll.wait(Native Method)
at java.base@11.0.16.1/sun.nio.ch.EPollSelectorImpl.doSelect(EPollSelectorImpl.java:120)
at java.base@11.0.16.1/sun.nio.ch.SelectorImpl.lockAndDoSelect(SelectorImpl.java:124)
at java.base@11.0.16.1/sun.nio.ch.SelectorImpl.select(SelectorImpl.java:141)
at app//org.eclipse.jetty.io.ManagedSelector.nioSelect(ManagedSelector.java:180)
at app//org.eclipse.jetty.io.ManagedSelector.select(ManagedSelector.java:187)
at app//org.eclipse.jetty.io.ManagedSelector$SelectorProducer.select(ManagedSelector.java:604)
at app//org.eclipse.jetty.io.ManagedSelector$SelectorProducer.produce(ManagedSelector.java:541)
at app//org.eclipse.jetty.util.thread.strategy.AdaptiveExecutionStrategy.produceTask(AdaptiveExecutionStrategy.java:450)
at app//org.eclipse.jetty.util.thread.strategy.AdaptiveExecutionStrategy.tryProduce(AdaptiveExecutionStrategy.java:243)
at app//org.eclipse.jetty.util.thread.strategy.AdaptiveExecutionStrategy.produce(AdaptiveExecutionStrategy.java:194)
at app//org.eclipse.jetty.io.ManagedSelector$$Lambda$356/0x0000000100586040.run(Unknown Source)
at app//org.apache.solr.common.util.ExecutorUtil$MDCAwareThreadPoolExecutor.lambda$execute$0(ExecutorUtil.java:289)
at app//org.apache.solr.common.util.ExecutorUtil$MDCAwareThreadPoolExecutor$$Lambda$275/0x000000010051fc40.run(Unknown Source)
at java.base@11.0.16.1/java.util.concurrent.ThreadPoolExecutor.runWorker(ThreadPoolExecutor.java:1128)
at java.base@11.0.16.1/java.util.concurrent.ThreadPoolExecutor$Worker.run(ThreadPoolExecutor.java:628)
at java.base@11.0.16.1/java.lang.Thread.run(Thread.java:829)
4) Thread[id=336, name=zkCallback-177-thread-1, state=TIMED_WAITING, group=TGRP-JWTAuthPluginIntegrationTest]
at java.base@11.0.16.1/jdk.internal.misc.Unsafe.park(Native Method)
at java.base@11.0.16.1/java.util.concurrent.locks.LockSupport.parkNanos(LockSupport.java:234)
at java.base@11.0.16.1/java.util.concurrent.SynchronousQueue$TransferStack.awaitFulfill(SynchronousQueue.java:462)
at java.base@11.0.16.1/java.util.concurrent.SynchronousQueue$TransferStack.transfer(SynchronousQueue.java:361)
at java.base@11.0.16.1/java.util.concurrent.SynchronousQueue.poll(SynchronousQueue.java:937)
at java.base@11.0.16.1/java.util.concurrent.ThreadPoolExecutor.getTask(ThreadPoolExecutor.java:1053)
at java.base@11.0.16.1/java.util.concurrent.ThreadPoolExecutor.runWorker(ThreadPoolExecutor.java:1114)
at java.base@11.0.16.1/java.util.concurrent.ThreadPoolExecutor$Worker.run(ThreadPoolExecutor.java:628)
at java.base@11.0.16.1/java.lang.Thread.run(Thread.java:829)
5) Thread[id=337, name=zkCallback-154-thread-2, state=TIMED_WAITING, group=TGRP-JWTAuthPluginIntegrationTest]
at java.base@11.0.16.1/jdk.internal.misc.Unsafe.park(Native Method)
at java.base@11.0.16.1/java.util.concurrent.locks.LockSupport.parkNanos(LockSupport.java:234)
at java.base@11.0.16.1/java.util.concurrent.SynchronousQueue$TransferStack.awaitFulfill(SynchronousQueue.java:462)
at java.base@11.0.16.1/java.util.concurrent.SynchronousQueue$TransferStack.transfer(SynchronousQueue.java:361)
at java.base@11.0.16.1/java.util.concurrent.SynchronousQueue.poll(SynchronousQueue.java:937)
at java.base@11.0.16.1/java.util.concurrent.ThreadPoolExecutor.getTask(ThreadPoolExecutor.java:1053)
at java.base@11.0.16.1/java.util.concurrent.ThreadPoolExecutor.runWorker(ThreadPoolExecutor.java:1114)
at java.base@11.0.16.1/java.util.concurrent.ThreadPoolExecutor$Worker.run(ThreadPoolExecutor.java:628)
at java.base@11.0.16.1/java.lang.Thread.run(Thread.java:829)
6) Thread[id=323, name=OverseerStateUpdate-72411084713689093-127.0.0.1:37281_solr-n_0000000000, state=TIMED_WAITING, group=Overseer state updater.]
at java.base@11.0.16.1/jdk.internal.misc.Unsafe.park(Native Method)
at java.base@11.0.16.1/java.util.concurrent.locks.LockSupport.parkNanos(LockSupport.java:234)
at java.base@11.0.16.1/java.util.concurrent.locks.AbstractQueuedSynchronizer$ConditionObject.awaitNanos(AbstractQueuedSynchronizer.java:2123)
at app//org.apache.solr.cloud.ZkDistributedQueue.peekElements(ZkDistributedQueue.java:488)
at app//org.apache.solr.cloud.Overseer$ClusterStateUpdater.run(Overseer.java:338)
at java.base@11.0.16.1/java.lang.Thread.run(Thread.java:829)
7) Thread[id=259, name=NIOServerCxnFactory.SelectorThread-1, state=RUNNABLE, group=TGRP-JWTAuthPluginIntegrationTest]
at java.base@11.0.16.1/sun.nio.ch.EPoll.wait(Native Method)
at java.base@11.0.16.1/sun.nio.ch.EPollSelectorImpl.doSelect(EPollSelectorImpl.java:120)
at java.base@11.0.16.1/sun.nio.ch.SelectorImpl.lockAndDoSelect(SelectorImpl.java:124)
at java.base@11.0.16.1/sun.nio.ch.SelectorImpl.select(SelectorImpl.java:141)
at app//org.apache.zookeeper.server.NIOServerCnxnFactory$SelectorThread.select(NIOServerCnxnFactory.java:403)
at app//org.apache.zookeeper.server.NIOServerCnxnFactory$SelectorThread.run(NIOServerCnxnFactory.java:368)
8) Thread[id=270, name=zkConnectionManagerCallback-128-thread-1, state=WAITING, group=TGRP-JWTAuthPluginIntegrationTest]
at java.base@11.0.16.1/jdk.internal.misc.Unsafe.park(Native Method)
at java.base@11.0.16.1/java.util.concurrent.locks.LockSupport.park(LockSupport.java:194)
at java.base@11.0.16.1/java.util.concurrent.locks.AbstractQueuedSynchronizer$ConditionObject.await(AbstractQueuedSynchronizer.java:2081)
at java.base@11.0.16.1/java.util.concurrent.LinkedBlockingQueue.take(LinkedBlockingQueue.java:433)
at java.base@11.0.16.1/java.util.concurrent.ThreadPoolExecutor.getTask(ThreadPoolExecutor.java:1054)
at java.base@11.0.16.1/java.util.concurrent.ThreadPoolExecutor.runWorker(ThreadPoolExecutor.java:1114)
at java.base@11.0.16.1/java.util.concurrent.ThreadPoolExecutor$Worker.run(ThreadPoolExecutor.java:628)
at java.base@11.0.16.1/java.lang.Thread.run(Thread.java:829)
9) Thread[id=320, name=zkConnectionManagerCallback-155-thread-1, state=WAITING, group=TGRP-JWTAuthPluginIntegrationTest]
at java.base@11.0.16.1/jdk.internal.misc.Unsafe.park(Native Method)
at java.base@11.0.16.1/java.util.concurrent.locks.LockSupport.park(LockSupport.java:194)
at java.base@11.0.16.1/java.util.concurrent.locks.AbstractQueuedSynchronizer$ConditionObject.await(AbstractQueuedSynchronizer.java:2081)
at java.base@11.0.16.1/java.util.concurrent.LinkedBlockingQueue.take(LinkedBlockingQueue.java:433)
at java.base@11.0.16.1/java.util.concurrent.ThreadPoolExecutor.getTask(ThreadPoolExecutor.java:1054)
at java.base@11.0.16.1/java.util.concurrent.ThreadPoolExecutor.runWorker(ThreadPoolExecutor.java:1114)
at java.base@11.0.16.1/java.util.concurrent.ThreadPoolExecutor$Worker.run(ThreadPoolExecutor.java:628)
at java.base@11.0.16.1/java.lang.Thread.run(Thread.java:829)
10) Thread[id=316, name=jetty-launcher-133-thread-2-EventThread, state=WAITING, group=TGRP-JWTAuthPluginIntegrationTest]
at java.base@11.0.16.1/jdk.internal.misc.Unsafe.park(Native Method)
at java.base@11.0.16.1/java.util.concurrent.locks.LockSupport.park(LockSupport.java:194)
at java.base@11.0.16.1/java.util.concurrent.locks.AbstractQueuedSynchronizer$ConditionObject.await(AbstractQueuedSynchronizer.java:2081)
at java.base@11.0.16.1/java.util.concurrent.LinkedBlockingQueue.take(LinkedBlockingQueue.java:433)
at app//org.apache.zookeeper.ClientCnxn$EventThread.run(ClientCnxn.java:534)
11) Thread[id=319, name=zkConnectionManagerCallback-157-thread-1, state=WAITING, group=TGRP-JWTAuthPluginIntegrationTest]
at java.base@11.0.16.1/jdk.internal.misc.Unsafe.park(Native Method)
at java.base@11.0.16.1/java.util.concurrent.locks.LockSupport.park(LockSupport.java:194)
at java.base@11.0.16.1/java.util.concurrent.locks.AbstractQueuedSynchronizer$ConditionObject.await(AbstractQueuedSynchronizer.java:2081)
at java.base@11.0.16.1/java.util.concurrent.LinkedBlockingQueue.take(LinkedBlockingQueue.java:433)
at java.base@11.0.16.1/java.util.concurrent.ThreadPoolExecutor.getTask(ThreadPoolExecutor.java:1054)
at java.base@11.0.16.1/java.util.concurrent.ThreadPoolExecutor.runWorker(ThreadPoolExecutor.java:1114)
at java.base@11.0.16.1/java.util.concurrent.ThreadPoolExecutor$Worker.run(ThreadPoolExecutor.java:628)
at java.base@11.0.16.1/java.lang.Thread.run(Thread.java:829)
12) Thread[id=265, name=NIOWorkerThread-1, state=WAITING, group=TGRP-JWTAuthPluginIntegrationTest]
at java.base@11.0.16.1/jdk.internal.misc.Unsafe.park(Native Method)
at java.base@11.0.16.1/java.util.concurrent.locks.LockSupport.park(LockSupport.java:194)
at java.base@11.0.16.1/java.util.concurrent.locks.AbstractQueuedSynchronizer$ConditionObject.await(AbstractQueuedSynchronizer.java:2081)
at java.base@11.0.16.1/java.util.concurrent.LinkedBlockingQueue.take(LinkedBlockingQueue.java:433)
at java.base@11.0.16.1/java.util.concurrent.ThreadPoolExecutor.getTask(ThreadPoolExecutor.java:1054)
at java.base@11.0.16.1/java.util.concurrent.ThreadPoolExecutor.runWorker(ThreadPoolExecutor.java:1114)
at java.base@11.0.16.1/java.util.concurrent.ThreadPoolExecutor$Worker.run(ThreadPoolExecutor.java:628)
at java.base@11.0.16.1/java.lang.Thread.run(Thread.java:829)
13) Thread[id=273, name=zkConnectionManagerCallback-130-thread-1, state=WAITING, group=TGRP-JWTAuthPluginIntegrationTest]
at java.base@11.0.16.1/jdk.internal.misc.Unsafe.park(Native Method)
at java.base@11.0.16.1/java.util.concurrent.locks.LockSupport.park(LockSupport.java:194)
at java.base@11.0.16.1/java.util.concurrent.locks.AbstractQueuedSynchronizer$ConditionObject.await(AbstractQueuedSynchronizer.java:2081)
at java.base@11.0.16.1/java.util.concurrent.LinkedBlockingQueue.take(LinkedBlockingQueue.java:433)
at java.base@11.0.16.1/java.util.concurrent.ThreadPoolExecutor.getTask(ThreadPoolExecutor.java:1054)
at java.base@11.0.16.1/java.util.concurrent.ThreadPoolExecutor.runWorker(ThreadPoolExecutor.java:1114)
at java.base@11.0.16.1/java.util.concurrent.ThreadPoolExecutor$Worker.run(ThreadPoolExecutor.java:628)
at java.base@11.0.16.1/java.lang.Thread.run(Thread.java:829)
14) Thread[id=282, name=qtp1976432022-282-acceptor-0@7a1d3182-ServerConnector@7b0a055f{HTTP/1.1, (http/1.1, h2c)}{127.0.0.1:39979}, state=RUNNABLE, group=TGRP-JWTAuthPluginIntegrationTest]
at java.base@11.0.16.1/sun.nio.ch.ServerSocketChannelImpl.accept0(Native Method)
at java.base@11.0.16.1/sun.nio.ch.ServerSocketChannelImpl.accept(ServerSocketChannelImpl.java:533)
at java.base@11.0.16.1/sun.nio.ch.ServerSocketChannelImpl.accept(ServerSocketChannelImpl.java:285)
at app//org.eclipse.jetty.server.ServerConnector.accept(ServerConnector.java:409)
at app//org.eclipse.jetty.server.AbstractConnector$Acceptor.run(AbstractConnector.java:748)
at app//org.eclipse.jetty.util.thread.QueuedThreadPool.runJob(QueuedThreadPool.java:969)
at app//org.eclipse.jetty.util.thread.QueuedThreadPool$Runner.doRunJob(QueuedThreadPool.java:1194)
at app//org.eclipse.jetty.util.thread.QueuedThreadPool$Runner.run(QueuedThreadPool.java:1149)
at java.base@11.0.16.1/java.lang.Thread.run(Thread.java:829)
15) Thread[id=281, name=qtp1604262369-281-acceptor-0@3a290a5-ServerConnector@5158fc62{HTTP/1.1, (http/1.1, h2c)}{127.0.0.1:37281}, state=RUNNABLE, group=TGRP-JWTAuthPluginIntegrationTest]
at java.base@11.0.16.1/sun.nio.ch.ServerSocketChannelImpl.accept0(Native Method)
at java.base@11.0.16.1/sun.nio.ch.ServerSocketChannelImpl.accept(ServerSocketChannelImpl.java:533)
at java.base@11.0.16.1/sun.nio.ch.ServerSocketChannelImpl.accept(ServerSocketChannelImpl.java:285)
at app//org.eclipse.jetty.server.ServerConnector.accept(ServerConnector.java:409)
at app//org.eclipse.jetty.server.AbstractConnector$Acceptor.run(AbstractConnector.java:748)
at app//org.eclipse.jetty.util.thread.QueuedThreadPool.runJob(QueuedThreadPool.java:969)
at app//org.eclipse.jetty.util.thread.QueuedThreadPool$Runner.doRunJob(QueuedThreadPool.java:1194)
at app//org.eclipse.jetty.util.thread.QueuedThreadPool$Runner.run(QueuedThreadPool.java:1149)
at java.base@11.0.16.1/java.lang.Thread.run(Thread.java:829)
16) Thread[id=294, name=qtp1976432022-294, state=TIMED_WAITING, group=TGRP-JWTAuthPluginIntegrationTest]
at java.base@11.0.16.1/jdk.internal.misc.Unsafe.park(Native Method)
at java.base@11.0.16.1/java.util.concurrent.locks.LockSupport.parkNanos(LockSupport.java:234)
at java.base@11.0.16.1/java.util.concurrent.locks.AbstractQueuedSynchronizer$ConditionObject.awaitNanos(AbstractQueuedSynchronizer.java:2123)
at app//org.eclipse.jetty.util.BlockingArrayQueue.poll(BlockingArrayQueue.java:219)
at app//org.eclipse.jetty.util.thread.QueuedThreadPool$Runner.idleJobPoll(QueuedThreadPool.java:1124)
at app//org.eclipse.jetty.util.thread.QueuedThreadPool$Runner.run(QueuedThreadPool.java:1141)
at java.base@11.0.16.1/java.lang.Thread.run(Thread.java:829)
17) Thread[id=256, name=ZkTestServer Run Thread, state=WAITING, group=TGRP-JWTAuthPluginIntegrationTest]
at java.base@11.0.16.1/java.lang.Object.wait(Native Method)
at java.base@11.0.16.1/java.lang.Thread.join(Thread.java:1300)
at java.base@11.0.16.1/java.lang.Thread.join(Thread.java:1375)
at app//org.apache.zookeeper.server.NIOServerCnxnFactory.join(NIOServerCnxnFactory.java:919)
at app//org.apache.solr.cloud.ZkTestServer$ZKServerMain.runFromConfig(ZkTestServer.java:337)
at app//org.apache.solr.cloud.ZkTestServer$1.run(ZkTestServer.java:581)
18) Thread[id=292, name=qtp1976432022-292, state=TIMED_WAITING, group=TGRP-JWTAuthPluginIntegrationTest]
at java.base@11.0.16.1/jdk.internal.misc.Unsafe.park(Native Method)
at java.base@11.0.16.1/java.util.concurrent.locks.LockSupport.parkNanos(LockSupport.java:234)
at java.base@11.0.16.1/java.util.concurrent.locks.AbstractQueuedSynchronizer$ConditionObject.awaitNanos(AbstractQueuedSynchronizer.java:2123)
at app//org.eclipse.jetty.util.BlockingArrayQueue.poll(BlockingArrayQueue.java:219)
at app//org.eclipse.jetty.util.thread.QueuedThreadPool$Runner.idleJobPoll(QueuedThreadPool.java:1124)
at app//org.eclipse.jetty.util.thread.QueuedThreadPool$Runner.run(QueuedThreadPool.java:1141)
at java.base@11.0.16.1/java.lang.Thread.run(Thread.java:829)
19) Thread[id=295, name=Session-HouseKeeper-6e0aa5a0-1, state=TIMED_WAITING, group=TGRP-JWTAuthPluginIntegrationTest]
at java.base@11.0.16.1/jdk.internal.misc.Unsafe.park(Native Method)
at java.base@11.0.16.1/java.util.concurrent.locks.LockSupport.parkNanos(LockSupport.java:234)
at java.base@11.0.16.1/java.util.concurrent.locks.AbstractQueuedSynchronizer$ConditionObject.awaitNanos(AbstractQueuedSynchronizer.java:2123)
at java.base@11.0.16.1/java.util.concurrent.ScheduledThreadPoolExecutor$DelayedWorkQueue.take(ScheduledThreadPoolExecutor.java:1182)
at java.base@11.0.16.1/java.util.concurrent.ScheduledThreadPoolExecutor$DelayedWorkQueue.take(ScheduledThreadPoolExecutor.java:899)
at java.base@11.0.16.1/java.util.concurrent.ThreadPoolExecutor.getTask(ThreadPoolExecutor.java:1054)
at java.base@11.0.16.1/java.util.concurrent.ThreadPoolExecutor.runWorker(ThreadPoolExecutor.java:1114)
at java.base@11.0.16.1/java.util.concurrent.ThreadPoolExecutor$Worker.run(ThreadPoolExecutor.java:628)
at java.base@11.0.16.1/java.lang.Thread.run(Thread.java:829)
20) Thread[id=313, name=h2sc-151-thread-1, state=RUNNABLE, group=TGRP-JWTAuthPluginIntegrationTest]
at java.base@11.0.16.1/sun.nio.ch.EPoll.wait(Native Method)
at java.base@11.0.16.1/sun.nio.ch.EPollSelectorImpl.doSelect(EPollSelectorImpl.java:120)
at java.base@11.0.16.1/sun.nio.ch.SelectorImpl.lockAndDoSelect(SelectorImpl.java:124)
at java.base@11.0.16.1/sun.nio.ch.SelectorImpl.select(SelectorImpl.java:141)
at app//org.eclipse.jetty.io.ManagedSelector.nioSelect(ManagedSelector.java:180)
at app//org.eclipse.jetty.io.ManagedSelector.select(ManagedSelector.java:187)
at app//org.eclipse.jetty.io.ManagedSelector$SelectorProducer.select(ManagedSelector.java:604)
at app//org.eclipse.jetty.io.ManagedSelector$SelectorProducer.produce(ManagedSelector.java:541)
at app//org.eclipse.jetty.util.thread.strategy.AdaptiveExecutionStrategy.produceTask(AdaptiveExecutionStrategy.java:450)
at app//org.eclipse.jetty.util.thread.strategy.AdaptiveExecutionStrategy.tryProduce(AdaptiveExecutionStrategy.java:243)
at app//org.eclipse.jetty.util.thread.strategy.AdaptiveExecutionStrategy.produce(AdaptiveExecutionStrategy.java:194)
at app//org.eclipse.jetty.io.ManagedSelector$$Lambda$356/0x0000000100586040.run(Unknown Source)
at app//org.apache.solr.common.util.ExecutorUtil$MDCAwareThreadPoolExecutor.lambda$execute$0(ExecutorUtil.java:289)
at app//org.apache.solr.common.util.ExecutorUtil$MDCAwareThreadPoolExecutor$$Lambda$275/0x000000010051fc40.run(Unknown Source)
at java.base@11.0.16.1/java.util.concurrent.ThreadPoolExecutor.runWorker(ThreadPoolExecutor.java:1128)
at java.base@11.0.16.1/java.util.concurrent.ThreadPoolExecutor$Worker.run(ThreadPoolExecutor.java:628)
at java.base@11.0.16.1/java.lang.Thread.run(Thread.java:829)
21) Thread[id=318, name=jetty-launcher-133-thread-1-EventThread, state=WAITING, group=TGRP-JWTAuthPluginIntegrationTest]
at java.base@11.0.16.1/jdk.internal.misc.Unsafe.park(Native Method)
at java.base@11.0.16.1/java.util.concurrent.locks.LockSupport.park(LockSupport.java:194)
at java.base@11.0.16.1/java.util.concurrent.locks.AbstractQueuedSynchronizer$ConditionObject.await(AbstractQueuedSynchronizer.java:2081)
at java.base@11.0.16.1/java.util.concurrent.LinkedBlockingQueue.take(LinkedBlockingQueue.java:433)
at app//org.apache.zookeeper.ClientCnxn$EventThread.run(ClientCnxn.java:534)
22) Thread[id=321, name=zkCallback-154-thread-1, state=TIMED_WAITING, group=TGRP-JWTAuthPluginIntegrationTest]
at java.base@11.0.16.1/jdk.internal.misc.Unsafe.park(Native Method)
at java.base@11.0.16.1/java.util.concurrent.locks.LockSupport.parkNanos(LockSupport.java:234)
at java.base@11.0.16.1/java.util.concurrent.SynchronousQueue$TransferStack.awaitFulfill(SynchronousQueue.java:462)
at java.base@11.0.16.1/java.util.concurrent.SynchronousQueue$TransferStack.transfer(SynchronousQueue.java:361)
at java.base@11.0.16.1/java.util.concurrent.SynchronousQueue.poll(SynchronousQueue.java:937)
at java.base@11.0.16.1/java.util.concurrent.ThreadPoolExecutor.getTask(ThreadPoolExecutor.java:1053)
at java.base@11.0.16.1/java.util.concurrent.ThreadPoolExecutor.runWorker(ThreadPoolExecutor.java:1114)
at java.base@11.0.16.1/java.util.concurrent.ThreadPoolExecutor$Worker.run(ThreadPoolExecutor.java:628)
at java.base@11.0.16.1/java.lang.Thread.run(Thread.java:829)
23) Thread[id=341, name=Connector-Scheduler-7b0a055f-1, state=TIMED_WAITING, group=TGRP-JWTAuthPluginIntegrationTest]
at java.base@11.0.16.1/jdk.internal.misc.Unsafe.park(Native Method)
at java.base@11.0.16.1/java.util.concurrent.locks.LockSupport.parkNanos(LockSupport.java:234)
at java.base@11.0.16.1/java.util.concurrent.locks.AbstractQueuedSynchronizer$ConditionObject.awaitNanos(AbstractQueuedSynchronizer.java:2123)
at java.base@11.0.16.1/java.util.concurrent.ScheduledThreadPoolExecutor$DelayedWorkQueue.take(ScheduledThreadPoolExecutor.java:1182)
at java.base@11.0.16.1/java.util.concurrent.ScheduledThreadPoolExecutor$DelayedWorkQueue.take(ScheduledThreadPoolExecutor.java:899)
at java.base@11.0.16.1/java.util.concurrent.ThreadPoolExecutor.getTask(ThreadPoolExecutor.java:1054)
at java.base@11.0.16.1/java.util.concurrent.ThreadPoolExecutor.runWorker(ThreadPoolExecutor.java:1114)
at java.base@11.0.16.1/java.util.concurrent.ThreadPoolExecutor$Worker.run(ThreadPoolExecutor.java:628)
at java.base@11.0.16.1/java.lang.Thread.run(Thread.java:829)
24) Thread[id=284, name=qtp1976432022-284, state=TIMED_WAITING, group=TGRP-JWTAuthPluginIntegrationTest]
at java.base@11.0.16.1/jdk.internal.misc.Unsafe.park(Native Method)
at java.base@11.0.16.1/java.util.concurrent.locks.LockSupport.parkNanos(LockSupport.java:234)
at java.base@11.0.16.1/java.util.concurrent.locks.AbstractQueuedSynchronizer$ConditionObject.awaitNanos(AbstractQueuedSynchronizer.java:2123)
at app//org.eclipse.jetty.util.BlockingArrayQueue.poll(BlockingArrayQueue.java:219)
at app//org.eclipse.jetty.util.thread.QueuedThreadPool$Runner.idleJobPoll(QueuedThreadPool.java:1124)
at app//org.eclipse.jetty.util.thread.QueuedThreadPool$Runner.run(QueuedThreadPool.java:1141)
at java.base@11.0.16.1/java.lang.Thread.run(Thread.java:829)
25) Thread[id=324, name=OverseerCollectionConfigSetProcessor-72411084713689093-127.0.0.1:37281_solr-n_0000000000, state=TIMED_WAITING, group=Overseer collection creation process.]
at java.base@11.0.16.1/jdk.internal.misc.Unsafe.park(Native Method)
at java.base@11.0.16.1/java.util.concurrent.locks.LockSupport.parkNanos(LockSupport.java:234)
at java.base@11.0.16.1/java.util.concurrent.locks.AbstractQueuedSynchronizer$ConditionObject.awaitNanos(AbstractQueuedSynchronizer.java:2123)
at app//org.apache.solr.cloud.ZkDistributedQueue.peekElements(ZkDistributedQueue.java:488)
at app//org.apache.solr.cloud.OverseerTaskQueue.peekTopN(OverseerTaskQueue.java:267)
at app//org.apache.solr.cloud.OverseerTaskProcessor.run(OverseerTaskProcessor.java:272)
at java.base@11.0.16.1/java.lang.Thread.run(Thread.java:829)
26) Thread[id=268, name=NIOWorkerThread-2, state=WAITING, group=TGRP-JWTAuthPluginIntegrationTest]
at java.base@11.0.16.1/jdk.internal.misc.Unsafe.park(Native Method)
at java.base@11.0.16.1/java.util.concurrent.locks.LockSupport.park(LockSupport.java:194)
at java.base@11.0.16.1/java.util.concurrent.locks.AbstractQueuedSynchronizer$ConditionObject.await(AbstractQueuedSynchronizer.java:2081)
at java.base@11.0.16.1/java.util.concurrent.LinkedBlockingQueue.take(LinkedBlockingQueue.java:433)
at java.base@11.0.16.1/java.util.concurrent.ThreadPoolExecutor.getTask(ThreadPoolExecutor.java:1054)
at java.base@11.0.16.1/java.util.concurrent.ThreadPoolExecutor.runWorker(ThreadPoolExecutor.java:1114)
at java.base@11.0.16.1/java.util.concurrent.ThreadPoolExecutor$Worker.run(ThreadPoolExecutor.java:628)
at java.base@11.0.16.1/java.lang.Thread.run(Thread.java:829)
27) Thread[id=291, name=qtp1604262369-291, state=TIMED_WAITING, group=TGRP-JWTAuthPluginIntegrationTest]
at java.base@11.0.16.1/jdk.internal.misc.Unsafe.park(Native Method)
at java.base@11.0.16.1/java.util.concurrent.locks.LockSupport.parkNanos(LockSupport.java:234)
at java.base@11.0.16.1/java.util.concurrent.locks.AbstractQueuedSynchronizer$ConditionObject.awaitNanos(AbstractQueuedSynchronizer.java:2123)
at app//org.eclipse.jetty.util.BlockingArrayQueue.poll(BlockingArrayQueue.java:219)
at app//org.eclipse.jetty.util.thread.QueuedThreadPool$Runner.idleJobPoll(QueuedThreadPool.java:1124)
at app//org.eclipse.jetty.util.thread.QueuedThreadPool$Runner.run(QueuedThreadPool.java:1141)
at java.base@11.0.16.1/java.lang.Thread.run(Thread.java:829)
28) Thread[id=305, name=httpShardExecutor-147-thread-1, state=RUNNABLE, group=TGRP-JWTAuthPluginIntegrationTest]
at java.base@11.0.16.1/sun.nio.ch.EPoll.wait(Native Method)
at java.base@11.0.16.1/sun.nio.ch.EPollSelectorImpl.doSelect(EPollSelectorImpl.java:120)
at java.base@11.0.16.1/sun.nio.ch.SelectorImpl.lockAndDoSelect(SelectorImpl.java:124)
at java.base@11.0.16.1/sun.nio.ch.SelectorImpl.select(SelectorImpl.java:141)
at app//org.eclipse.jetty.io.ManagedSelector.nioSelect(ManagedSelector.java:180)
at app//org.eclipse.jetty.io.ManagedSelector.select(ManagedSelector.java:187)
at app//org.eclipse.jetty.io.ManagedSelector$SelectorProducer.select(ManagedSelector.java:604)
at app//org.eclipse.jetty.io.ManagedSelector$SelectorProducer.produce(ManagedSelector.java:541)
at app//org.eclipse.jetty.util.thread.strategy.AdaptiveExecutionStrategy.produceTask(AdaptiveExecutionStrategy.java:450)
at app//org.eclipse.jetty.util.thread.strategy.AdaptiveExecutionStrategy.tryProduce(AdaptiveExecutionStrategy.java:243)
at app//org.eclipse.jetty.util.thread.strategy.AdaptiveExecutionStrategy.produce(AdaptiveExecutionStrategy.java:194)
at app//org.eclipse.jetty.io.ManagedSelector$$Lambda$356/0x0000000100586040.run(Unknown Source)
at app//org.apache.solr.common.util.ExecutorUtil$MDCAwareThreadPoolExecutor.lambda$execute$0(ExecutorUtil.java:289)
at app//org.apache.solr.common.util.ExecutorUtil$MDCAwareThreadPoolExecutor$$Lambda$275/0x000000010051fc40.run(Unknown Source)
at java.base@11.0.16.1/java.util.concurrent.ThreadPoolExecutor.runWorker(ThreadPoolExecutor.java:1128)
at java.base@11.0.16.1/java.util.concurrent.ThreadPoolExecutor$Worker.run(ThreadPoolExecutor.java:628)
at java.base@11.0.16.1/java.lang.Thread.run(Thread.java:829)
29) Thread[id=258, name=NIOServerCxnFactory.SelectorThread-0, state=RUNNABLE, group=TGRP-JWTAuthPluginIntegrationTest]
at java.base@11.0.16.1/sun.nio.ch.EPoll.wait(Native Method)
at java.base@11.0.16.1/sun.nio.ch.EPollSelectorImpl.doSelect(EPollSelectorImpl.java:120)
at java.base@11.0.16.1/sun.nio.ch.SelectorImpl.lockAndDoSelect(SelectorImpl.java:124)
at java.base@11.0.16.1/sun.nio.ch.SelectorImpl.select(SelectorImpl.java:141)
at app//org.apache.zookeeper.server.NIOServerCnxnFactory$SelectorThread.select(NIOServerCnxnFactory.java:403)
at app//org.apache.zookeeper.server.NIOServerCnxnFactory$SelectorThread.run(NIOServerCnxnFactory.java:368)
30) Thread[id=328, name=coreContainerWorkExecutor-139-thread-1, state=TIMED_WAITING, group=TGRP-JWTAuthPluginIntegrationTest]
at java.base@11.0.16.1/jdk.internal.misc.Unsafe.park(Native Method)
at java.base@11.0.16.1/java.util.concurrent.locks.LockSupport.parkNanos(LockSupport.java:234)
at java.base@11.0.16.1/java.util.concurrent.SynchronousQueue$TransferStack.awaitFulfill(SynchronousQueue.java:462)
at java.base@11.0.16.1/java.util.concurrent.SynchronousQueue$TransferStack.transfer(SynchronousQueue.java:361)
at java.base@11.0.16.1/java.util.concurrent.SynchronousQueue.poll(SynchronousQueue.java:937)
at java.base@11.0.16.1/java.util.concurrent.ThreadPoolExecutor.getTask(ThreadPoolExecutor.java:1053)
at java.base@11.0.16.1/java.util.concurrent.ThreadPoolExecutor.runWorker(ThreadPoolExecutor.java:1114)
at java.base@11.0.16.1/java.util.concurrent.ThreadPoolExecutor$Worker.run(ThreadPoolExecutor.java:628)
at java.base@11.0.16.1/java.lang.Thread.run(Thread.java:829)
31) Thread[id=289, name=qtp1604262369-289, state=TIMED_WAITING, group=TGRP-JWTAuthPluginIntegrationTest]
at java.base@11.0.16.1/jdk.internal.misc.Unsafe.park(Native Method)
at java.base@11.0.16.1/java.util.concurrent.locks.LockSupport.parkNanos(LockSupport.java:234)
at java.base@11.0.16.1/java.util.concurrent.locks.AbstractQueuedSynchronizer$ConditionObject.awaitNanos(AbstractQueuedSynchronizer.java:2123)
at app//org.eclipse.jetty.util.BlockingArrayQueue.poll(BlockingArrayQueue.java:219)
at app//org.eclipse.jetty.util.thread.QueuedThreadPool$Runner.idleJobPoll(QueuedThreadPool.java:1124)
at app//org.eclipse.jetty.util.thread.QueuedThreadPool$Runner.run(QueuedThreadPool.java:1141)
at java.base@11.0.16.1/java.lang.Thread.run(Thread.java:829)
32) Thread[id=331, name=TEST-JWTAuthPluginIntegrationTest.mockOAuth2Server-seed#[75397813C3C4D210]-EventThread, state=WAITING, group=TGRP-JWTAuthPluginIntegrationTest]
at java.base@11.0.16.1/jdk.internal.misc.Unsafe.park(Native Method)
at java.base@11.0.16.1/java.util.concurrent.locks.LockSupport.park(LockSupport.java:194)
at java.base@11.0.16.1/java.util.concurrent.locks.AbstractQueuedSynchronizer$ConditionObject.await(AbstractQueuedSynchronizer.java:2081)
at java.base@11.0.16.1/java.util.concurrent.LinkedBlockingQueue.take(LinkedBlockingQueue.java:433)
at app//org.apache.zookeeper.ClientCnxn$EventThread.run(ClientCnxn.java:534)
33) Thread[id=262, name=SyncThread:0, state=WAITING, group=TGRP-JWTAuthPluginIntegrationTest]
at java.base@11.0.16.1/jdk.internal.misc.Unsafe.park(Native Method)
at java.base@11.0.16.1/java.util.concurrent.locks.LockSupport.park(LockSupport.java:194)
at java.base@11.0.16.1/java.util.concurrent.locks.AbstractQueuedSynchronizer$ConditionObject.await(AbstractQueuedSynchronizer.java:2081)
at java.base@11.0.16.1/java.util.concurrent.LinkedBlockingQueue.take(LinkedBlockingQueue.java:433)
at app//org.apache.zookeeper.server.SyncRequestProcessor.run(SyncRequestProcessor.java:170)
34) Thread[id=307, name=httpShardExecutor-147-thread-2, state=RUNNABLE, group=TGRP-JWTAuthPluginIntegrationTest]
at java.base@11.0.16.1/sun.nio.ch.EPoll.wait(Native Method)
at java.base@11.0.16.1/sun.nio.ch.EPollSelectorImpl.doSelect(EPollSelectorImpl.java:120)
at java.base@11.0.16.1/sun.nio.ch.SelectorImpl.lockAndDoSelect(SelectorImpl.java:124)
at java.base@11.0.16.1/sun.nio.ch.SelectorImpl.select(SelectorImpl.java:141)
at app//org.eclipse.jetty.io.ManagedSelector.nioSelect(ManagedSelector.java:180)
at app//org.eclipse.jetty.io.ManagedSelector.select(ManagedSelector.java:187)
at app//org.eclipse.jetty.io.ManagedSelector$SelectorProducer.select(ManagedSelector.java:604)
at app//org.eclipse.jetty.io.ManagedSelector$SelectorProducer.produce(ManagedSelector.java:541)
at app//org.eclipse.jetty.util.thread.strategy.AdaptiveExecutionStrategy.produceTask(AdaptiveExecutionStrategy.java:450)
at app//org.eclipse.jetty.util.thread.strategy.AdaptiveExecutionStrategy.tryProduce(AdaptiveExecutionStrategy.java:243)
at app//org.eclipse.jetty.util.thread.strategy.AdaptiveExecutionStrategy.produce(AdaptiveExecutionStrategy.java:194)
at app//org.eclipse.jetty.io.ManagedSelector$$Lambda$356/0x0000000100586040.run(Unknown Source)
at app//org.apache.solr.common.util.ExecutorUtil$MDCAwareThreadPoolExecutor.lambda$execute$0(ExecutorUtil.java:289)
at app//org.apache.solr.common.util.ExecutorUtil$MDCAwareThreadPoolExecutor$$Lambda$275/0x000000010051fc40.run(Unknown Source)
at java.base@11.0.16.1/java.util.concurrent.ThreadPoolExecutor.runWorker(ThreadPoolExecutor.java:1128)
at java.base@11.0.16.1/java.util.concurrent.ThreadPoolExecutor$Worker.run(ThreadPoolExecutor.java:628)
at java.base@11.0.16.1/java.lang.Thread.run(Thread.java:829)
35) Thread[id=263, name=ProcessThread(sid:0 cport:40415):, state=WAITING, group=TGRP-JWTAuthPluginIntegrationTest]
at java.base@11.0.16.1/jdk.internal.misc.Unsafe.park(Native Method)
at java.base@11.0.16.1/java.util.concurrent.locks.LockSupport.park(LockSupport.java:194)
at java.base@11.0.16.1/java.util.concurrent.locks.AbstractQueuedSynchronizer$ConditionObject.await(AbstractQueuedSynchronizer.java:2081)
at java.base@11.0.16.1/java.util.concurrent.LinkedBlockingQueue.take(LinkedBlockingQueue.java:433)
at app//org.apache.zookeeper.server.PrepRequestProcessor.run(PrepRequestProcessor.java:142)
36) Thread[id=269, name=NIOWorkerThread-3, state=WAITING, group=TGRP-JWTAuthPluginIntegrationTest]
at java.base@11.0.16.1/jdk.internal.misc.Unsafe.park(Native Method)
at java.base@11.0.16.1/java.util.concurrent.locks.LockSupport.park(LockSupport.java:194)
at java.base@11.0.16.1/java.util.concurrent.locks.AbstractQueuedSynchronizer$ConditionObject.await(AbstractQueuedSynchronizer.java:2081)
at java.base@11.0.16.1/java.util.concurrent.LinkedBlockingQueue.take(LinkedBlockingQueue.java:433)
at java.base@11.0.16.1/java.util.concurrent.ThreadPoolExecutor.getTask(ThreadPoolExecutor.java:1054)
at java.base@11.0.16.1/java.util.concurrent.ThreadPoolExecutor.runWorker(ThreadPoolExecutor.java:1114)
at java.base@11.0.16.1/java.util.concurrent.ThreadPoolExecutor$Worker.run(ThreadPoolExecutor.java:628)
at java.base@11.0.16.1/java.lang.Thread.run(Thread.java:829)
37) Thread[id=260, name=NIOServerCxnFactory.AcceptThread:0.0.0.0/0.0.0.0:0, state=RUNNABLE, group=TGRP-JWTAuthPluginIntegrationTest]
at java.base@11.0.16.1/sun.nio.ch.EPoll.wait(Native Method)
at java.base@11.0.16.1/sun.nio.ch.EPollSelectorImpl.doSelect(EPollSelectorImpl.java:120)
at java.base@11.0.16.1/sun.nio.ch.SelectorImpl.lockAndDoSelect(SelectorImpl.java:124)
at java.base@11.0.16.1/sun.nio.ch.SelectorImpl.select(SelectorImpl.java:141)
at app//org.apache.zookeeper.server.NIOServerCnxnFactory$AcceptThread.select(NIOServerCnxnFactory.java:205)
at app//org.apache.zookeeper.server.NIOServerCnxnFactory$AcceptThread.run(NIOServerCnxnFactory.java:181)
38) Thread[id=325, name=CloserThread, state=WAITING, group=TGRP-JWTAuthPluginIntegrationTest]
at java.base@11.0.16.1/java.lang.Object.wait(Native Method)
at java.base@11.0.16.1/java.lang.Object.wait(Object.java:328)
at app//org.apache.solr.core.CloserThread.run(CoreContainer.java:2560)
39) Thread[id=286, name=qtp1976432022-286, state=TIMED_WAITING, group=TGRP-JWTAuthPluginIntegrationTest]
at java.base@11.0.16.1/jdk.internal.misc.Unsafe.park(Native Method)
at java.base@11.0.16.1/java.util.concurrent.locks.LockSupport.parkNanos(LockSupport.java:234)
at java.base@11.0.16.1/java.util.concurrent.locks.AbstractQueuedSynchronizer$ConditionObject.awaitNanos(AbstractQueuedSynchronizer.java:2123)
at app//org.eclipse.jetty.util.BlockingArrayQueue.poll(BlockingArrayQueue.java:219)
at app//org.eclipse.jetty.util.thread.QueuedThreadPool$Runner.idleJobPoll(QueuedThreadPool.java:1124)
at app//org.eclipse.jetty.util.thread.QueuedThreadPool$Runner.run(QueuedThreadPool.java:1141)
at java.base@11.0.16.1/java.lang.Thread.run(Thread.java:829)
40) Thread[id=317, name=jetty-launcher-133-thread-1-SendThread(127.0.0.1:40415), state=RUNNABLE, group=TGRP-JWTAuthPluginIntegrationTest]
at java.base@11.0.16.1/sun.nio.ch.EPoll.wait(Native Method)
at java.base@11.0.16.1/sun.nio.ch.EPollSelectorImpl.doSelect(EPollSelectorImpl.java:120)
at java.base@11.0.16.1/sun.nio.ch.SelectorImpl.lockAndDoSelect(SelectorImpl.java:124)
at java.base@11.0.16.1/sun.nio.ch.SelectorImpl.select(SelectorImpl.java:136)
at app//org.apache.zookeeper.ClientCnxnSocketNIO.doTransport(ClientCnxnSocketNIO.java:332)
at app//org.apache.zookeeper.ClientCnxn$SendThread.run(ClientCnxn.java:1274)
41) Thread[id=326, name=coreContainerWorkExecutor-143-thread-1, state=TIMED_WAITING, group=TGRP-JWTAuthPluginIntegrationTest]
at java.base@11.0.16.1/jdk.internal.misc.Unsafe.park(Native Method)
at java.base@11.0.16.1/java.util.concurrent.locks.LockSupport.parkNanos(LockSupport.java:234)
at java.base@11.0.16.1/java.util.concurrent.SynchronousQueue$TransferStack.awaitFulfill(SynchronousQueue.java:462)
at java.base@11.0.16.1/java.util.concurrent.SynchronousQueue$TransferStack.transfer(SynchronousQueue.java:361)
at java.base@11.0.16.1/java.util.concurrent.SynchronousQueue.poll(SynchronousQueue.java:937)
at java.base@11.0.16.1/java.util.concurrent.ThreadPoolExecutor.getTask(ThreadPoolExecutor.java:1053)
at java.base@11.0.16.1/java.util.concurrent.ThreadPoolExecutor.runWorker(ThreadPoolExecutor.java:1114)
at java.base@11.0.16.1/java.util.concurrent.ThreadPoolExecutor$Worker.run(ThreadPoolExecutor.java:628)
at java.base@11.0.16.1/java.lang.Thread.run(Thread.java:829)
42) Thread[id=272, name=TEST-JWTAuthPluginIntegrationTest.mockOAuth2Server-seed#[75397813C3C4D210]-EventThread, state=WAITING, group=TGRP-JWTAuthPluginIntegrationTest]
at java.base@11.0.16.1/jdk.internal.misc.Unsafe.park(Native Method)
at java.base@11.0.16.1/java.util.concurrent.locks.LockSupport.park(LockSupport.java:194)
at java.base@11.0.16.1/java.util.concurrent.locks.AbstractQueuedSynchronizer$ConditionObject.await(AbstractQueuedSynchronizer.java:2081)
at java.base@11.0.16.1/java.util.concurrent.LinkedBlockingQueue.take(LinkedBlockingQueue.java:433)
at app//org.apache.zookeeper.ClientCnxn$EventThread.run(ClientCnxn.java:534)
43) Thread[id=293, name=qtp1604262369-293, state=TIMED_WAITING, group=TGRP-JWTAuthPluginIntegrationTest]
at java.base@11.0.16.1/jdk.internal.misc.Unsafe.park(Native Method)
at java.base@11.0.16.1/java.util.concurrent.locks.LockSupport.parkNanos(LockSupport.java:234)
at java.base@11.0.16.1/java.util.concurrent.locks.AbstractQueuedSynchronizer$ConditionObject.awaitNanos(AbstractQueuedSynchronizer.java:2123)
at app//org.eclipse.jetty.util.BlockingArrayQueue.poll(BlockingArrayQueue.java:219)
at app//org.eclipse.jetty.util.thread.QueuedThreadPool$Runner.idleJobPoll(QueuedThreadPool.java:1124)
at app//org.eclipse.jetty.util.thread.QueuedThreadPool$Runner.run(QueuedThreadPool.java:1141)
at java.base@11.0.16.1/java.lang.Thread.run(Thread.java:829)
44) Thread[id=304, name=httpShardExecutor-146-thread-2, state=RUNNABLE, group=TGRP-JWTAuthPluginIntegrationTest]
at java.base@11.0.16.1/sun.nio.ch.EPoll.wait(Native Method)
at java.base@11.0.16.1/sun.nio.ch.EPollSelectorImpl.doSelect(EPollSelectorImpl.java:120)
at java.base@11.0.16.1/sun.nio.ch.SelectorImpl.lockAndDoSelect(SelectorImpl.java:124)
at java.base@11.0.16.1/sun.nio.ch.SelectorImpl.select(SelectorImpl.java:141)
at app//org.eclipse.jetty.io.ManagedSelector.nioSelect(ManagedSelector.java:180)
at app//org.eclipse.jetty.io.ManagedSelector.select(ManagedSelector.java:187)
at app//org.eclipse.jetty.io.ManagedSelector$SelectorProducer.select(ManagedSelector.java:604)
at app//org.eclipse.jetty.io.ManagedSelector$SelectorProducer.produce(ManagedSelector.java:541)
at app//org.eclipse.jetty.util.thread.strategy.AdaptiveExecutionStrategy.produceTask(AdaptiveExecutionStrategy.java:450)
at app//org.eclipse.jetty.util.thread.strategy.AdaptiveExecutionStrategy.tryProduce(AdaptiveExecutionStrategy.java:243)
at app//org.eclipse.jetty.util.thread.strategy.AdaptiveExecutionStrategy.produce(AdaptiveExecutionStrategy.java:194)
at app//org.eclipse.jetty.io.ManagedSelector$$Lambda$356/0x0000000100586040.run(Unknown Source)
at app//org.apache.solr.common.util.ExecutorUtil$MDCAwareThreadPoolExecutor.lambda$execute$0(ExecutorUtil.java:289)
at app//org.apache.solr.common.util.ExecutorUtil$MDCAwareThreadPoolExecutor$$Lambda$275/0x000000010051fc40.run(Unknown Source)
at java.base@11.0.16.1/java.util.concurrent.ThreadPoolExecutor.runWorker(ThreadPoolExecutor.java:1128)
at java.base@11.0.16.1/java.util.concurrent.ThreadPoolExecutor$Worker.run(ThreadPoolExecutor.java:628)
at java.base@11.0.16.1/java.lang.Thread.run(Thread.java:829)
45) Thread[id=287, name=qtp1604262369-287, state=TIMED_WAITING, group=TGRP-JWTAuthPluginIntegrationTest]
at java.base@11.0.16.1/jdk.internal.misc.Unsafe.park(Native Method)
at java.base@11.0.16.1/java.util.concurrent.locks.LockSupport.parkNanos(LockSupport.java:234)
at java.base@11.0.16.1/java.util.concurrent.locks.AbstractQueuedSynchronizer$ConditionObject.awaitNanos(AbstractQueuedSynchronizer.java:2123)
at app//org.eclipse.jetty.util.BlockingArrayQueue.poll(BlockingArrayQueue.java:219)
at app//org.eclipse.jetty.util.thread.QueuedThreadPool$Runner.idleJobPoll(QueuedThreadPool.java:1124)
at app//org.eclipse.jetty.util.thread.QueuedThreadPool$Runner.run(QueuedThreadPool.java:1141)
at java.base@11.0.16.1/java.lang.Thread.run(Thread.java:829)
46) Thread[id=279, name=qtp1976432022-279, state=RUNNABLE, group=TGRP-JWTAuthPluginIntegrationTest]
at java.base@11.0.16.1/sun.nio.ch.EPoll.wait(Native Method)
at java.base@11.0.16.1/sun.nio.ch.EPollSelectorImpl.doSelect(EPollSelectorImpl.java:120)
at java.base@11.0.16.1/sun.nio.ch.SelectorImpl.lockAndDoSelect(SelectorImpl.java:124)
at java.base@11.0.16.1/sun.nio.ch.SelectorImpl.select(SelectorImpl.java:141)
at app//org.eclipse.jetty.io.ManagedSelector.nioSelect(ManagedSelector.java:180)
at app//org.eclipse.jetty.io.ManagedSelector.select(ManagedSelector.java:187)
at app//org.eclipse.jetty.io.ManagedSelector$SelectorProducer.select(ManagedSelector.java:604)
at app//org.eclipse.jetty.io.ManagedSelector$SelectorProducer.produce(ManagedSelector.java:541)
at app//org.eclipse.jetty.util.thread.strategy.AdaptiveExecutionStrategy.produceTask(AdaptiveExecutionStrategy.java:450)
at app//org.eclipse.jetty.util.thread.strategy.AdaptiveExecutionStrategy.tryProduce(AdaptiveExecutionStrategy.java:243)
at app//org.eclipse.jetty.util.thread.strategy.AdaptiveExecutionStrategy.produce(AdaptiveExecutionStrategy.java:194)
at app//org.eclipse.jetty.io.ManagedSelector$$Lambda$356/0x0000000100586040.run(Unknown Source)
at app//org.eclipse.jetty.util.thread.QueuedThreadPool.runJob(QueuedThreadPool.java:969)
at app//org.eclipse.jetty.util.thread.QueuedThreadPool$Runner.doRunJob(QueuedThreadPool.java:1194)
at app//org.eclipse.jetty.util.thread.QueuedThreadPool$Runner.run(QueuedThreadPool.java:1149)
at java.base@11.0.16.1/java.lang.Thread.run(Thread.java:829)
47) Thread[id=285, name=qtp1604262369-285, state=TIMED_WAITING, group=TGRP-JWTAuthPluginIntegrationTest]
at java.base@11.0.16.1/jdk.internal.misc.Unsafe.park(Native Method)
at java.base@11.0.16.1/java.util.concurrent.locks.LockSupport.parkNanos(LockSupport.java:234)
at java.base@11.0.16.1/java.util.concurrent.locks.AbstractQueuedSynchronizer$ConditionObject.awaitNanos(AbstractQueuedSynchronizer.java:2123)
at app//org.eclipse.jetty.util.BlockingArrayQueue.poll(BlockingArrayQueue.java:219)
at app//org.eclipse.jetty.util.thread.QueuedThreadPool$Runner.idleJobPoll(QueuedThreadPool.java:1124)
at app//org.eclipse.jetty.util.thread.QueuedThreadPool$Runner.run(QueuedThreadPool.java:1141)
at java.base@11.0.16.1/java.lang.Thread.run(Thread.java:829)
48) Thread[id=322, name=zkCallback-156-thread-1, state=TIMED_WAITING, group=TGRP-JWTAuthPluginIntegrationTest]
at java.base@11.0.16.1/jdk.internal.misc.Unsafe.park(Native Method)
at java.base@11.0.16.1/java.util.concurrent.locks.LockSupport.parkNanos(LockSupport.java:234)
at java.base@11.0.16.1/java.util.concurrent.SynchronousQueue$TransferStack.awaitFulfill(SynchronousQueue.java:462)
at java.base@11.0.16.1/java.util.concurrent.SynchronousQueue$TransferStack.transfer(SynchronousQueue.java:361)
at java.base@11.0.16.1/java.util.concurrent.SynchronousQueue.poll(SynchronousQueue.java:937)
at java.base@11.0.16.1/java.util.concurrent.ThreadPoolExecutor.getTask(ThreadPoolExecutor.java:1053)
at java.base@11.0.16.1/java.util.concurrent.ThreadPoolExecutor.runWorker(ThreadPoolExecutor.java:1114)
at java.base@11.0.16.1/java.util.concurrent.ThreadPoolExecutor$Worker.run(ThreadPoolExecutor.java:628)
at java.base@11.0.16.1/java.lang.Thread.run(Thread.java:829)
49) Thread[id=327, name=CloserThread, state=WAITING, group=TGRP-JWTAuthPluginIntegrationTest]
at java.base@11.0.16.1/java.lang.Object.wait(Native Method)
at java.base@11.0.16.1/java.lang.Object.wait(Object.java:328)
at app//org.apache.solr.core.CloserThread.run(CoreContainer.java:2560)
50) Thread[id=330, name=TEST-JWTAuthPluginIntegrationTest.mockOAuth2Server-seed#[75397813C3C4D210]-SendThread(127.0.0.1:40415), state=RUNNABLE, group=TGRP-JWTAuthPluginIntegrationTest]
at java.base@11.0.16.1/sun.nio.ch.EPoll.wait(Native Method)
at java.base@11.0.16.1/sun.nio.ch.EPollSelectorImpl.doSelect(EPollSelectorImpl.java:120)
at java.base@11.0.16.1/sun.nio.ch.SelectorImpl.lockAndDoSelect(SelectorImpl.java:124)
at java.base@11.0.16.1/sun.nio.ch.SelectorImpl.select(SelectorImpl.java:136)
at app//org.apache.zookeeper.ClientCnxnSocketNIO.doTransport(ClientCnxnSocketNIO.java:332)
at app//org.apache.zookeeper.ClientCnxn$SendThread.run(ClientCnxn.java:1274)
51) Thread[id=264, name=RequestThrottler, state=WAITING, group=TGRP-JWTAuthPluginIntegrationTest]
at java.base@11.0.16.1/jdk.internal.misc.Unsafe.park(Native Method)
at java.base@11.0.16.1/java.util.concurrent.locks.LockSupport.park(LockSupport.java:194)
at java.base@11.0.16.1/java.util.concurrent.locks.AbstractQueuedSynchronizer$ConditionObject.await(AbstractQueuedSynchronizer.java:2081)
at java.base@11.0.16.1/java.util.concurrent.LinkedBlockingQueue.take(LinkedBlockingQueue.java:433)
at app//org.apache.zookeeper.server.RequestThrottler.run(RequestThrottler.java:147)
52) Thread[id=271, name=TEST-JWTAuthPluginIntegrationTest.mockOAuth2Server-seed#[75397813C3C4D210]-SendThread(127.0.0.1:40415), state=RUNNABLE, group=TGRP-JWTAuthPluginIntegrationTest]
at java.base@11.0.16.1/sun.nio.ch.EPoll.wait(Native Method)
at java.base@11.0.16.1/sun.nio.ch.EPollSelectorImpl.doSelect(EPollSelectorImpl.java:120)
at java.base@11.0.16.1/sun.nio.ch.SelectorImpl.lockAndDoSelect(SelectorImpl.java:124)
at java.base@11.0.16.1/sun.nio.ch.SelectorImpl.select(SelectorImpl.java:136)
at app//org.apache.zookeeper.ClientCnxnSocketNIO.doTransport(ClientCnxnSocketNIO.java:332)
at app//org.apache.zookeeper.ClientCnxn$SendThread.run(ClientCnxn.java:1274)
53) Thread[id=267, name=TEST-JWTAuthPluginIntegrationTest.mockOAuth2Server-seed#[75397813C3C4D210]-EventThread, state=WAITING, group=TGRP-JWTAuthPluginIntegrationTest]
at java.base@11.0.16.1/jdk.internal.misc.Unsafe.park(Native Method)
at java.base@11.0.16.1/java.util.concurrent.locks.LockSupport.park(LockSupport.java:194)
at java.base@11.0.16.1/java.util.concurrent.locks.AbstractQueuedSynchronizer$ConditionObject.await(AbstractQueuedSynchronizer.java:2081)
at java.base@11.0.16.1/java.util.concurrent.LinkedBlockingQueue.take(LinkedBlockingQueue.java:433)
at app//org.apache.zookeeper.ClientCnxn$EventThread.run(ClientCnxn.java:534)
54) Thread[id=332, name=zkConnectionManagerCallback-178-thread-1, state=WAITING, group=TGRP-JWTAuthPluginIntegrationTest]
at java.base@11.0.16.1/jdk.internal.misc.Unsafe.park(Native Method)
at java.base@11.0.16.1/java.util.concurrent.locks.LockSupport.park(LockSupport.java:194)
at java.base@11.0.16.1/java.util.concurrent.locks.AbstractQueuedSynchronizer$ConditionObject.await(AbstractQueuedSynchronizer.java:2081)
at java.base@11.0.16.1/java.util.concurrent.LinkedBlockingQueue.take(LinkedBlockingQueue.java:433)
at java.base@11.0.16.1/java.util.concurrent.ThreadPoolExecutor.getTask(ThreadPoolExecutor.java:1054)
at java.base@11.0.16.1/java.util.concurrent.ThreadPoolExecutor.runWorker(ThreadPoolExecutor.java:1114)
at java.base@11.0.16.1/java.util.concurrent.ThreadPoolExecutor$Worker.run(ThreadPoolExecutor.java:628)
at java.base@11.0.16.1/java.lang.Thread.run(Thread.java:829)
55) Thread[id=315, name=jetty-launcher-133-thread-2-SendThread(127.0.0.1:40415), state=RUNNABLE, group=TGRP-JWTAuthPluginIntegrationTest]
at java.base@11.0.16.1/sun.nio.ch.EPoll.wait(Native Method)
at java.base@11.0.16.1/sun.nio.ch.EPollSelectorImpl.doSelect(EPollSelectorImpl.java:120)
at java.base@11.0.16.1/sun.nio.ch.SelectorImpl.lockAndDoSelect(SelectorImpl.java:124)
at java.base@11.0.16.1/sun.nio.ch.SelectorImpl.select(SelectorImpl.java:136)
at app//org.apache.zookeeper.ClientCnxnSocketNIO.doTransport(ClientCnxnSocketNIO.java:332)
at app//org.apache.zookeeper.ClientCnxn$SendThread.run(ClientCnxn.java:1274)
56) Thread[id=280, name=qtp1604262369-280, state=RUNNABLE, group=TGRP-JWTAuthPluginIntegrationTest]
at java.base@11.0.16.1/sun.nio.ch.EPoll.wait(Native Method)
at java.base@11.0.16.1/sun.nio.ch.EPollSelectorImpl.doSelect(EPollSelectorImpl.java:120)
at java.base@11.0.16.1/sun.nio.ch.SelectorImpl.lockAndDoSelect(SelectorImpl.java:124)
at java.base@11.0.16.1/sun.nio.ch.SelectorImpl.select(SelectorImpl.java:141)
at app//org.eclipse.jetty.io.ManagedSelector.nioSelect(ManagedSelector.java:180)
at app//org.eclipse.jetty.io.ManagedSelector.select(ManagedSelector.java:187)
at app//org.eclipse.jetty.io.ManagedSelector$SelectorProducer.select(ManagedSelector.java:604)
at app//org.eclipse.jetty.io.ManagedSelector$SelectorProducer.produce(ManagedSelector.java:541)
at app//org.eclipse.jetty.util.thread.strategy.AdaptiveExecutionStrategy.produceTask(AdaptiveExecutionStrategy.java:450)
at app//org.eclipse.jetty.util.thread.strategy.AdaptiveExecutionStrategy.tryProduce(AdaptiveExecutionStrategy.java:243)
at app//org.eclipse.jetty.util.thread.strategy.AdaptiveExecutionStrategy.produce(AdaptiveExecutionStrategy.java:194)
at app//org.eclipse.jetty.io.ManagedSelector$$Lambda$356/0x0000000100586040.run(Unknown Source)
at app//org.eclipse.jetty.util.thread.QueuedThreadPool.runJob(QueuedThreadPool.java:969)
at app//org.eclipse.jetty.util.thread.QueuedThreadPool$Runner.doRunJob(QueuedThreadPool.java:1194)
at app//org.eclipse.jetty.util.thread.QueuedThreadPool$Runner.run(QueuedThreadPool.java:1149)
at java.base@11.0.16.1/java.lang.Thread.run(Thread.java:829)
57) Thread[id=288, name=qtp1976432022-288, state=TIMED_WAITING, group=TGRP-JWTAuthPluginIntegrationTest]
at java.base@11.0.16.1/jdk.internal.misc.Unsafe.park(Native Method)
at java.base@11.0.16.1/java.util.concurrent.locks.LockSupport.parkNanos(LockSupport.java:234)
at java.base@11.0.16.1/java.util.concurrent.locks.AbstractQueuedSynchronizer$ConditionObject.awaitNanos(AbstractQueuedSynchronizer.java:2123)
at app//org.eclipse.jetty.util.BlockingArrayQueue.poll(BlockingArrayQueue.java:219)
at app//org.eclipse.jetty.util.thread.QueuedThreadPool$Runner.idleJobPoll(QueuedThreadPool.java:1124)
at app//org.eclipse.jetty.util.thread.QueuedThreadPool$Runner.run(QueuedThreadPool.java:1141)
at java.base@11.0.16.1/java.lang.Thread.run(Thread.java:829)
58) Thread[id=290, name=qtp1976432022-290, state=TIMED_WAITING, group=TGRP-JWTAuthPluginIntegrationTest]
at java.base@11.0.16.1/jdk.internal.misc.Unsafe.park(Native Method)
at java.base@11.0.16.1/java.util.concurrent.locks.LockSupport.parkNanos(LockSupport.java:234)
at java.base@11.0.16.1/java.util.concurrent.locks.AbstractQueuedSynchronizer$ConditionObject.awaitNanos(AbstractQueuedSynchronizer.java:2123)
at app//org.eclipse.jetty.util.BlockingArrayQueue.poll(BlockingArrayQueue.java:219)
at app//org.eclipse.jetty.util.thread.QueuedThreadPool$Runner.idleJobPoll(QueuedThreadPool.java:1124)
at app//org.eclipse.jetty.util.thread.QueuedThreadPool$Runner.run(QueuedThreadPool.java:1141)
at java.base@11.0.16.1/java.lang.Thread.run(Thread.java:829)
59) Thread[id=311, name=h2sc-150-thread-1, state=RUNNABLE, group=TGRP-JWTAuthPluginIntegrationTest]
at java.base@11.0.16.1/sun.nio.ch.EPoll.wait(Native Method)
at java.base@11.0.16.1/sun.nio.ch.EPollSelectorImpl.doSelect(EPollSelectorImpl.java:120)
at java.base@11.0.16.1/sun.nio.ch.SelectorImpl.lockAndDoSelect(SelectorImpl.java:124)
at java.base@11.0.16.1/sun.nio.ch.SelectorImpl.select(SelectorImpl.java:141)
at app//org.eclipse.jetty.io.ManagedSelector.nioSelect(ManagedSelector.java:180)
at app//org.eclipse.jetty.io.ManagedSelector.select(ManagedSelector.java:187)
at app//org.eclipse.jetty.io.ManagedSelector$SelectorProducer.select(ManagedSelector.java:604)
at app//org.eclipse.jetty.io.ManagedSelector$SelectorProducer.produce(ManagedSelector.java:541)
at app//org.eclipse.jetty.util.thread.strategy.AdaptiveExecutionStrategy.produceTask(AdaptiveExecutionStrategy.java:450)
at app//org.eclipse.jetty.util.thread.strategy.AdaptiveExecutionStrategy.tryProduce(AdaptiveExecutionStrategy.java:243)
at app//org.eclipse.jetty.util.thread.strategy.AdaptiveExecutionStrategy.produce(AdaptiveExecutionStrategy.java:194)
at app//org.eclipse.jetty.io.ManagedSelector$$Lambda$356/0x0000000100586040.run(Unknown Source)
at app//org.apache.solr.common.util.ExecutorUtil$MDCAwareThreadPoolExecutor.lambda$execute$0(ExecutorUtil.java:289)
at app//org.apache.solr.common.util.ExecutorUtil$MDCAwareThreadPoolExecutor$$Lambda$275/0x000000010051fc40.run(Unknown Source)
at java.base@11.0.16.1/java.util.concurrent.ThreadPoolExecutor.runWorker(ThreadPoolExecutor.java:1128)
at java.base@11.0.16.1/java.util.concurrent.ThreadPoolExecutor$Worker.run(ThreadPoolExecutor.java:628)
at java.base@11.0.16.1/java.lang.Thread.run(Thread.java:829)
60) Thread[id=283, name=qtp1604262369-283, state=TIMED_WAITING, group=TGRP-JWTAuthPluginIntegrationTest]
at java.base@11.0.16.1/jdk.internal.misc.Unsafe.park(Native Method)
at java.base@11.0.16.1/java.util.concurrent.locks.LockSupport.parkNanos(LockSupport.java:234)
at java.base@11.0.16.1/java.util.concurrent.locks.AbstractQueuedSynchronizer$ConditionObject.awaitNanos(AbstractQueuedSynchronizer.java:2123)
at app//org.eclipse.jetty.util.BlockingArrayQueue.poll(BlockingArrayQueue.java:219)
at app//org.eclipse.jetty.util.thread.QueuedThreadPool$Runner.idleJobPoll(QueuedThreadPool.java:1124)
at app//org.eclipse.jetty.util.thread.QueuedThreadPool$Runner.run(QueuedThreadPool.java:1141)
at java.base@11.0.16.1/java.lang.Thread.run(Thread.java:829)
61) Thread[id=266, name=TEST-JWTAuthPluginIntegrationTest.mockOAuth2Server-seed#[75397813C3C4D210]-SendThread(127.0.0.1:40415), state=RUNNABLE, group=TGRP-JWTAuthPluginIntegrationTest]
at java.base@11.0.16.1/sun.nio.ch.EPoll.wait(Native Method)
at java.base@11.0.16.1/sun.nio.ch.EPollSelectorImpl.doSelect(EPollSelectorImpl.java:120)
at java.base@11.0.16.1/sun.nio.ch.SelectorImpl.lockAndDoSelect(SelectorImpl.java:124)
at java.base@11.0.16.1/sun.nio.ch.SelectorImpl.select(SelectorImpl.java:136)
at app//org.apache.zookeeper.ClientCnxnSocketNIO.doTransport(ClientCnxnSocketNIO.java:332)
at app//org.apache.zookeeper.ClientCnxn$SendThread.run(ClientCnxn.java:1274)
62) Thread[id=303, name=httpShardExecutor-146-thread-1, state=RUNNABLE, group=TGRP-JWTAuthPluginIntegrationTest]
at java.base@11.0.16.1/sun.nio.ch.EPoll.wait(Native Method)
at java.base@11.0.16.1/sun.nio.ch.EPollSelectorImpl.doSelect(EPollSelectorImpl.java:120)
at java.base@11.0.16.1/sun.nio.ch.SelectorImpl.lockAndDoSelect(SelectorImpl.java:124)
at java.base@11.0.16.1/sun.nio.ch.SelectorImpl.select(SelectorImpl.java:141)
at app//org.eclipse.jetty.io.ManagedSelector.nioSelect(ManagedSelector.java:180)
at app//org.eclipse.jetty.io.ManagedSelector.select(ManagedSelector.java:187)
at app//org.eclipse.jetty.io.ManagedSelector$SelectorProducer.select(ManagedSelector.java:604)
at app//org.eclipse.jetty.io.ManagedSelector$SelectorProducer.produce(ManagedSelector.java:541)
at app//org.eclipse.jetty.util.thread.strategy.AdaptiveExecutionStrategy.produceTask(AdaptiveExecutionStrategy.java:450)
at app//org.eclipse.jetty.util.thread.strategy.AdaptiveExecutionStrategy.tryProduce(AdaptiveExecutionStrategy.java:243)
at app//org.eclipse.jetty.util.thread.strategy.AdaptiveExecutionStrategy.produce(AdaptiveExecutionStrategy.java:194)
at app//org.eclipse.jetty.io.ManagedSelector$$Lambda$356/0x0000000100586040.run(Unknown Source)
at app//org.apache.solr.common.util.ExecutorUtil$MDCAwareThreadPoolExecutor.lambda$execute$0(ExecutorUtil.java:289)
at app//org.apache.solr.common.util.ExecutorUtil$MDCAwareThreadPoolExecutor$$Lambda$275/0x000000010051fc40.run(Unknown Source)
at java.base@11.0.16.1/java.util.concurrent.ThreadPoolExecutor.runWorker(ThreadPoolExecutor.java:1128)
at java.base@11.0.16.1/java.util.concurrent.ThreadPoolExecutor$Worker.run(ThreadPoolExecutor.java:628)
at java.base@11.0.16.1/java.lang.Thread.run(Thread.java:829)
Stack Trace:
com.carrotsearch.randomizedtesting.ThreadLeakError: 62 threads leaked from SUITE scope at org.apache.solr.security.jwt.JWTAuthPluginIntegrationTest:
1) Thread[id=312, name=h2sc-150-thread-2, state=RUNNABLE, group=TGRP-JWTAuthPluginIntegrationTest]
at java.base@11.0.16.1/sun.nio.ch.EPoll.wait(Native Method)
at java.base@11.0.16.1/sun.nio.ch.EPollSelectorImpl.doSelect(EPollSelectorImpl.java:120)
at java.base@11.0.16.1/sun.nio.ch.SelectorImpl.lockAndDoSelect(SelectorImpl.java:124)
at java.base@11.0.16.1/sun.nio.ch.SelectorImpl.select(SelectorImpl.java:141)
at app//org.eclipse.jetty.io.ManagedSelector.nioSelect(ManagedSelector.java:180)
at app//org.eclipse.jetty.io.ManagedSelector.select(ManagedSelector.java:187)
at app//org.eclipse.jetty.io.ManagedSelector$SelectorProducer.select(ManagedSelector.java:604)
at app//org.eclipse.jetty.io.ManagedSelector$SelectorProducer.produce(ManagedSelector.java:541)
at app//org.eclipse.jetty.util.thread.strategy.AdaptiveExecutionStrategy.produceTask(AdaptiveExecutionStrategy.java:450)
at app//org.eclipse.jetty.util.thread.strategy.AdaptiveExecutionStrategy.tryProduce(AdaptiveExecutionStrategy.java:243)
at app//org.eclipse.jetty.util.thread.strategy.AdaptiveExecutionStrategy.produce(AdaptiveExecutionStrategy.java:194)
at app//org.eclipse.jetty.io.ManagedSelector$$Lambda$356/0x0000000100586040.run(Unknown Source)
at app//org.apache.solr.common.util.ExecutorUtil$MDCAwareThreadPoolExecutor.lambda$execute$0(ExecutorUtil.java:289)
at app//org.apache.solr.common.util.ExecutorUtil$MDCAwareThreadPoolExecutor$$Lambda$275/0x000000010051fc40.run(Unknown Source)
at java.base@11.0.16.1/java.util.concurrent.ThreadPoolExecutor.runWorker(ThreadPoolExecutor.java:1128)
at java.base@11.0.16.1/java.util.concurrent.ThreadPoolExecutor$Worker.run(ThreadPoolExecutor.java:628)
at java.base@11.0.16.1/java.lang.Thread.run(Thread.java:829)
2) Thread[id=296, name=Session-HouseKeeper-6a313039-1, state=TIMED_WAITING, group=TGRP-JWTAuthPluginIntegrationTest]
at java.base@11.0.16.1/jdk.internal.misc.Unsafe.park(Native Method)
at java.base@11.0.16.1/java.util.concurrent.locks.LockSupport.parkNanos(LockSupport.java:234)
at java.base@11.0.16.1/java.util.concurrent.locks.AbstractQueuedSynchronizer$ConditionObject.awaitNanos(AbstractQueuedSynchronizer.java:2123)
at java.base@11.0.16.1/java.util.concurrent.ScheduledThreadPoolExecutor$DelayedWorkQueue.take(ScheduledThreadPoolExecutor.java:1182)
at java.base@11.0.16.1/java.util.concurrent.ScheduledThreadPoolExecutor$DelayedWorkQueue.take(ScheduledThreadPoolExecutor.java:899)
at java.base@11.0.16.1/java.util.concurrent.ThreadPoolExecutor.getTask(ThreadPoolExecutor.java:1054)
at java.base@11.0.16.1/java.util.concurrent.ThreadPoolExecutor.runWorker(ThreadPoolExecutor.java:1114)
at java.base@11.0.16.1/java.util.concurrent.ThreadPoolExecutor$Worker.run(ThreadPoolExecutor.java:628)
at java.base@11.0.16.1/java.lang.Thread.run(Thread.java:829)
3) Thread[id=314, name=h2sc-151-thread-2, state=RUNNABLE, group=TGRP-JWTAuthPluginIntegrationTest]
at java.base@11.0.16.1/sun.nio.ch.EPoll.wait(Native Method)
at java.base@11.0.16.1/sun.nio.ch.EPollSelectorImpl.doSelect(EPollSelectorImpl.java:120)
at java.base@11.0.16.1/sun.nio.ch.SelectorImpl.lockAndDoSelect(SelectorImpl.java:124)
at java.base@11.0.16.1/sun.nio.ch.SelectorImpl.select(SelectorImpl.java:141)
at app//org.eclipse.jetty.io.ManagedSelector.nioSelect(ManagedSelector.java:180)
at app//org.eclipse.jetty.io.ManagedSelector.select(ManagedSelector.java:187)
at app//org.eclipse.jetty.io.ManagedSelector$SelectorProducer.select(ManagedSelector.java:604)
at app//org.eclipse.jetty.io.ManagedSelector$SelectorProducer.produce(ManagedSelector.java:541)
at app//org.eclipse.jetty.util.thread.strategy.AdaptiveExecutionStrategy.produceTask(AdaptiveExecutionStrategy.java:450)
at app//org.eclipse.jetty.util.thread.strategy.AdaptiveExecutionStrategy.tryProduce(AdaptiveExecutionStrategy.java:243)
at app//org.eclipse.jetty.util.thread.strategy.AdaptiveExecutionStrategy.produce(AdaptiveExecutionStrategy.java:194)
at app//org.eclipse.jetty.io.ManagedSelector$$Lambda$356/0x0000000100586040.run(Unknown Source)
at app//org.apache.solr.common.util.ExecutorUtil$MDCAwareThreadPoolExecutor.lambda$execute$0(ExecutorUtil.java:289)
at app//org.apache.solr.common.util.ExecutorUtil$MDCAwareThreadPoolExecutor$$Lambda$275/0x000000010051fc40.run(Unknown Source)
at java.base@11.0.16.1/java.util.concurrent.ThreadPoolExecutor.runWorker(ThreadPoolExecutor.java:1128)
at java.base@11.0.16.1/java.util.concurrent.ThreadPoolExecutor$Worker.run(ThreadPoolExecutor.java:628)
at java.base@11.0.16.1/java.lang.Thread.run(Thread.java:829)
4) Thread[id=336, name=zkCallback-177-thread-1, state=TIMED_WAITING, group=TGRP-JWTAuthPluginIntegrationTest]
at java.base@11.0.16.1/jdk.internal.misc.Unsafe.park(Native Method)
at java.base@11.0.16.1/java.util.concurrent.locks.LockSupport.parkNanos(LockSupport.java:234)
at java.base@11.0.16.1/java.util.concurrent.SynchronousQueue$TransferStack.awaitFulfill(SynchronousQueue.java:462)
at java.base@11.0.16.1/java.util.concurrent.SynchronousQueue$TransferStack.transfer(SynchronousQueue.java:361)
at java.base@11.0.16.1/java.util.concurrent.SynchronousQueue.poll(SynchronousQueue.java:937)
at java.base@11.0.16.1/java.util.concurrent.ThreadPoolExecutor.getTask(ThreadPoolExecutor.java:1053)
at java.base@11.0.16.1/java.util.concurrent.ThreadPoolExecutor.runWorker(ThreadPoolExecutor.java:1114)
at java.base@11.0.16.1/java.util.concurrent.ThreadPoolExecutor$Worker.run(ThreadPoolExecutor.java:628)
at java.base@11.0.16.1/java.lang.Thread.run(Thread.java:829)
5) Thread[id=337, name=zkCallback-154-thread-2, state=TIMED_WAITING, group=TGRP-JWTAuthPluginIntegrationTest]
at java.base@11.0.16.1/jdk.internal.misc.Unsafe.park(Native Method)
at java.base@11.0.16.1/java.util.concurrent.locks.LockSupport.parkNanos(LockSupport.java:234)
at java.base@11.0.16.1/java.util.concurrent.SynchronousQueue$TransferStack.awaitFulfill(SynchronousQueue.java:462)
at java.base@11.0.16.1/java.util.concurrent.SynchronousQueue$TransferStack.transfer(SynchronousQueue.java:361)
at java.base@11.0.16.1/java.util.concurrent.SynchronousQueue.poll(SynchronousQueue.java:937)
at java.base@11.0.16.1/java.util.concurrent.ThreadPoolExecutor.getTask(ThreadPoolExecutor.java:1053)
at java.base@11.0.16.1/java.util.concurrent.ThreadPoolExecutor.runWorker(ThreadPoolExecutor.java:1114)
at java.base@11.0.16.1/java.util.concurrent.ThreadPoolExecutor$Worker.run(ThreadPoolExecutor.java:628)
at java.base@11.0.16.1/java.lang.Thread.run(Thread.java:829)
6) Thread[id=323, name=OverseerStateUpdate-72411084713689093-127.0.0.1:37281_solr-n_0000000000, state=TIMED_WAITING, group=Overseer state updater.]
at java.base@11.0.16.1/jdk.internal.misc.Unsafe.park(Native Method)
at java.base@11.0.16.1/java.util.concurrent.locks.LockSupport.parkNanos(LockSupport.java:234)
at java.base@11.0.16.1/java.util.concurrent.locks.AbstractQueuedSynchronizer$ConditionObject.awaitNanos(AbstractQueuedSynchronizer.java:2123)
at app//org.apache.solr.cloud.ZkDistributedQueue.peekElements(ZkDistributedQueue.java:488)
at app//org.apache.solr.cloud.Overseer$ClusterStateUpdater.run(Overseer.java:338)
at java.base@11.0.16.1/java.lang.Thread.run(Thread.java:829)
7) Thread[id=259, name=NIOServerCxnFactory.SelectorThread-1, state=RUNNABLE, group=TGRP-JWTAuthPluginIntegrationTest]
at java.base@11.0.16.1/sun.nio.ch.EPoll.wait(Native Method)
at java.base@11.0.16.1/sun.nio.ch.EPollSelectorImpl.doSelect(EPollSelectorImpl.java:120)
at java.base@11.0.16.1/sun.nio.ch.SelectorImpl.lockAndDoSelect(SelectorImpl.java:124)
at java.base@11.0.16.1/sun.nio.ch.SelectorImpl.select(SelectorImpl.java:141)
at app//org.apache.zookeeper.server.NIOServerCnxnFactory$SelectorThread.select(NIOServerCnxnFactory.java:403)
at app//org.apache.zookeeper.server.NIOServerCnxnFactory$SelectorThread.run(NIOServerCnxnFactory.java:368)
8) Thread[id=270, name=zkConnectionManagerCallback-128-thread-1, state=WAITING, group=TGRP-JWTAuthPluginIntegrationTest]
at java.base@11.0.16.1/jdk.internal.misc.Unsafe.park(Native Method)
at java.base@11.0.16.1/java.util.concurrent.locks.LockSupport.park(LockSupport.java:194)
at java.base@11.0.16.1/java.util.concurrent.locks.AbstractQueuedSynchronizer$ConditionObject.await(AbstractQueuedSynchronizer.java:2081)
at java.base@11.0.16.1/java.util.concurrent.LinkedBlockingQueue.take(LinkedBlockingQueue.java:433)
at java.base@11.0.16.1/java.util.concurrent.ThreadPoolExecutor.getTask(ThreadPoolExecutor.java:1054)
at java.base@11.0.16.1/java.util.concurrent.ThreadPoolExecutor.runWorker(ThreadPoolExecutor.java:1114)
at java.base@11.0.16.1/java.util.concurrent.ThreadPoolExecutor$Worker.run(ThreadPoolExecutor.java:628)
at java.base@11.0.16.1/java.lang.Thread.run(Thread.java:829)
9) Thread[id=320, name=zkConnectionManagerCallback-155-thread-1, state=WAITING, group=TGRP-JWTAuthPluginIntegrationTest]
at java.base@11.0.16.1/jdk.internal.misc.Unsafe.park(Native Method)
at java.base@11.0.16.1/java.util.concurrent.locks.LockSupport.park(LockSupport.java:194)
at java.base@11.0.16.1/java.util.concurrent.locks.AbstractQueuedSynchronizer$ConditionObject.await(AbstractQueuedSynchronizer.java:2081)
at java.base@11.0.16.1/java.util.concurrent.LinkedBlockingQueue.take(LinkedBlockingQueue.java:433)
at java.base@11.0.16.1/java.util.concurrent.ThreadPoolExecutor.getTask(ThreadPoolExecutor.java:1054)
at java.base@11.0.16.1/java.util.concurrent.ThreadPoolExecutor.runWorker(ThreadPoolExecutor.java:1114)
at java.base@11.0.16.1/java.util.concurrent.ThreadPoolExecutor$Worker.run(ThreadPoolExecutor.java:628)
at java.base@11.0.16.1/java.lang.Thread.run(Thread.java:829)
10) Thread[id=316, name=jetty-launcher-133-thread-2-EventThread, state=WAITING, group=TGRP-JWTAuthPluginIntegrationTest]
at java.base@11.0.16.1/jdk.internal.misc.Unsafe.park(Native Method)
at java.base@11.0.16.1/java.util.concurrent.locks.LockSupport.park(LockSupport.java:194)
at java.base@11.0.16.1/java.util.concurrent.locks.AbstractQueuedSynchronizer$ConditionObject.await(AbstractQueuedSynchronizer.java:2081)
at java.base@11.0.16.1/java.util.concurrent.LinkedBlockingQueue.take(LinkedBlockingQueue.java:433)
at app//org.apache.zookeeper.ClientCnxn$EventThread.run(ClientCnxn.java:534)
11) Thread[id=319, name=zkConnectionManagerCallback-157-thread-1, state=WAITING, group=TGRP-JWTAuthPluginIntegrationTest]
at java.base@11.0.16.1/jdk.internal.misc.Unsafe.park(Native Method)
at java.base@11.0.16.1/java.util.concurrent.locks.LockSupport.park(LockSupport.java:194)
at java.base@11.0.16.1/java.util.concurrent.locks.AbstractQueuedSynchronizer$ConditionObject.await(AbstractQueuedSynchronizer.java:2081)
at java.base@11.0.16.1/java.util.concurrent.LinkedBlockingQueue.take(LinkedBlockingQueue.java:433)
at java.base@11.0.16.1/java.util.concurrent.ThreadPoolExecutor.getTask(ThreadPoolExecutor.java:1054)
at java.base@11.0.16.1/java.util.concurrent.ThreadPoolExecutor.runWorker(ThreadPoolExecutor.java:1114)
at java.base@11.0.16.1/java.util.concurrent.ThreadPoolExecutor$Worker.run(ThreadPoolExecutor.java:628)
at java.base@11.0.16.1/java.lang.Thread.run(Thread.java:829)
12) Thread[id=265, name=NIOWorkerThread-1, state=WAITING, group=TGRP-JWTAuthPluginIntegrationTest]
at java.base@11.0.16.1/jdk.internal.misc.Unsafe.park(Native Method)
at java.base@11.0.16.1/java.util.concurrent.locks.LockSupport.park(LockSupport.java:194)
at java.base@11.0.16.1/java.util.concurrent.locks.AbstractQueuedSynchronizer$ConditionObject.await(AbstractQueuedSynchronizer.java:2081)
at java.base@11.0.16.1/java.util.concurrent.LinkedBlockingQueue.take(LinkedBlockingQueue.java:433)
at java.base@11.0.16.1/java.util.concurrent.ThreadPoolExecutor.getTask(ThreadPoolExecutor.java:1054)
at java.base@11.0.16.1/java.util.concurrent.ThreadPoolExecutor.runWorker(ThreadPoolExecutor.java:1114)
at java.base@11.0.16.1/java.util.concurrent.ThreadPoolExecutor$Worker.run(ThreadPoolExecutor.java:628)
at java.base@11.0.16.1/java.lang.Thread.run(Thread.java:829)
13) Thread[id=273, name=zkConnectionManagerCallback-130-thread-1, state=WAITING, group=TGRP-JWTAuthPluginIntegrationTest]
at java.base@11.0.16.1/jdk.internal.misc.Unsafe.park(Native Method)
at java.base@11.0.16.1/java.util.concurrent.locks.LockSupport.park(LockSupport.java:194)
at java.base@11.0.16.1/java.util.concurrent.locks.AbstractQueuedSynchronizer$ConditionObject.await(AbstractQueuedSynchronizer.java:2081)
at java.base@11.0.16.1/java.util.concurrent.LinkedBlockingQueue.take(LinkedBlockingQueue.java:433)
at java.base@11.0.16.1/java.util.concurrent.ThreadPoolExecutor.getTask(ThreadPoolExecutor.java:1054)
at java.base@11.0.16.1/java.util.concurrent.ThreadPoolExecutor.runWorker(ThreadPoolExecutor.java:1114)
at java.base@11.0.16.1/java.util.concurrent.ThreadPoolExecutor$Worker.run(ThreadPoolExecutor.java:628)
at java.base@11.0.16.1/java.lang.Thread.run(Thread.java:829)
14) Thread[id=282, name=qtp1976432022-282-acceptor-0@7a1d3182-ServerConnector@7b0a055f{HTTP/1.1, (http/1.1, h2c)}{127.0.0.1:39979}, state=RUNNABLE, group=TGRP-JWTAuthPluginIntegrationTest]
at java.base@11.0.16.1/sun.nio.ch.ServerSocketChannelImpl.accept0(Native Method)
at java.base@11.0.16.1/sun.nio.ch.ServerSocketChannelImpl.accept(ServerSocketChannelImpl.java:533)
at java.base@11.0.16.1/sun.nio.ch.ServerSocketChannelImpl.accept(ServerSocketChannelImpl.java:285)
at app//org.eclipse.jetty.server.ServerConnector.accept(ServerConnector.java:409)
at app//org.eclipse.jetty.server.AbstractConnector$Acceptor.run(AbstractConnector.java:748)
at app//org.eclipse.jetty.util.thread.QueuedThreadPool.runJob(QueuedThreadPool.java:969)
at app//org.eclipse.jetty.util.thread.QueuedThreadPool$Runner.doRunJob(QueuedThreadPool.java:1194)
at app//org.eclipse.jetty.util.thread.QueuedThreadPool$Runner.run(QueuedThreadPool.java:1149)
at java.base@11.0.16.1/java.lang.Thread.run(Thread.java:829)
15) Thread[id=281, name=qtp1604262369-281-acceptor-0@3a290a5-ServerConnector@5158fc62{HTTP/1.1, (http/1.1, h2c)}{127.0.0.1:37281}, state=RUNNABLE, group=TGRP-JWTAuthPluginIntegrationTest]
at java.base@11.0.16.1/sun.nio.ch.ServerSocketChannelImpl.accept0(Native Method)
at java.base@11.0.16.1/sun.nio.ch.ServerSocketChannelImpl.accept(ServerSocketChannelImpl.java:533)
at java.base@11.0.16.1/sun.nio.ch.ServerSocketChannelImpl.accept(ServerSocketChannelImpl.java:285)
at app//org.eclipse.jetty.server.ServerConnector.accept(ServerConnector.java:409)
at app//org.eclipse.jetty.server.AbstractConnector$Acceptor.run(AbstractConnector.java:748)
at app//org.eclipse.jetty.util.thread.QueuedThreadPool.runJob(QueuedThreadPool.java:969)
at app//org.eclipse.jetty.util.thread.QueuedThreadPool$Runner.doRunJob(QueuedThreadPool.java:1194)
at app//org.eclipse.jetty.util.thread.QueuedThreadPool$Runner.run(QueuedThreadPool.java:1149)
at java.base@11.0.16.1/java.lang.Thread.run(Thread.java:829)
16) Thread[id=294, name=qtp1976432022-294, state=TIMED_WAITING, group=TGRP-JWTAuthPluginIntegrationTest]
at java.base@11.0.16.1/jdk.internal.misc.Unsafe.park(Native Method)
at java.base@11.0.16.1/java.util.concurrent.locks.LockSupport.parkNanos(LockSupport.java:234)
at java.base@11.0.16.1/java.util.concurrent.locks.AbstractQueuedSynchronizer$ConditionObject.awaitNanos(AbstractQueuedSynchronizer.java:2123)
at app//org.eclipse.jetty.util.BlockingArrayQueue.poll(BlockingArrayQueue.java:219)
at app//org.eclipse.jetty.util.thread.QueuedThreadPool$Runner.idleJobPoll(QueuedThreadPool.java:1124)
at app//org.eclipse.jetty.util.thread.QueuedThreadPool$Runner.run(QueuedThreadPool.java:1141)
at java.base@11.0.16.1/java.lang.Thread.run(Thread.java:829)
17) Thread[id=256, name=ZkTestServer Run Thread, state=WAITING, group=TGRP-JWTAuthPluginIntegrationTest]
at java.base@11.0.16.1/java.lang.Object.wait(Native Method)
at java.base@11.0.16.1/java.lang.Thread.join(Thread.java:1300)
at java.base@11.0.16.1/java.lang.Thread.join(Thread.java:1375)
at app//org.apache.zookeeper.server.NIOServerCnxnFactory.join(NIOServerCnxnFactory.java:919)
at app//org.apache.solr.cloud.ZkTestServer$ZKServerMain.runFromConfig(ZkTestServer.java:337)
at app//org.apache.solr.cloud.ZkTestServer$1.run(ZkTestServer.java:581)
18) Thread[id=292, name=qtp1976432022-292, state=TIMED_WAITING, group=TGRP-JWTAuthPluginIntegrationTest]
at java.base@11.0.16.1/jdk.internal.misc.Unsafe.park(Native Method)
at java.base@11.0.16.1/java.util.concurrent.locks.LockSupport.parkNanos(LockSupport.java:234)
at java.base@11.0.16.1/java.util.concurrent.locks.AbstractQueuedSynchronizer$ConditionObject.awaitNanos(AbstractQueuedSynchronizer.java:2123)
at app//org.eclipse.jetty.util.BlockingArrayQueue.poll(BlockingArrayQueue.java:219)
at app//org.eclipse.jetty.util.thread.QueuedThreadPool$Runner.idleJobPoll(QueuedThreadPool.java:1124)
at app//org.eclipse.jetty.util.thread.QueuedThreadPool$Runner.run(QueuedThreadPool.java:1141)
at java.base@11.0.16.1/java.lang.Thread.run(Thread.java:829)
19) Thread[id=295, name=Session-HouseKeeper-6e0aa5a0-1, state=TIMED_WAITING, group=TGRP-JWTAuthPluginIntegrationTest]
at java.base@11.0.16.1/jdk.internal.misc.Unsafe.park(Native Method)
at java.base@11.0.16.1/java.util.concurrent.locks.LockSupport.parkNanos(LockSupport.java:234)
at java.base@11.0.16.1/java.util.concurrent.locks.AbstractQueuedSynchronizer$ConditionObject.awaitNanos(AbstractQueuedSynchronizer.java:2123)
at java.base@11.0.16.1/java.util.concurrent.ScheduledThreadPoolExecutor$DelayedWorkQueue.take(ScheduledThreadPoolExecutor.java:1182)
at java.base@11.0.16.1/java.util.concurrent.ScheduledThreadPoolExecutor$DelayedWorkQueue.take(ScheduledThreadPoolExecutor.java:899)
at java.base@11.0.16.1/java.util.concurrent.ThreadPoolExecutor.getTask(ThreadPoolExecutor.java:1054)
at java.base@11.0.16.1/java.util.concurrent.ThreadPoolExecutor.runWorker(ThreadPoolExecutor.java:1114)
at java.base@11.0.16.1/java.util.concurrent.ThreadPoolExecutor$Worker.run(ThreadPoolExecutor.java:628)
at java.base@11.0.16.1/java.lang.Thread.run(Thread.java:829)
20) Thread[id=313, name=h2sc-151-thread-1, state=RUNNABLE, group=TGRP-JWTAuthPluginIntegrationTest]
at java.base@11.0.16.1/sun.nio.ch.EPoll.wait(Native Method)
at java.base@11.0.16.1/sun.nio.ch.EPollSelectorImpl.doSelect(EPollSelectorImpl.java:120)
at java.base@11.0.16.1/sun.nio.ch.SelectorImpl.lockAndDoSelect(SelectorImpl.java:124)
at java.base@11.0.16.1/sun.nio.ch.SelectorImpl.select(SelectorImpl.java:141)
at app//org.eclipse.jetty.io.ManagedSelector.nioSelect(ManagedSelector.java:180)
at app//org.eclipse.jetty.io.ManagedSelector.select(ManagedSelector.java:187)
at app//org.eclipse.jetty.io.ManagedSelector$SelectorProducer.select(ManagedSelector.java:604)
at app//org.eclipse.jetty.io.ManagedSelector$SelectorProducer.produce(ManagedSelector.java:541)
at app//org.eclipse.jetty.util.thread.strategy.AdaptiveExecutionStrategy.produceTask(AdaptiveExecutionStrategy.java:450)
at app//org.eclipse.jetty.util.thread.strategy.AdaptiveExecutionStrategy.tryProduce(AdaptiveExecutionStrategy.java:243)
at app//org.eclipse.jetty.util.thread.strategy.AdaptiveExecutionStrategy.produce(AdaptiveExecutionStrategy.java:194)
at app//org.eclipse.jetty.io.ManagedSelector$$Lambda$356/0x0000000100586040.run(Unknown Source)
at app//org.apache.solr.common.util.ExecutorUtil$MDCAwareThreadPoolExecutor.lambda$execute$0(ExecutorUtil.java:289)
at app//org.apache.solr.common.util.ExecutorUtil$MDCAwareThreadPoolExecutor$$Lambda$275/0x000000010051fc40.run(Unknown Source)
at java.base@11.0.16.1/java.util.concurrent.ThreadPoolExecutor.runWorker(ThreadPoolExecutor.java:1128)
at java.base@11.0.16.1/java.util.concurrent.ThreadPoolExecutor$Worker.run(ThreadPoolExecutor.java:628)
at java.base@11.0.16.1/java.lang.Thread.run(Thread.java:829)
21) Thread[id=318, name=jetty-launcher-133-thread-1-EventThread, state=WAITING, group=TGRP-JWTAuthPluginIntegrationTest]
at java.base@11.0.16.1/jdk.internal.misc.Unsafe.park(Native Method)
at java.base@11.0.16.1/java.util.concurrent.locks.LockSupport.park(LockSupport.java:194)
at java.base@11.0.16.1/java.util.concurrent.locks.AbstractQueuedSynchronizer$ConditionObject.await(AbstractQueuedSynchronizer.java:2081)
at java.base@11.0.16.1/java.util.concurrent.LinkedBlockingQueue.take(LinkedBlockingQueue.java:433)
at app//org.apache.zookeeper.ClientCnxn$EventThread.run(ClientCnxn.java:534)
22) Thread[id=321, name=zkCallback-154-thread-1, state=TIMED_WAITING, group=TGRP-JWTAuthPluginIntegrationTest]
at java.base@11.0.16.1/jdk.internal.misc.Unsafe.park(Native Method)
at java.base@11.0.16.1/java.util.concurrent.locks.LockSupport.parkNanos(LockSupport.java:234)
at java.base@11.0.16.1/java.util.concurrent.SynchronousQueue$TransferStack.awaitFulfill(SynchronousQueue.java:462)
at java.base@11.0.16.1/java.util.concurrent.SynchronousQueue$TransferStack.transfer(SynchronousQueue.java:361)
at java.base@11.0.16.1/java.util.concurrent.SynchronousQueue.poll(SynchronousQueue.java:937)
at java.base@11.0.16.1/java.util.concurrent.ThreadPoolExecutor.getTask(ThreadPoolExecutor.java:1053)
at java.base@11.0.16.1/java.util.concurrent.ThreadPoolExecutor.runWorker(ThreadPoolExecutor.java:1114)
at java.base@11.0.16.1/java.util.concurrent.ThreadPoolExecutor$Worker.run(ThreadPoolExecutor.java:628)
at java.base@11.0.16.1/java.lang.Thread.run(Thread.java:829)
23) Thread[id=341, name=Connector-Scheduler-7b0a055f-1, state=TIMED_WAITING, group=TGRP-JWTAuthPluginIntegrationTest]
at java.base@11.0.16.1/jdk.internal.misc.Unsafe.park(Native Method)
at java.base@11.0.16.1/java.util.concurrent.locks.LockSupport.parkNanos(LockSupport.java:234)
at java.base@11.0.16.1/java.util.concurrent.locks.AbstractQueuedSynchronizer$ConditionObject.awaitNanos(AbstractQueuedSynchronizer.java:2123)
at java.base@11.0.16.1/java.util.concurrent.ScheduledThreadPoolExecutor$DelayedWorkQueue.take(ScheduledThreadPoolExecutor.java:1182)
at java.base@11.0.16.1/java.util.concurrent.ScheduledThreadPoolExecutor$DelayedWorkQueue.take(ScheduledThreadPoolExecutor.java:899)
at java.base@11.0.16.1/java.util.concurrent.ThreadPoolExecutor.getTask(ThreadPoolExecutor.java:1054)
at java.base@11.0.16.1/java.util.concurrent.Thr
[...truncated too long message...]
at java.base@11.0.16.1/sun.nio.ch.EPoll.wait(Native Method)
at java.base@11.0.16.1/sun.nio.ch.EPollSelectorImpl.doSelect(EPollSelectorImpl.java:120)
at java.base@11.0.16.1/sun.nio.ch.SelectorImpl.lockAndDoSelect(SelectorImpl.java:124)
at java.base@11.0.16.1/sun.nio.ch.SelectorImpl.select(SelectorImpl.java:136)
at app//org.apache.zookeeper.ClientCnxnSocketNIO.doTransport(ClientCnxnSocketNIO.java:332)
at app//org.apache.zookeeper.ClientCnxn$SendThread.run(ClientCnxn.java:1274)
51) Thread[id=303, name=httpShardExecutor-146-thread-1, state=RUNNABLE, group=TGRP-JWTAuthPluginIntegrationTest]
at java.base@11.0.16.1/sun.nio.ch.EPoll.wait(Native Method)
at java.base@11.0.16.1/sun.nio.ch.EPollSelectorImpl.doSelect(EPollSelectorImpl.java:120)
at java.base@11.0.16.1/sun.nio.ch.SelectorImpl.lockAndDoSelect(SelectorImpl.java:124)
at java.base@11.0.16.1/sun.nio.ch.SelectorImpl.select(SelectorImpl.java:141)
at app//org.eclipse.jetty.io.ManagedSelector.nioSelect(ManagedSelector.java:180)
at app//org.eclipse.jetty.io.ManagedSelector.select(ManagedSelector.java:187)
at app//org.eclipse.jetty.io.ManagedSelector$SelectorProducer.select(ManagedSelector.java:604)
at app//org.eclipse.jetty.io.ManagedSelector$SelectorProducer.produce(ManagedSelector.java:541)
at app//org.eclipse.jetty.util.thread.strategy.AdaptiveExecutionStrategy.produceTask(AdaptiveExecutionStrategy.java:450)
at app//org.eclipse.jetty.util.thread.strategy.AdaptiveExecutionStrategy.tryProduce(AdaptiveExecutionStrategy.java:243)
at app//org.eclipse.jetty.util.thread.strategy.AdaptiveExecutionStrategy.produce(AdaptiveExecutionStrategy.java:194)
at app//org.eclipse.jetty.io.ManagedSelector$$Lambda$356/0x0000000100586040.run(Unknown Source)
at app//org.apache.solr.common.util.ExecutorUtil$MDCAwareThreadPoolExecutor.lambda$execute$0(ExecutorUtil.java:289)
at app//org.apache.solr.common.util.ExecutorUtil$MDCAwareThreadPoolExecutor$$Lambda$275/0x000000010051fc40.run(Unknown Source)
at java.base@11.0.16.1/java.util.concurrent.ThreadPoolExecutor.runWorker(ThreadPoolExecutor.java:1128)
at java.base@11.0.16.1/java.util.concurrent.ThreadPoolExecutor$Worker.run(ThreadPoolExecutor.java:628)
at java.base@11.0.16.1/java.lang.Thread.run(Thread.java:829)
at __randomizedtesting.SeedInfo.seed([75397813C3C4D210]:0)
Build Log:
[...truncated 5300 lines...]
ERROR: The following test(s) have failed:
- org.apache.solr.security.jwt.JWTAuthPluginIntegrationTest.mockOAuth2Server (:solr:modules:jwt-auth)
Test output: /home/jenkins/jenkins-slave/workspace/Solr/Solr-BadApples-Tests-main/solr/modules/jwt-auth/build/test-results/test/outputs/OUTPUT-org.apache.solr.security.jwt.JWTAuthPluginIntegrationTest.txt
Reproduce with: gradlew :solr:modules:jwt-auth:test --tests "org.apache.solr.security.jwt.JWTAuthPluginIntegrationTest.mockOAuth2Server" -Ptests.jvms=4 -Ptests.haltonfailure=false "-Ptests.jvmargs=-XX:TieredStopAtLevel=1 -XX:+UseParallelGC -XX:ActiveProcessorCount=1 -XX:ReservedCodeCacheSize=120m" -Ptests.seed=75397813C3C4D210 -Ptests.multiplier=2 -Ptests.badapples=true -Ptests.file.encoding=US-ASCII
- org.apache.solr.security.jwt.JWTAuthPluginIntegrationTest.classMethod (:solr:modules:jwt-auth)
Test output: /home/jenkins/jenkins-slave/workspace/Solr/Solr-BadApples-Tests-main/solr/modules/jwt-auth/build/test-results/test/outputs/OUTPUT-org.apache.solr.security.jwt.JWTAuthPluginIntegrationTest.txt
Reproduce with: gradlew :solr:modules:jwt-auth:test --tests "org.apache.solr.security.jwt.JWTAuthPluginIntegrationTest.classMethod" -Ptests.jvms=4 -Ptests.haltonfailure=false "-Ptests.jvmargs=-XX:TieredStopAtLevel=1 -XX:+UseParallelGC -XX:ActiveProcessorCount=1 -XX:ReservedCodeCacheSize=120m" -Ptests.seed=75397813C3C4D210 -Ptests.multiplier=2 -Ptests.badapples=true -Ptests.file.encoding=US-ASCII
- org.apache.solr.security.jwt.JWTAuthPluginIntegrationTest.classMethod (:solr:modules:jwt-auth)
Test output: /home/jenkins/jenkins-slave/workspace/Solr/Solr-BadApples-Tests-main/solr/modules/jwt-auth/build/test-results/test/outputs/OUTPUT-org.apache.solr.security.jwt.JWTAuthPluginIntegrationTest.txt
Reproduce with: gradlew :solr:modules:jwt-auth:test --tests "org.apache.solr.security.jwt.JWTAuthPluginIntegrationTest.classMethod" -Ptests.jvms=4 -Ptests.haltonfailure=false "-Ptests.jvmargs=-XX:TieredStopAtLevel=1 -XX:+UseParallelGC -XX:ActiveProcessorCount=1 -XX:ReservedCodeCacheSize=120m" -Ptests.seed=75397813C3C4D210 -Ptests.multiplier=2 -Ptests.badapples=true -Ptests.file.encoding=US-ASCII
Deprecated Gradle features were used in this build, making it incompatible with Gradle 8.0.
You can use '--warning-mode all' to show the individual deprecation warnings and determine if they come from your own scripts or plugins.
See https://docs.gradle.org/7.6/userguide/command_line_interface.html#sec:command_line_warnings
BUILD SUCCESSFUL in 43m 45s
141 actionable tasks: 141 executed
Publishing build scan...
https://ge.apache.org/s/7dz32x2etu36s
Build step 'Invoke Gradle script' changed build result to SUCCESS
Archiving artifacts
hudson.FilePath$ValidateAntFileMask$1Cancel
at hudson.FilePath$ValidateAntFileMask$1.isCaseSensitive(FilePath.java:3300)
at org.apache.tools.ant.DirectoryScanner.isIncluded(DirectoryScanner.java:1370)
at org.apache.tools.ant.DirectoryScanner.scandir(DirectoryScanner.java:1241)
at org.apache.tools.ant.DirectoryScanner.scandir(DirectoryScanner.java:1267)
at org.apache.tools.ant.DirectoryScanner.scandir(DirectoryScanner.java:1267)
at org.apache.tools.ant.DirectoryScanner.scandir(DirectoryScanner.java:1267)
at org.apache.tools.ant.DirectoryScanner.scandir(DirectoryScanner.java:1267)
at org.apache.tools.ant.DirectoryScanner.scandir(DirectoryScanner.java:1267)
at org.apache.tools.ant.DirectoryScanner.scandir(DirectoryScanner.java:1194)
at org.apache.tools.ant.DirectoryScanner.scandir(DirectoryScanner.java:1156)
at org.apache.tools.ant.DirectoryScanner.checkIncludePatterns(DirectoryScanner.java:954)
at org.apache.tools.ant.DirectoryScanner.scan(DirectoryScanner.java:912)
at hudson.FilePath$ValidateAntFileMask.hasMatch(FilePath.java:3313)
Caused: hudson.FilePath$FileMaskNoMatchesFoundException: no matches found within 10000
at hudson.FilePath$ValidateAntFileMask.hasMatch(FilePath.java:3318)
at hudson.FilePath$ValidateAntFileMask.invoke(FilePath.java:3196)
at hudson.FilePath$ValidateAntFileMask.invoke(FilePath.java:3174)
at hudson.FilePath$FileCallableWrapper.call(FilePath.java:3578)
Also: hudson.remoting.Channel$CallSiteStackTrace: Remote call to lucene-solr-1
at hudson.remoting.Channel.attachCallSiteStackTrace(Channel.java:1784)
at hudson.remoting.UserRequest$ExceptionResponse.retrieve(UserRequest.java:356)
at hudson.remoting.Channel.call(Channel.java:1000)
at hudson.FilePath.act(FilePath.java:1192)
at hudson.FilePath.act(FilePath.java:1181)
at hudson.FilePath.validateAntFileMask(FilePath.java:3171)
at hudson.tasks.ArtifactArchiver.perform(ArtifactArchiver.java:271)
at hudson.tasks.BuildStepCompatibilityLayer.perform(BuildStepCompatibilityLayer.java:80)
at hudson.tasks.BuildStepMonitor$1.perform(BuildStepMonitor.java:20)
at hudson.model.AbstractBuild$AbstractBuildExecution.perform(AbstractBuild.java:818)
at hudson.model.AbstractBuild$AbstractBuildExecution.performAllBuildSteps(AbstractBuild.java:767)
at hudson.model.Build$BuildExecution.post2(Build.java:179)
at hudson.model.AbstractBuild$AbstractBuildExecution.post(AbstractBuild.java:711)
at hudson.model.Run.execute(Run.java:1925)
at hudson.model.FreeStyleBuild.run(FreeStyleBuild.java:44)
at hudson.model.ResourceController.execute(ResourceController.java:101)
at hudson.model.Executor.run(Executor.java:442)
Caused: hudson.FilePath$TunneledInterruptedException
at hudson.FilePath$FileCallableWrapper.call(FilePath.java:3580)
at hudson.remoting.UserRequest.perform(UserRequest.java:211)
at hudson.remoting.UserRequest.perform(UserRequest.java:54)
at hudson.remoting.Request$2.run(Request.java:377)
at hudson.remoting.InterceptingExecutorService.lambda$wrap$0(InterceptingExecutorService.java:78)
at java.base/java.util.concurrent.FutureTask.run(FutureTask.java:264)
at java.base/java.util.concurrent.ThreadPoolExecutor.runWorker(ThreadPoolExecutor.java:1128)
at java.base/java.util.concurrent.ThreadPoolExecutor$Worker.run(ThreadPoolExecutor.java:628)
at java.base/java.lang.Thread.run(Thread.java:829)
Caused: java.lang.InterruptedException: hudson.FilePath$FileMaskNoMatchesFoundException: no matches found within 10000
at hudson.FilePath.act(FilePath.java:1194)
at hudson.FilePath.act(FilePath.java:1181)
at hudson.FilePath.validateAntFileMask(FilePath.java:3171)
at hudson.tasks.ArtifactArchiver.perform(ArtifactArchiver.java:271)
at hudson.tasks.BuildStepCompatibilityLayer.perform(BuildStepCompatibilityLayer.java:80)
at hudson.tasks.BuildStepMonitor$1.perform(BuildStepMonitor.java:20)
at hudson.model.AbstractBuild$AbstractBuildExecution.perform(AbstractBuild.java:818)
at hudson.model.AbstractBuild$AbstractBuildExecution.performAllBuildSteps(AbstractBuild.java:767)
at hudson.model.Build$BuildExecution.post2(Build.java:179)
at hudson.model.AbstractBuild$AbstractBuildExecution.post(AbstractBuild.java:711)
at hudson.model.Run.execute(Run.java:1925)
at hudson.model.FreeStyleBuild.run(FreeStyleBuild.java:44)
at hudson.model.ResourceController.execute(ResourceController.java:101)
at hudson.model.Executor.run(Executor.java:442)
No artifacts found that match the file pattern "**/*.events,heapdumps/**,**/hs_err_pid*". Configuration error?
Recording test results
[Checks API] No suitable checks publisher found.
Build step 'Publish JUnit test result report' changed build result to UNSTABLE
Email was triggered for: Unstable (Test Failures)
Sending email for trigger: Unstable (Test Failures)
[JENKINS] Solr » Solr-BadApples-Tests-main - Build # 1105 - Still Unstable!
Posted by Apache Jenkins Server <je...@builds.apache.org>.
Build: https://ci-builds.apache.org/job/Solr/job/Solr-BadApples-Tests-main/1105/
3 tests failed.
FAILED: org.apache.solr.security.jwt.JWTAuthPluginIntegrationTest.mockOAuth2Server
Error Message:
org.junit.ComparisonFailure: expected:<[200]> but was:<[401]>
Stack Trace:
org.junit.ComparisonFailure: expected:<[200]> but was:<[401]>
at __randomizedtesting.SeedInfo.seed([E0AC17E008E3B44E:67ACF6B06D5F48A2]:0)
at org.junit.Assert.assertEquals(Assert.java:117)
at org.junit.Assert.assertEquals(Assert.java:146)
at org.apache.solr.security.jwt.JWTAuthPluginIntegrationTest.mockOAuth2Server(JWTAuthPluginIntegrationTest.java:141)
at java.base/jdk.internal.reflect.NativeMethodAccessorImpl.invoke0(Native Method)
at java.base/jdk.internal.reflect.NativeMethodAccessorImpl.invoke(NativeMethodAccessorImpl.java:62)
at java.base/jdk.internal.reflect.DelegatingMethodAccessorImpl.invoke(DelegatingMethodAccessorImpl.java:43)
at java.base/java.lang.reflect.Method.invoke(Method.java:566)
at com.carrotsearch.randomizedtesting.RandomizedRunner.invoke(RandomizedRunner.java:1758)
at com.carrotsearch.randomizedtesting.RandomizedRunner$8.evaluate(RandomizedRunner.java:946)
at com.carrotsearch.randomizedtesting.RandomizedRunner$9.evaluate(RandomizedRunner.java:982)
at com.carrotsearch.randomizedtesting.RandomizedRunner$10.evaluate(RandomizedRunner.java:996)
at com.carrotsearch.randomizedtesting.rules.SystemPropertiesRestoreRule$1.evaluate(SystemPropertiesRestoreRule.java:80)
at org.junit.rules.RunRules.evaluate(RunRules.java:20)
at org.apache.lucene.tests.util.TestRuleSetupTeardownChained$1.evaluate(TestRuleSetupTeardownChained.java:48)
at org.apache.lucene.tests.util.AbstractBeforeAfterRule$1.evaluate(AbstractBeforeAfterRule.java:43)
at org.apache.lucene.tests.util.TestRuleThreadAndTestName$1.evaluate(TestRuleThreadAndTestName.java:45)
at org.apache.lucene.tests.util.TestRuleIgnoreAfterMaxFailures$1.evaluate(TestRuleIgnoreAfterMaxFailures.java:60)
at org.apache.lucene.tests.util.TestRuleMarkFailure$1.evaluate(TestRuleMarkFailure.java:44)
at org.junit.rules.RunRules.evaluate(RunRules.java:20)
at com.carrotsearch.randomizedtesting.rules.StatementAdapter.evaluate(StatementAdapter.java:36)
at com.carrotsearch.randomizedtesting.ThreadLeakControl$StatementRunner.run(ThreadLeakControl.java:390)
at com.carrotsearch.randomizedtesting.ThreadLeakControl.forkTimeoutingTask(ThreadLeakControl.java:843)
at com.carrotsearch.randomizedtesting.ThreadLeakControl$3.evaluate(ThreadLeakControl.java:490)
at com.carrotsearch.randomizedtesting.RandomizedRunner.runSingleTest(RandomizedRunner.java:955)
at com.carrotsearch.randomizedtesting.RandomizedRunner$5.evaluate(RandomizedRunner.java:840)
at com.carrotsearch.randomizedtesting.RandomizedRunner$6.evaluate(RandomizedRunner.java:891)
at com.carrotsearch.randomizedtesting.RandomizedRunner$7.evaluate(RandomizedRunner.java:902)
at com.carrotsearch.randomizedtesting.rules.StatementAdapter.evaluate(StatementAdapter.java:36)
at com.carrotsearch.randomizedtesting.rules.StatementAdapter.evaluate(StatementAdapter.java:36)
at org.apache.lucene.tests.util.AbstractBeforeAfterRule$1.evaluate(AbstractBeforeAfterRule.java:43)
at com.carrotsearch.randomizedtesting.rules.SystemPropertiesRestoreRule$1.evaluate(SystemPropertiesRestoreRule.java:80)
at org.junit.rules.RunRules.evaluate(RunRules.java:20)
at org.apache.lucene.tests.util.AbstractBeforeAfterRule$1.evaluate(AbstractBeforeAfterRule.java:43)
at com.carrotsearch.randomizedtesting.rules.StatementAdapter.evaluate(StatementAdapter.java:36)
at org.apache.lucene.tests.util.TestRuleStoreClassName$1.evaluate(TestRuleStoreClassName.java:38)
at com.carrotsearch.randomizedtesting.rules.NoShadowingOrOverridesOnMethodsRule$1.evaluate(NoShadowingOrOverridesOnMethodsRule.java:40)
at com.carrotsearch.randomizedtesting.rules.NoShadowingOrOverridesOnMethodsRule$1.evaluate(NoShadowingOrOverridesOnMethodsRule.java:40)
at com.carrotsearch.randomizedtesting.rules.StatementAdapter.evaluate(StatementAdapter.java:36)
at com.carrotsearch.randomizedtesting.rules.StatementAdapter.evaluate(StatementAdapter.java:36)
at org.apache.lucene.tests.util.TestRuleAssertionsRequired$1.evaluate(TestRuleAssertionsRequired.java:53)
at org.apache.lucene.tests.util.AbstractBeforeAfterRule$1.evaluate(AbstractBeforeAfterRule.java:43)
at org.apache.lucene.tests.util.TestRuleMarkFailure$1.evaluate(TestRuleMarkFailure.java:44)
at org.apache.lucene.tests.util.TestRuleIgnoreAfterMaxFailures$1.evaluate(TestRuleIgnoreAfterMaxFailures.java:60)
at org.apache.lucene.tests.util.TestRuleIgnoreTestSuites$1.evaluate(TestRuleIgnoreTestSuites.java:47)
at org.junit.rules.RunRules.evaluate(RunRules.java:20)
at com.carrotsearch.randomizedtesting.rules.StatementAdapter.evaluate(StatementAdapter.java:36)
at com.carrotsearch.randomizedtesting.ThreadLeakControl$StatementRunner.run(ThreadLeakControl.java:390)
at com.carrotsearch.randomizedtesting.ThreadLeakControl.lambda$forkTimeoutingTask$0(ThreadLeakControl.java:850)
at java.base/java.lang.Thread.run(Thread.java:829)
FAILED: org.apache.solr.security.jwt.JWTAuthPluginIntegrationTest.classMethod
Error Message:
com.carrotsearch.randomizedtesting.ThreadLeakError: 61 threads leaked from SUITE scope at org.apache.solr.security.jwt.JWTAuthPluginIntegrationTest:
1) Thread[id=73, name=h2sc-25-thread-1, state=RUNNABLE, group=TGRP-JWTAuthPluginIntegrationTest]
at java.base@11.0.16.1/sun.nio.ch.EPoll.wait(Native Method)
at java.base@11.0.16.1/sun.nio.ch.EPollSelectorImpl.doSelect(EPollSelectorImpl.java:120)
at java.base@11.0.16.1/sun.nio.ch.SelectorImpl.lockAndDoSelect(SelectorImpl.java:124)
at java.base@11.0.16.1/sun.nio.ch.SelectorImpl.select(SelectorImpl.java:141)
at app//org.eclipse.jetty.io.ManagedSelector.nioSelect(ManagedSelector.java:180)
at app//org.eclipse.jetty.io.ManagedSelector.select(ManagedSelector.java:187)
at app//org.eclipse.jetty.io.ManagedSelector$SelectorProducer.select(ManagedSelector.java:604)
at app//org.eclipse.jetty.io.ManagedSelector$SelectorProducer.produce(ManagedSelector.java:541)
at app//org.eclipse.jetty.util.thread.strategy.AdaptiveExecutionStrategy.produceTask(AdaptiveExecutionStrategy.java:450)
at app//org.eclipse.jetty.util.thread.strategy.AdaptiveExecutionStrategy.tryProduce(AdaptiveExecutionStrategy.java:243)
at app//org.eclipse.jetty.util.thread.strategy.AdaptiveExecutionStrategy.produce(AdaptiveExecutionStrategy.java:194)
at app//org.eclipse.jetty.io.ManagedSelector$$Lambda$355/0x0000000100586040.run(Unknown Source)
at app//org.apache.solr.common.util.ExecutorUtil$MDCAwareThreadPoolExecutor.lambda$execute$0(ExecutorUtil.java:289)
at app//org.apache.solr.common.util.ExecutorUtil$MDCAwareThreadPoolExecutor$$Lambda$275/0x000000010051fc40.run(Unknown Source)
at java.base@11.0.16.1/java.util.concurrent.ThreadPoolExecutor.runWorker(ThreadPoolExecutor.java:1128)
at java.base@11.0.16.1/java.util.concurrent.ThreadPoolExecutor$Worker.run(ThreadPoolExecutor.java:628)
at java.base@11.0.16.1/java.lang.Thread.run(Thread.java:829)
2) Thread[id=85, name=OverseerStateUpdate-72416646544031749-127.0.0.1:39757_solr-n_0000000000, state=TIMED_WAITING, group=Overseer state updater.]
at java.base@11.0.16.1/jdk.internal.misc.Unsafe.park(Native Method)
at java.base@11.0.16.1/java.util.concurrent.locks.LockSupport.parkNanos(LockSupport.java:234)
at java.base@11.0.16.1/java.util.concurrent.locks.AbstractQueuedSynchronizer$ConditionObject.awaitNanos(AbstractQueuedSynchronizer.java:2123)
at app//org.apache.solr.cloud.ZkDistributedQueue.peekElements(ZkDistributedQueue.java:488)
at app//org.apache.solr.cloud.Overseer$ClusterStateUpdater.run(Overseer.java:338)
at java.base@11.0.16.1/java.lang.Thread.run(Thread.java:829)
3) Thread[id=55, name=qtp1450297482-55, state=TIMED_WAITING, group=TGRP-JWTAuthPluginIntegrationTest]
at java.base@11.0.16.1/jdk.internal.misc.Unsafe.park(Native Method)
at java.base@11.0.16.1/java.util.concurrent.locks.LockSupport.parkNanos(LockSupport.java:234)
at java.base@11.0.16.1/java.util.concurrent.locks.AbstractQueuedSynchronizer$ConditionObject.awaitNanos(AbstractQueuedSynchronizer.java:2123)
at app//org.eclipse.jetty.util.BlockingArrayQueue.poll(BlockingArrayQueue.java:219)
at app//org.eclipse.jetty.util.thread.QueuedThreadPool$Runner.idleJobPoll(QueuedThreadPool.java:1124)
at app//org.eclipse.jetty.util.thread.QueuedThreadPool$Runner.run(QueuedThreadPool.java:1141)
at java.base@11.0.16.1/java.lang.Thread.run(Thread.java:829)
4) Thread[id=65, name=httpShardExecutor-22-thread-1, state=RUNNABLE, group=TGRP-JWTAuthPluginIntegrationTest]
at java.base@11.0.16.1/sun.nio.ch.EPoll.wait(Native Method)
at java.base@11.0.16.1/sun.nio.ch.EPollSelectorImpl.doSelect(EPollSelectorImpl.java:120)
at java.base@11.0.16.1/sun.nio.ch.SelectorImpl.lockAndDoSelect(SelectorImpl.java:124)
at java.base@11.0.16.1/sun.nio.ch.SelectorImpl.select(SelectorImpl.java:141)
at app//org.eclipse.jetty.io.ManagedSelector.nioSelect(ManagedSelector.java:180)
at app//org.eclipse.jetty.io.ManagedSelector.select(ManagedSelector.java:187)
at app//org.eclipse.jetty.io.ManagedSelector$SelectorProducer.select(ManagedSelector.java:604)
at app//org.eclipse.jetty.io.ManagedSelector$SelectorProducer.produce(ManagedSelector.java:541)
at app//org.eclipse.jetty.util.thread.strategy.AdaptiveExecutionStrategy.produceTask(AdaptiveExecutionStrategy.java:450)
at app//org.eclipse.jetty.util.thread.strategy.AdaptiveExecutionStrategy.tryProduce(AdaptiveExecutionStrategy.java:243)
at app//org.eclipse.jetty.util.thread.strategy.AdaptiveExecutionStrategy.produce(AdaptiveExecutionStrategy.java:194)
at app//org.eclipse.jetty.io.ManagedSelector$$Lambda$355/0x0000000100586040.run(Unknown Source)
at app//org.apache.solr.common.util.ExecutorUtil$MDCAwareThreadPoolExecutor.lambda$execute$0(ExecutorUtil.java:289)
at app//org.apache.solr.common.util.ExecutorUtil$MDCAwareThreadPoolExecutor$$Lambda$275/0x000000010051fc40.run(Unknown Source)
at java.base@11.0.16.1/java.util.concurrent.ThreadPoolExecutor.runWorker(ThreadPoolExecutor.java:1128)
at java.base@11.0.16.1/java.util.concurrent.ThreadPoolExecutor$Worker.run(ThreadPoolExecutor.java:628)
at java.base@11.0.16.1/java.lang.Thread.run(Thread.java:829)
5) Thread[id=34, name=zkConnectionManagerCallback-5-thread-1, state=WAITING, group=TGRP-JWTAuthPluginIntegrationTest]
at java.base@11.0.16.1/jdk.internal.misc.Unsafe.park(Native Method)
at java.base@11.0.16.1/java.util.concurrent.locks.LockSupport.park(LockSupport.java:194)
at java.base@11.0.16.1/java.util.concurrent.locks.AbstractQueuedSynchronizer$ConditionObject.await(AbstractQueuedSynchronizer.java:2081)
at java.base@11.0.16.1/java.util.concurrent.LinkedBlockingQueue.take(LinkedBlockingQueue.java:433)
at java.base@11.0.16.1/java.util.concurrent.ThreadPoolExecutor.getTask(ThreadPoolExecutor.java:1054)
at java.base@11.0.16.1/java.util.concurrent.ThreadPoolExecutor.runWorker(ThreadPoolExecutor.java:1114)
at java.base@11.0.16.1/java.util.concurrent.ThreadPoolExecutor$Worker.run(ThreadPoolExecutor.java:628)
at java.base@11.0.16.1/java.lang.Thread.run(Thread.java:829)
6) Thread[id=80, name=jetty-launcher-8-thread-2-EventThread, state=WAITING, group=TGRP-JWTAuthPluginIntegrationTest]
at java.base@11.0.16.1/jdk.internal.misc.Unsafe.park(Native Method)
at java.base@11.0.16.1/java.util.concurrent.locks.LockSupport.park(LockSupport.java:194)
at java.base@11.0.16.1/java.util.concurrent.locks.AbstractQueuedSynchronizer$ConditionObject.await(AbstractQueuedSynchronizer.java:2081)
at java.base@11.0.16.1/java.util.concurrent.LinkedBlockingQueue.take(LinkedBlockingQueue.java:433)
at app//org.apache.zookeeper.ClientCnxn$EventThread.run(ClientCnxn.java:534)
7) Thread[id=49, name=qtp1912313968-49, state=TIMED_WAITING, group=TGRP-JWTAuthPluginIntegrationTest]
at java.base@11.0.16.1/jdk.internal.misc.Unsafe.park(Native Method)
at java.base@11.0.16.1/java.util.concurrent.locks.LockSupport.parkNanos(LockSupport.java:234)
at java.base@11.0.16.1/java.util.concurrent.locks.AbstractQueuedSynchronizer$ConditionObject.awaitNanos(AbstractQueuedSynchronizer.java:2123)
at app//org.eclipse.jetty.util.BlockingArrayQueue.poll(BlockingArrayQueue.java:219)
at app//org.eclipse.jetty.util.thread.QueuedThreadPool$Runner.idleJobPoll(QueuedThreadPool.java:1124)
at app//org.eclipse.jetty.util.thread.QueuedThreadPool$Runner.run(QueuedThreadPool.java:1141)
at java.base@11.0.16.1/java.lang.Thread.run(Thread.java:829)
8) Thread[id=52, name=qtp1450297482-52, state=TIMED_WAITING, group=TGRP-JWTAuthPluginIntegrationTest]
at java.base@11.0.16.1/jdk.internal.misc.Unsafe.park(Native Method)
at java.base@11.0.16.1/java.util.concurrent.locks.LockSupport.parkNanos(LockSupport.java:234)
at java.base@11.0.16.1/java.util.concurrent.locks.AbstractQueuedSynchronizer$ConditionObject.awaitNanos(AbstractQueuedSynchronizer.java:2123)
at app//org.eclipse.jetty.util.BlockingArrayQueue.poll(BlockingArrayQueue.java:219)
at app//org.eclipse.jetty.util.thread.QueuedThreadPool$Runner.idleJobPoll(QueuedThreadPool.java:1124)
at app//org.eclipse.jetty.util.thread.QueuedThreadPool$Runner.run(QueuedThreadPool.java:1141)
at java.base@11.0.16.1/java.lang.Thread.run(Thread.java:829)
9) Thread[id=79, name=jetty-launcher-8-thread-1-EventThread, state=WAITING, group=TGRP-JWTAuthPluginIntegrationTest]
at java.base@11.0.16.1/jdk.internal.misc.Unsafe.park(Native Method)
at java.base@11.0.16.1/java.util.concurrent.locks.LockSupport.park(LockSupport.java:194)
at java.base@11.0.16.1/java.util.concurrent.locks.AbstractQueuedSynchronizer$ConditionObject.await(AbstractQueuedSynchronizer.java:2081)
at java.base@11.0.16.1/java.util.concurrent.LinkedBlockingQueue.take(LinkedBlockingQueue.java:433)
at app//org.apache.zookeeper.ClientCnxn$EventThread.run(ClientCnxn.java:534)
10) Thread[id=46, name=qtp1450297482-46, state=TIMED_WAITING, group=TGRP-JWTAuthPluginIntegrationTest]
at java.base@11.0.16.1/jdk.internal.misc.Unsafe.park(Native Method)
at java.base@11.0.16.1/java.util.concurrent.locks.LockSupport.parkNanos(LockSupport.java:234)
at java.base@11.0.16.1/java.util.concurrent.locks.AbstractQueuedSynchronizer$ConditionObject.awaitNanos(AbstractQueuedSynchronizer.java:2123)
at app//org.eclipse.jetty.util.BlockingArrayQueue.poll(BlockingArrayQueue.java:219)
at app//org.eclipse.jetty.util.thread.QueuedThreadPool$Runner.idleJobPoll(QueuedThreadPool.java:1124)
at app//org.eclipse.jetty.util.thread.QueuedThreadPool$Runner.run(QueuedThreadPool.java:1141)
at java.base@11.0.16.1/java.lang.Thread.run(Thread.java:829)
11) Thread[id=53, name=qtp1450297482-53, state=TIMED_WAITING, group=TGRP-JWTAuthPluginIntegrationTest]
at java.base@11.0.16.1/jdk.internal.misc.Unsafe.park(Native Method)
at java.base@11.0.16.1/java.util.concurrent.locks.LockSupport.parkNanos(LockSupport.java:234)
at java.base@11.0.16.1/java.util.concurrent.locks.AbstractQueuedSynchronizer$ConditionObject.awaitNanos(AbstractQueuedSynchronizer.java:2123)
at app//org.eclipse.jetty.util.BlockingArrayQueue.poll(BlockingArrayQueue.java:219)
at app//org.eclipse.jetty.util.thread.QueuedThreadPool$Runner.idleJobPoll(QueuedThreadPool.java:1124)
at app//org.eclipse.jetty.util.thread.QueuedThreadPool$Runner.run(QueuedThreadPool.java:1141)
at java.base@11.0.16.1/java.lang.Thread.run(Thread.java:829)
12) Thread[id=56, name=qtp1912313968-56, state=TIMED_WAITING, group=TGRP-JWTAuthPluginIntegrationTest]
at java.base@11.0.16.1/jdk.internal.misc.Unsafe.park(Native Method)
at java.base@11.0.16.1/java.util.concurrent.locks.LockSupport.parkNanos(LockSupport.java:234)
at java.base@11.0.16.1/java.util.concurrent.locks.AbstractQueuedSynchronizer$ConditionObject.awaitNanos(AbstractQueuedSynchronizer.java:2123)
at app//org.eclipse.jetty.util.BlockingArrayQueue.poll(BlockingArrayQueue.java:219)
at app//org.eclipse.jetty.util.thread.QueuedThreadPool$Runner.idleJobPoll(QueuedThreadPool.java:1124)
at app//org.eclipse.jetty.util.thread.QueuedThreadPool$Runner.run(QueuedThreadPool.java:1141)
at java.base@11.0.16.1/java.lang.Thread.run(Thread.java:829)
13) Thread[id=57, name=Session-HouseKeeper-668cf821-1, state=TIMED_WAITING, group=TGRP-JWTAuthPluginIntegrationTest]
at java.base@11.0.16.1/jdk.internal.misc.Unsafe.park(Native Method)
at java.base@11.0.16.1/java.util.concurrent.locks.LockSupport.parkNanos(LockSupport.java:234)
at java.base@11.0.16.1/java.util.concurrent.locks.AbstractQueuedSynchronizer$ConditionObject.awaitNanos(AbstractQueuedSynchronizer.java:2123)
at java.base@11.0.16.1/java.util.concurrent.ScheduledThreadPoolExecutor$DelayedWorkQueue.take(ScheduledThreadPoolExecutor.java:1182)
at java.base@11.0.16.1/java.util.concurrent.ScheduledThreadPoolExecutor$DelayedWorkQueue.take(ScheduledThreadPoolExecutor.java:899)
at java.base@11.0.16.1/java.util.concurrent.ThreadPoolExecutor.getTask(ThreadPoolExecutor.java:1054)
at java.base@11.0.16.1/java.util.concurrent.ThreadPoolExecutor.runWorker(ThreadPoolExecutor.java:1114)
at java.base@11.0.16.1/java.util.concurrent.ThreadPoolExecutor$Worker.run(ThreadPoolExecutor.java:628)
at java.base@11.0.16.1/java.lang.Thread.run(Thread.java:829)
14) Thread[id=31, name=zkConnectionManagerCallback-3-thread-1, state=WAITING, group=TGRP-JWTAuthPluginIntegrationTest]
at java.base@11.0.16.1/jdk.internal.misc.Unsafe.park(Native Method)
at java.base@11.0.16.1/java.util.concurrent.locks.LockSupport.park(LockSupport.java:194)
at java.base@11.0.16.1/java.util.concurrent.locks.AbstractQueuedSynchronizer$ConditionObject.await(AbstractQueuedSynchronizer.java:2081)
at java.base@11.0.16.1/java.util.concurrent.LinkedBlockingQueue.take(LinkedBlockingQueue.java:433)
at java.base@11.0.16.1/java.util.concurrent.ThreadPoolExecutor.getTask(ThreadPoolExecutor.java:1054)
at java.base@11.0.16.1/java.util.concurrent.ThreadPoolExecutor.runWorker(ThreadPoolExecutor.java:1114)
at java.base@11.0.16.1/java.util.concurrent.ThreadPoolExecutor$Worker.run(ThreadPoolExecutor.java:628)
at java.base@11.0.16.1/java.lang.Thread.run(Thread.java:829)
15) Thread[id=84, name=zkCallback-30-thread-1, state=TIMED_WAITING, group=TGRP-JWTAuthPluginIntegrationTest]
at java.base@11.0.16.1/jdk.internal.misc.Unsafe.park(Native Method)
at java.base@11.0.16.1/java.util.concurrent.locks.LockSupport.parkNanos(LockSupport.java:234)
at java.base@11.0.16.1/java.util.concurrent.SynchronousQueue$TransferStack.awaitFulfill(SynchronousQueue.java:462)
at java.base@11.0.16.1/java.util.concurrent.SynchronousQueue$TransferStack.transfer(SynchronousQueue.java:361)
at java.base@11.0.16.1/java.util.concurrent.SynchronousQueue.poll(SynchronousQueue.java:937)
at java.base@11.0.16.1/java.util.concurrent.ThreadPoolExecutor.getTask(ThreadPoolExecutor.java:1053)
at java.base@11.0.16.1/java.util.concurrent.ThreadPoolExecutor.runWorker(ThreadPoolExecutor.java:1114)
at java.base@11.0.16.1/java.util.concurrent.ThreadPoolExecutor$Worker.run(ThreadPoolExecutor.java:628)
at java.base@11.0.16.1/java.lang.Thread.run(Thread.java:829)
16) Thread[id=29, name=NIOWorkerThread-2, state=WAITING, group=TGRP-JWTAuthPluginIntegrationTest]
at java.base@11.0.16.1/jdk.internal.misc.Unsafe.park(Native Method)
at java.base@11.0.16.1/java.util.concurrent.locks.LockSupport.park(LockSupport.java:194)
at java.base@11.0.16.1/java.util.concurrent.locks.AbstractQueuedSynchronizer$ConditionObject.await(AbstractQueuedSynchronizer.java:2081)
at java.base@11.0.16.1/java.util.concurrent.LinkedBlockingQueue.take(LinkedBlockingQueue.java:433)
at java.base@11.0.16.1/java.util.concurrent.ThreadPoolExecutor.getTask(ThreadPoolExecutor.java:1054)
at java.base@11.0.16.1/java.util.concurrent.ThreadPoolExecutor.runWorker(ThreadPoolExecutor.java:1114)
at java.base@11.0.16.1/java.util.concurrent.ThreadPoolExecutor$Worker.run(ThreadPoolExecutor.java:628)
at java.base@11.0.16.1/java.lang.Thread.run(Thread.java:829)
17) Thread[id=51, name=qtp1912313968-51, state=TIMED_WAITING, group=TGRP-JWTAuthPluginIntegrationTest]
at java.base@11.0.16.1/jdk.internal.misc.Unsafe.park(Native Method)
at java.base@11.0.16.1/java.util.concurrent.locks.LockSupport.parkNanos(LockSupport.java:234)
at java.base@11.0.16.1/java.util.concurrent.locks.AbstractQueuedSynchronizer$ConditionObject.awaitNanos(AbstractQueuedSynchronizer.java:2123)
at app//org.eclipse.jetty.util.BlockingArrayQueue.poll(BlockingArrayQueue.java:219)
at app//org.eclipse.jetty.util.thread.QueuedThreadPool$Runner.idleJobPoll(QueuedThreadPool.java:1124)
at app//org.eclipse.jetty.util.thread.QueuedThreadPool$Runner.run(QueuedThreadPool.java:1141)
at java.base@11.0.16.1/java.lang.Thread.run(Thread.java:829)
18) Thread[id=87, name=CloserThread, state=WAITING, group=TGRP-JWTAuthPluginIntegrationTest]
at java.base@11.0.16.1/java.lang.Object.wait(Native Method)
at java.base@11.0.16.1/java.lang.Object.wait(Object.java:328)
at app//org.apache.solr.core.CloserThread.run(CoreContainer.java:2595)
19) Thread[id=98, name=zkCallback-47-thread-1, state=TIMED_WAITING, group=TGRP-JWTAuthPluginIntegrationTest]
at java.base@11.0.16.1/jdk.internal.misc.Unsafe.park(Native Method)
at java.base@11.0.16.1/java.util.concurrent.locks.LockSupport.parkNanos(LockSupport.java:234)
at java.base@11.0.16.1/java.util.concurrent.SynchronousQueue$TransferStack.awaitFulfill(SynchronousQueue.java:462)
at java.base@11.0.16.1/java.util.concurrent.SynchronousQueue$TransferStack.transfer(SynchronousQueue.java:361)
at java.base@11.0.16.1/java.util.concurrent.SynchronousQueue.poll(SynchronousQueue.java:937)
at java.base@11.0.16.1/java.util.concurrent.ThreadPoolExecutor.getTask(ThreadPoolExecutor.java:1053)
at java.base@11.0.16.1/java.util.concurrent.ThreadPoolExecutor.runWorker(ThreadPoolExecutor.java:1114)
at java.base@11.0.16.1/java.util.concurrent.ThreadPoolExecutor$Worker.run(ThreadPoolExecutor.java:628)
at java.base@11.0.16.1/java.lang.Thread.run(Thread.java:829)
20) Thread[id=54, name=qtp1912313968-54, state=TIMED_WAITING, group=TGRP-JWTAuthPluginIntegrationTest]
at java.base@11.0.16.1/jdk.internal.misc.Unsafe.park(Native Method)
at java.base@11.0.16.1/java.util.concurrent.locks.LockSupport.parkNanos(LockSupport.java:234)
at java.base@11.0.16.1/java.util.concurrent.locks.AbstractQueuedSynchronizer$ConditionObject.awaitNanos(AbstractQueuedSynchronizer.java:2123)
at app//org.eclipse.jetty.util.BlockingArrayQueue.poll(BlockingArrayQueue.java:219)
at app//org.eclipse.jetty.util.thread.QueuedThreadPool$Runner.idleJobPoll(QueuedThreadPool.java:1124)
at app//org.eclipse.jetty.util.thread.QueuedThreadPool$Runner.run(QueuedThreadPool.java:1141)
at java.base@11.0.16.1/java.lang.Thread.run(Thread.java:829)
21) Thread[id=90, name=coreContainerWorkExecutor-15-thread-1, state=TIMED_WAITING, group=TGRP-JWTAuthPluginIntegrationTest]
at java.base@11.0.16.1/jdk.internal.misc.Unsafe.park(Native Method)
at java.base@11.0.16.1/java.util.concurrent.locks.LockSupport.parkNanos(LockSupport.java:234)
at java.base@11.0.16.1/java.util.concurrent.SynchronousQueue$TransferStack.awaitFulfill(SynchronousQueue.java:462)
at java.base@11.0.16.1/java.util.concurrent.SynchronousQueue$TransferStack.transfer(SynchronousQueue.java:361)
at java.base@11.0.16.1/java.util.concurrent.SynchronousQueue.poll(SynchronousQueue.java:937)
at java.base@11.0.16.1/java.util.concurrent.ThreadPoolExecutor.getTask(ThreadPoolExecutor.java:1053)
at java.base@11.0.16.1/java.util.concurrent.ThreadPoolExecutor.runWorker(ThreadPoolExecutor.java:1114)
at java.base@11.0.16.1/java.util.concurrent.ThreadPoolExecutor$Worker.run(ThreadPoolExecutor.java:628)
at java.base@11.0.16.1/java.lang.Thread.run(Thread.java:829)
22) Thread[id=28, name=TEST-JWTAuthPluginIntegrationTest.mockOAuth2Server-seed#[E0AC17E008E3B44E]-EventThread, state=WAITING, group=TGRP-JWTAuthPluginIntegrationTest]
at java.base@11.0.16.1/jdk.internal.misc.Unsafe.park(Native Method)
at java.base@11.0.16.1/java.util.concurrent.locks.LockSupport.park(LockSupport.java:194)
at java.base@11.0.16.1/java.util.concurrent.locks.AbstractQueuedSynchronizer$ConditionObject.await(AbstractQueuedSynchronizer.java:2081)
at java.base@11.0.16.1/java.util.concurrent.LinkedBlockingQueue.take(LinkedBlockingQueue.java:433)
at app//org.apache.zookeeper.ClientCnxn$EventThread.run(ClientCnxn.java:534)
23) Thread[id=21, name=NIOServerCxnFactory.AcceptThread:0.0.0.0/0.0.0.0:0, state=RUNNABLE, group=TGRP-JWTAuthPluginIntegrationTest]
at java.base@11.0.16.1/sun.nio.ch.EPoll.wait(Native Method)
at java.base@11.0.16.1/sun.nio.ch.EPollSelectorImpl.doSelect(EPollSelectorImpl.java:120)
at java.base@11.0.16.1/sun.nio.ch.SelectorImpl.lockAndDoSelect(SelectorImpl.java:124)
at java.base@11.0.16.1/sun.nio.ch.SelectorImpl.select(SelectorImpl.java:141)
at app//org.apache.zookeeper.server.NIOServerCnxnFactory$AcceptThread.select(NIOServerCnxnFactory.java:205)
at app//org.apache.zookeeper.server.NIOServerCnxnFactory$AcceptThread.run(NIOServerCnxnFactory.java:181)
24) Thread[id=50, name=qtp1450297482-50, state=TIMED_WAITING, group=TGRP-JWTAuthPluginIntegrationTest]
at java.base@11.0.16.1/jdk.internal.misc.Unsafe.park(Native Method)
at java.base@11.0.16.1/java.util.concurrent.locks.LockSupport.parkNanos(LockSupport.java:234)
at java.base@11.0.16.1/java.util.concurrent.locks.AbstractQueuedSynchronizer$ConditionObject.awaitNanos(AbstractQueuedSynchronizer.java:2123)
at app//org.eclipse.jetty.util.BlockingArrayQueue.poll(BlockingArrayQueue.java:219)
at app//org.eclipse.jetty.util.thread.QueuedThreadPool$Runner.idleJobPoll(QueuedThreadPool.java:1124)
at app//org.eclipse.jetty.util.thread.QueuedThreadPool$Runner.run(QueuedThreadPool.java:1141)
at java.base@11.0.16.1/java.lang.Thread.run(Thread.java:829)
25) Thread[id=88, name=CloserThread, state=WAITING, group=TGRP-JWTAuthPluginIntegrationTest]
at java.base@11.0.16.1/java.lang.Object.wait(Native Method)
at java.base@11.0.16.1/java.lang.Object.wait(Object.java:328)
at app//org.apache.solr.core.CloserThread.run(CoreContainer.java:2595)
26) Thread[id=89, name=coreContainerWorkExecutor-16-thread-1, state=TIMED_WAITING, group=TGRP-JWTAuthPluginIntegrationTest]
at java.base@11.0.16.1/jdk.internal.misc.Unsafe.park(Native Method)
at java.base@11.0.16.1/java.util.concurrent.locks.LockSupport.parkNanos(LockSupport.java:234)
at java.base@11.0.16.1/java.util.concurrent.SynchronousQueue$TransferStack.awaitFulfill(SynchronousQueue.java:462)
at java.base@11.0.16.1/java.util.concurrent.SynchronousQueue$TransferStack.transfer(SynchronousQueue.java:361)
at java.base@11.0.16.1/java.util.concurrent.SynchronousQueue.poll(SynchronousQueue.java:937)
at java.base@11.0.16.1/java.util.concurrent.ThreadPoolExecutor.getTask(ThreadPoolExecutor.java:1053)
at java.base@11.0.16.1/java.util.concurrent.ThreadPoolExecutor.runWorker(ThreadPoolExecutor.java:1114)
at java.base@11.0.16.1/java.util.concurrent.ThreadPoolExecutor$Worker.run(ThreadPoolExecutor.java:628)
at java.base@11.0.16.1/java.lang.Thread.run(Thread.java:829)
27) Thread[id=83, name=zkCallback-29-thread-1, state=TIMED_WAITING, group=TGRP-JWTAuthPluginIntegrationTest]
at java.base@11.0.16.1/jdk.internal.misc.Unsafe.park(Native Method)
at java.base@11.0.16.1/java.util.concurrent.locks.LockSupport.parkNanos(LockSupport.java:234)
at java.base@11.0.16.1/java.util.concurrent.SynchronousQueue$TransferStack.awaitFulfill(SynchronousQueue.java:462)
at java.base@11.0.16.1/java.util.concurrent.SynchronousQueue$TransferStack.transfer(SynchronousQueue.java:361)
at java.base@11.0.16.1/java.util.concurrent.SynchronousQueue.poll(SynchronousQueue.java:937)
at java.base@11.0.16.1/java.util.concurrent.ThreadPoolExecutor.getTask(ThreadPoolExecutor.java:1053)
at java.base@11.0.16.1/java.util.concurrent.ThreadPoolExecutor.runWorker(ThreadPoolExecutor.java:1114)
at java.base@11.0.16.1/java.util.concurrent.ThreadPoolExecutor$Worker.run(ThreadPoolExecutor.java:628)
at java.base@11.0.16.1/java.lang.Thread.run(Thread.java:829)
28) Thread[id=92, name=TEST-JWTAuthPluginIntegrationTest.mockOAuth2Server-seed#[E0AC17E008E3B44E]-SendThread(127.0.0.1:41873), state=RUNNABLE, group=TGRP-JWTAuthPluginIntegrationTest]
at java.base@11.0.16.1/sun.nio.ch.EPoll.wait(Native Method)
at java.base@11.0.16.1/sun.nio.ch.EPollSelectorImpl.doSelect(EPollSelectorImpl.java:120)
at java.base@11.0.16.1/sun.nio.ch.SelectorImpl.lockAndDoSelect(SelectorImpl.java:124)
at java.base@11.0.16.1/sun.nio.ch.SelectorImpl.select(SelectorImpl.java:136)
at app//org.apache.zookeeper.ClientCnxnSocketNIO.doTransport(ClientCnxnSocketNIO.java:332)
at app//org.apache.zookeeper.ClientCnxn$SendThread.run(ClientCnxn.java:1274)
29) Thread[id=78, name=jetty-launcher-8-thread-2-SendThread(127.0.0.1:41873), state=RUNNABLE, group=TGRP-JWTAuthPluginIntegrationTest]
at java.base@11.0.16.1/sun.nio.ch.EPoll.wait(Native Method)
at java.base@11.0.16.1/sun.nio.ch.EPollSelectorImpl.doSelect(EPollSelectorImpl.java:120)
at java.base@11.0.16.1/sun.nio.ch.SelectorImpl.lockAndDoSelect(SelectorImpl.java:124)
at java.base@11.0.16.1/sun.nio.ch.SelectorImpl.select(SelectorImpl.java:136)
at app//org.apache.zookeeper.ClientCnxnSocketNIO.doTransport(ClientCnxnSocketNIO.java:332)
at app//org.apache.zookeeper.ClientCnxn$SendThread.run(ClientCnxn.java:1274)
30) Thread[id=58, name=Session-HouseKeeper-49e7d499-1, state=TIMED_WAITING, group=TGRP-JWTAuthPluginIntegrationTest]
at java.base@11.0.16.1/jdk.internal.misc.Unsafe.park(Native Method)
at java.base@11.0.16.1/java.util.concurrent.locks.LockSupport.parkNanos(LockSupport.java:234)
at java.base@11.0.16.1/java.util.concurrent.locks.AbstractQueuedSynchronizer$ConditionObject.awaitNanos(AbstractQueuedSynchronizer.java:2123)
at java.base@11.0.16.1/java.util.concurrent.ScheduledThreadPoolExecutor$DelayedWorkQueue.take(ScheduledThreadPoolExecutor.java:1182)
at java.base@11.0.16.1/java.util.concurrent.ScheduledThreadPoolExecutor$DelayedWorkQueue.take(ScheduledThreadPoolExecutor.java:899)
at java.base@11.0.16.1/java.util.concurrent.ThreadPoolExecutor.getTask(ThreadPoolExecutor.java:1054)
at java.base@11.0.16.1/java.util.concurrent.ThreadPoolExecutor.runWorker(ThreadPoolExecutor.java:1114)
at java.base@11.0.16.1/java.util.concurrent.ThreadPoolExecutor$Worker.run(ThreadPoolExecutor.java:628)
at java.base@11.0.16.1/java.lang.Thread.run(Thread.java:829)
31) Thread[id=25, name=RequestThrottler, state=WAITING, group=TGRP-JWTAuthPluginIntegrationTest]
at java.base@11.0.16.1/jdk.internal.misc.Unsafe.park(Native Method)
at java.base@11.0.16.1/java.util.concurrent.locks.LockSupport.park(LockSupport.java:194)
at java.base@11.0.16.1/java.util.concurrent.locks.AbstractQueuedSynchronizer$ConditionObject.await(AbstractQueuedSynchronizer.java:2081)
at java.base@11.0.16.1/java.util.concurrent.LinkedBlockingQueue.take(LinkedBlockingQueue.java:433)
at app//org.apache.zookeeper.server.RequestThrottler.run(RequestThrottler.java:147)
32) Thread[id=74, name=h2sc-26-thread-1, state=RUNNABLE, group=TGRP-JWTAuthPluginIntegrationTest]
at java.base@11.0.16.1/sun.nio.ch.EPoll.wait(Native Method)
at java.base@11.0.16.1/sun.nio.ch.EPollSelectorImpl.doSelect(EPollSelectorImpl.java:120)
at java.base@11.0.16.1/sun.nio.ch.SelectorImpl.lockAndDoSelect(SelectorImpl.java:124)
at java.base@11.0.16.1/sun.nio.ch.SelectorImpl.select(SelectorImpl.java:141)
at app//org.eclipse.jetty.io.ManagedSelector.nioSelect(ManagedSelector.java:180)
at app//org.eclipse.jetty.io.ManagedSelector.select(ManagedSelector.java:187)
at app//org.eclipse.jetty.io.ManagedSelector$SelectorProducer.select(ManagedSelector.java:604)
at app//org.eclipse.jetty.io.ManagedSelector$SelectorProducer.produce(ManagedSelector.java:541)
at app//org.eclipse.jetty.util.thread.strategy.AdaptiveExecutionStrategy.produceTask(AdaptiveExecutionStrategy.java:450)
at app//org.eclipse.jetty.util.thread.strategy.AdaptiveExecutionStrategy.tryProduce(AdaptiveExecutionStrategy.java:243)
at app//org.eclipse.jetty.util.thread.strategy.AdaptiveExecutionStrategy.produce(AdaptiveExecutionStrategy.java:194)
at app//org.eclipse.jetty.io.ManagedSelector$$Lambda$355/0x0000000100586040.run(Unknown Source)
at app//org.apache.solr.common.util.ExecutorUtil$MDCAwareThreadPoolExecutor.lambda$execute$0(ExecutorUtil.java:289)
at app//org.apache.solr.common.util.ExecutorUtil$MDCAwareThreadPoolExecutor$$Lambda$275/0x000000010051fc40.run(Unknown Source)
at java.base@11.0.16.1/java.util.concurrent.ThreadPoolExecutor.runWorker(ThreadPoolExecutor.java:1128)
at java.base@11.0.16.1/java.util.concurrent.ThreadPoolExecutor$Worker.run(ThreadPoolExecutor.java:628)
at java.base@11.0.16.1/java.lang.Thread.run(Thread.java:829)
33) Thread[id=20, name=NIOServerCxnFactory.SelectorThread-1, state=RUNNABLE, group=TGRP-JWTAuthPluginIntegrationTest]
at java.base@11.0.16.1/sun.nio.ch.EPoll.wait(Native Method)
at java.base@11.0.16.1/sun.nio.ch.EPollSelectorImpl.doSelect(EPollSelectorImpl.java:120)
at java.base@11.0.16.1/sun.nio.ch.SelectorImpl.lockAndDoSelect(SelectorImpl.java:124)
at java.base@11.0.16.1/sun.nio.ch.SelectorImpl.select(SelectorImpl.java:141)
at app//org.apache.zookeeper.server.NIOServerCnxnFactory$SelectorThread.select(NIOServerCnxnFactory.java:403)
at app//org.apache.zookeeper.server.NIOServerCnxnFactory$SelectorThread.run(NIOServerCnxnFactory.java:368)
34) Thread[id=75, name=h2sc-25-thread-2, state=RUNNABLE, group=TGRP-JWTAuthPluginIntegrationTest]
at java.base@11.0.16.1/sun.nio.ch.EPoll.wait(Native Method)
at java.base@11.0.16.1/sun.nio.ch.EPollSelectorImpl.doSelect(EPollSelectorImpl.java:120)
at java.base@11.0.16.1/sun.nio.ch.SelectorImpl.lockAndDoSelect(SelectorImpl.java:124)
at java.base@11.0.16.1/sun.nio.ch.SelectorImpl.select(SelectorImpl.java:141)
at app//org.eclipse.jetty.io.ManagedSelector.nioSelect(ManagedSelector.java:180)
at app//org.eclipse.jetty.io.ManagedSelector.select(ManagedSelector.java:187)
at app//org.eclipse.jetty.io.ManagedSelector$SelectorProducer.select(ManagedSelector.java:604)
at app//org.eclipse.jetty.io.ManagedSelector$SelectorProducer.produce(ManagedSelector.java:541)
at app//org.eclipse.jetty.util.thread.strategy.AdaptiveExecutionStrategy.produceTask(AdaptiveExecutionStrategy.java:450)
at app//org.eclipse.jetty.util.thread.strategy.AdaptiveExecutionStrategy.tryProduce(AdaptiveExecutionStrategy.java:243)
at app//org.eclipse.jetty.util.thread.strategy.AdaptiveExecutionStrategy.produce(AdaptiveExecutionStrategy.java:194)
at app//org.eclipse.jetty.io.ManagedSelector$$Lambda$355/0x0000000100586040.run(Unknown Source)
at app//org.apache.solr.common.util.ExecutorUtil$MDCAwareThreadPoolExecutor.lambda$execute$0(ExecutorUtil.java:289)
at app//org.apache.solr.common.util.ExecutorUtil$MDCAwareThreadPoolExecutor$$Lambda$275/0x000000010051fc40.run(Unknown Source)
at java.base@11.0.16.1/java.util.concurrent.ThreadPoolExecutor.runWorker(ThreadPoolExecutor.java:1128)
at java.base@11.0.16.1/java.util.concurrent.ThreadPoolExecutor$Worker.run(ThreadPoolExecutor.java:628)
at java.base@11.0.16.1/java.lang.Thread.run(Thread.java:829)
35) Thread[id=27, name=TEST-JWTAuthPluginIntegrationTest.mockOAuth2Server-seed#[E0AC17E008E3B44E]-SendThread(127.0.0.1:41873), state=RUNNABLE, group=TGRP-JWTAuthPluginIntegrationTest]
at java.base@11.0.16.1/sun.nio.ch.EPoll.wait(Native Method)
at java.base@11.0.16.1/sun.nio.ch.EPollSelectorImpl.doSelect(EPollSelectorImpl.java:120)
at java.base@11.0.16.1/sun.nio.ch.SelectorImpl.lockAndDoSelect(SelectorImpl.java:124)
at java.base@11.0.16.1/sun.nio.ch.SelectorImpl.select(SelectorImpl.java:136)
at app//org.apache.zookeeper.ClientCnxnSocketNIO.doTransport(ClientCnxnSocketNIO.java:332)
at app//org.apache.zookeeper.ClientCnxn$SendThread.run(ClientCnxn.java:1274)
36) Thread[id=47, name=qtp1912313968-47, state=TIMED_WAITING, group=TGRP-JWTAuthPluginIntegrationTest]
at java.base@11.0.16.1/jdk.internal.misc.Unsafe.park(Native Method)
at java.base@11.0.16.1/java.util.concurrent.locks.LockSupport.parkNanos(LockSupport.java:234)
at java.base@11.0.16.1/java.util.concurrent.locks.AbstractQueuedSynchronizer$ConditionObject.awaitNanos(AbstractQueuedSynchronizer.java:2123)
at app//org.eclipse.jetty.util.BlockingArrayQueue.poll(BlockingArrayQueue.java:219)
at app//org.eclipse.jetty.util.thread.QueuedThreadPool$Runner.idleJobPoll(QueuedThreadPool.java:1124)
at app//org.eclipse.jetty.util.thread.QueuedThreadPool$Runner.run(QueuedThreadPool.java:1141)
at java.base@11.0.16.1/java.lang.Thread.run(Thread.java:829)
37) Thread[id=42, name=qtp1450297482-42, state=RUNNABLE, group=TGRP-JWTAuthPluginIntegrationTest]
at java.base@11.0.16.1/sun.nio.ch.EPoll.wait(Native Method)
at java.base@11.0.16.1/sun.nio.ch.EPollSelectorImpl.doSelect(EPollSelectorImpl.java:120)
at java.base@11.0.16.1/sun.nio.ch.SelectorImpl.lockAndDoSelect(SelectorImpl.java:124)
at java.base@11.0.16.1/sun.nio.ch.SelectorImpl.select(SelectorImpl.java:141)
at app//org.eclipse.jetty.io.ManagedSelector.nioSelect(ManagedSelector.java:180)
at app//org.eclipse.jetty.io.ManagedSelector.select(ManagedSelector.java:187)
at app//org.eclipse.jetty.io.ManagedSelector$SelectorProducer.select(ManagedSelector.java:604)
at app//org.eclipse.jetty.io.ManagedSelector$SelectorProducer.produce(ManagedSelector.java:541)
at app//org.eclipse.jetty.util.thread.strategy.AdaptiveExecutionStrategy.produceTask(AdaptiveExecutionStrategy.java:450)
at app//org.eclipse.jetty.util.thread.strategy.AdaptiveExecutionStrategy.tryProduce(AdaptiveExecutionStrategy.java:243)
at app//org.eclipse.jetty.util.thread.strategy.AdaptiveExecutionStrategy.produce(AdaptiveExecutionStrategy.java:194)
at app//org.eclipse.jetty.io.ManagedSelector$$Lambda$355/0x0000000100586040.run(Unknown Source)
at app//org.eclipse.jetty.util.thread.QueuedThreadPool.runJob(QueuedThreadPool.java:969)
at app//org.eclipse.jetty.util.thread.QueuedThreadPool$Runner.doRunJob(QueuedThreadPool.java:1194)
at app//org.eclipse.jetty.util.thread.QueuedThreadPool$Runner.run(QueuedThreadPool.java:1149)
at java.base@11.0.16.1/java.lang.Thread.run(Thread.java:829)
38) Thread[id=43, name=qtp1912313968-43-acceptor-0@8436d49-ServerConnector@32b21d2d{HTTP/1.1, (http/1.1, h2c)}{127.0.0.1:38927}, state=RUNNABLE, group=TGRP-JWTAuthPluginIntegrationTest]
at java.base@11.0.16.1/sun.nio.ch.ServerSocketChannelImpl.accept0(Native Method)
at java.base@11.0.16.1/sun.nio.ch.ServerSocketChannelImpl.accept(ServerSocketChannelImpl.java:533)
at java.base@11.0.16.1/sun.nio.ch.ServerSocketChannelImpl.accept(ServerSocketChannelImpl.java:285)
at app//org.eclipse.jetty.server.ServerConnector.accept(ServerConnector.java:409)
at app//org.eclipse.jetty.server.AbstractConnector$Acceptor.run(AbstractConnector.java:748)
at app//org.eclipse.jetty.util.thread.QueuedThreadPool.runJob(QueuedThreadPool.java:969)
at app//org.eclipse.jetty.util.thread.QueuedThreadPool$Runner.doRunJob(QueuedThreadPool.java:1194)
at app//org.eclipse.jetty.util.thread.QueuedThreadPool$Runner.run(QueuedThreadPool.java:1149)
at java.base@11.0.16.1/java.lang.Thread.run(Thread.java:829)
39) Thread[id=44, name=qtp1450297482-44-acceptor-0@5a68a231-ServerConnector@2f835a0f{HTTP/1.1, (http/1.1, h2c)}{127.0.0.1:39757}, state=RUNNABLE, group=TGRP-JWTAuthPluginIntegrationTest]
at java.base@11.0.16.1/sun.nio.ch.ServerSocketChannelImpl.accept0(Native Method)
at java.base@11.0.16.1/sun.nio.ch.ServerSocketChannelImpl.accept(ServerSocketChannelImpl.java:533)
at java.base@11.0.16.1/sun.nio.ch.ServerSocketChannelImpl.accept(ServerSocketChannelImpl.java:285)
at app//org.eclipse.jetty.server.ServerConnector.accept(ServerConnector.java:409)
at app//org.eclipse.jetty.server.AbstractConnector$Acceptor.run(AbstractConnector.java:748)
at app//org.eclipse.jetty.util.thread.QueuedThreadPool.runJob(QueuedThreadPool.java:969)
at app//org.eclipse.jetty.util.thread.QueuedThreadPool$Runner.doRunJob(QueuedThreadPool.java:1194)
at app//org.eclipse.jetty.util.thread.QueuedThreadPool$Runner.run(QueuedThreadPool.java:1149)
at java.base@11.0.16.1/java.lang.Thread.run(Thread.java:829)
40) Thread[id=24, name=ProcessThread(sid:0 cport:41873):, state=WAITING, group=TGRP-JWTAuthPluginIntegrationTest]
at java.base@11.0.16.1/jdk.internal.misc.Unsafe.park(Native Method)
at java.base@11.0.16.1/java.util.concurrent.locks.LockSupport.park(LockSupport.java:194)
at java.base@11.0.16.1/java.util.concurrent.locks.AbstractQueuedSynchronizer$ConditionObject.await(AbstractQueuedSynchronizer.java:2081)
at java.base@11.0.16.1/java.util.concurrent.LinkedBlockingQueue.take(LinkedBlockingQueue.java:433)
at app//org.apache.zookeeper.server.PrepRequestProcessor.run(PrepRequestProcessor.java:142)
41) Thread[id=41, name=qtp1912313968-41, state=RUNNABLE, group=TGRP-JWTAuthPluginIntegrationTest]
at java.base@11.0.16.1/sun.nio.ch.EPoll.wait(Native Method)
at java.base@11.0.16.1/sun.nio.ch.EPollSelectorImpl.doSelect(EPollSelectorImpl.java:120)
at java.base@11.0.16.1/sun.nio.ch.SelectorImpl.lockAndDoSelect(SelectorImpl.java:124)
at java.base@11.0.16.1/sun.nio.ch.SelectorImpl.select(SelectorImpl.java:141)
at app//org.eclipse.jetty.io.ManagedSelector.nioSelect(ManagedSelector.java:180)
at app//org.eclipse.jetty.io.ManagedSelector.select(ManagedSelector.java:187)
at app//org.eclipse.jetty.io.ManagedSelector$SelectorProducer.select(ManagedSelector.java:604)
at app//org.eclipse.jetty.io.ManagedSelector$SelectorProducer.produce(ManagedSelector.java:541)
at app//org.eclipse.jetty.util.thread.strategy.AdaptiveExecutionStrategy.produceTask(AdaptiveExecutionStrategy.java:450)
at app//org.eclipse.jetty.util.thread.strategy.AdaptiveExecutionStrategy.tryProduce(AdaptiveExecutionStrategy.java:243)
at app//org.eclipse.jetty.util.thread.strategy.AdaptiveExecutionStrategy.produce(AdaptiveExecutionStrategy.java:194)
at app//org.eclipse.jetty.io.ManagedSelector$$Lambda$355/0x0000000100586040.run(Unknown Source)
at app//org.eclipse.jetty.util.thread.QueuedThreadPool.runJob(QueuedThreadPool.java:969)
at app//org.eclipse.jetty.util.thread.QueuedThreadPool$Runner.doRunJob(QueuedThreadPool.java:1194)
at app//org.eclipse.jetty.util.thread.QueuedThreadPool$Runner.run(QueuedThreadPool.java:1149)
at java.base@11.0.16.1/java.lang.Thread.run(Thread.java:829)
42) Thread[id=82, name=zkConnectionManagerCallback-32-thread-1, state=WAITING, group=TGRP-JWTAuthPluginIntegrationTest]
at java.base@11.0.16.1/jdk.internal.misc.Unsafe.park(Native Method)
at java.base@11.0.16.1/java.util.concurrent.locks.LockSupport.park(LockSupport.java:194)
at java.base@11.0.16.1/java.util.concurrent.locks.AbstractQueuedSynchronizer$ConditionObject.await(AbstractQueuedSynchronizer.java:2081)
at java.base@11.0.16.1/java.util.concurrent.LinkedBlockingQueue.take(LinkedBlockingQueue.java:433)
at java.base@11.0.16.1/java.util.concurrent.ThreadPoolExecutor.getTask(ThreadPoolExecutor.java:1054)
at java.base@11.0.16.1/java.util.concurrent.ThreadPoolExecutor.runWorker(ThreadPoolExecutor.java:1114)
at java.base@11.0.16.1/java.util.concurrent.ThreadPoolExecutor$Worker.run(ThreadPoolExecutor.java:628)
at java.base@11.0.16.1/java.lang.Thread.run(Thread.java:829)
43) Thread[id=33, name=TEST-JWTAuthPluginIntegrationTest.mockOAuth2Server-seed#[E0AC17E008E3B44E]-EventThread, state=WAITING, group=TGRP-JWTAuthPluginIntegrationTest]
at java.base@11.0.16.1/jdk.internal.misc.Unsafe.park(Native Method)
at java.base@11.0.16.1/java.util.concurrent.locks.LockSupport.park(LockSupport.java:194)
at java.base@11.0.16.1/java.util.concurrent.locks.AbstractQueuedSynchronizer$ConditionObject.await(AbstractQueuedSynchronizer.java:2081)
at java.base@11.0.16.1/java.util.concurrent.LinkedBlockingQueue.take(LinkedBlockingQueue.java:433)
at app//org.apache.zookeeper.ClientCnxn$EventThread.run(ClientCnxn.java:534)
44) Thread[id=81, name=zkConnectionManagerCallback-31-thread-1, state=WAITING, group=TGRP-JWTAuthPluginIntegrationTest]
at java.base@11.0.16.1/jdk.internal.misc.Unsafe.park(Native Method)
at java.base@11.0.16.1/java.util.concurrent.locks.LockSupport.park(LockSupport.java:194)
at java.base@11.0.16.1/java.util.concurrent.locks.AbstractQueuedSynchronizer$ConditionObject.await(AbstractQueuedSynchronizer.java:2081)
at java.base@11.0.16.1/java.util.concurrent.LinkedBlockingQueue.take(LinkedBlockingQueue.java:433)
at java.base@11.0.16.1/java.util.concurrent.ThreadPoolExecutor.getTask(ThreadPoolExecutor.java:1054)
at java.base@11.0.16.1/java.util.concurrent.ThreadPoolExecutor.runWorker(ThreadPoolExecutor.java:1114)
at java.base@11.0.16.1/java.util.concurrent.ThreadPoolExecutor$Worker.run(ThreadPoolExecutor.java:628)
at java.base@11.0.16.1/java.lang.Thread.run(Thread.java:829)
45) Thread[id=77, name=jetty-launcher-8-thread-1-SendThread(127.0.0.1:41873), state=RUNNABLE, group=TGRP-JWTAuthPluginIntegrationTest]
at java.base@11.0.16.1/sun.nio.ch.EPoll.wait(Native Method)
at java.base@11.0.16.1/sun.nio.ch.EPollSelectorImpl.doSelect(EPollSelectorImpl.java:120)
at java.base@11.0.16.1/sun.nio.ch.SelectorImpl.lockAndDoSelect(SelectorImpl.java:124)
at java.base@11.0.16.1/sun.nio.ch.SelectorImpl.select(SelectorImpl.java:136)
at app//org.apache.zookeeper.ClientCnxnSocketNIO.doTransport(ClientCnxnSocketNIO.java:332)
at app//org.apache.zookeeper.ClientCnxn$SendThread.run(ClientCnxn.java:1274)
46) Thread[id=76, name=h2sc-26-thread-2, state=RUNNABLE, group=TGRP-JWTAuthPluginIntegrationTest]
at java.base@11.0.16.1/sun.nio.ch.EPoll.wait(Native Method)
at java.base@11.0.16.1/sun.nio.ch.EPollSelectorImpl.doSelect(EPollSelectorImpl.java:120)
at java.base@11.0.16.1/sun.nio.ch.SelectorImpl.lockAndDoSelect(SelectorImpl.java:124)
at java.base@11.0.16.1/sun.nio.ch.SelectorImpl.select(SelectorImpl.java:141)
at app//org.eclipse.jetty.io.ManagedSelector.nioSelect(ManagedSelector.java:180)
at app//org.eclipse.jetty.io.ManagedSelector.select(ManagedSelector.java:187)
at app//org.eclipse.jetty.io.ManagedSelector$SelectorProducer.select(ManagedSelector.java:604)
at app//org.eclipse.jetty.io.ManagedSelector$SelectorProducer.produce(ManagedSelector.java:541)
at app//org.eclipse.jetty.util.thread.strategy.AdaptiveExecutionStrategy.produceTask(AdaptiveExecutionStrategy.java:450)
at app//org.eclipse.jetty.util.thread.strategy.AdaptiveExecutionStrategy.tryProduce(AdaptiveExecutionStrategy.java:243)
at app//org.eclipse.jetty.util.thread.strategy.AdaptiveExecutionStrategy.produce(AdaptiveExecutionStrategy.java:194)
at app//org.eclipse.jetty.io.ManagedSelector$$Lambda$355/0x0000000100586040.run(Unknown Source)
at app//org.apache.solr.common.util.ExecutorUtil$MDCAwareThreadPoolExecutor.lambda$execute$0(ExecutorUtil.java:289)
at app//org.apache.solr.common.util.ExecutorUtil$MDCAwareThreadPoolExecutor$$Lambda$275/0x000000010051fc40.run(Unknown Source)
at java.base@11.0.16.1/java.util.concurrent.ThreadPoolExecutor.runWorker(ThreadPoolExecutor.java:1128)
at java.base@11.0.16.1/java.util.concurrent.ThreadPoolExecutor$Worker.run(ThreadPoolExecutor.java:628)
at java.base@11.0.16.1/java.lang.Thread.run(Thread.java:829)
47) Thread[id=19, name=NIOServerCxnFactory.SelectorThread-0, state=RUNNABLE, group=TGRP-JWTAuthPluginIntegrationTest]
at java.base@11.0.16.1/sun.nio.ch.EPoll.wait(Native Method)
at java.base@11.0.16.1/sun.nio.ch.EPollSelectorImpl.doSelect(EPollSelectorImpl.java:120)
at java.base@11.0.16.1/sun.nio.ch.SelectorImpl.lockAndDoSelect(SelectorImpl.java:124)
at java.base@11.0.16.1/sun.nio.ch.SelectorImpl.select(SelectorImpl.java:141)
at app//org.apache.zookeeper.server.NIOServerCnxnFactory$SelectorThread.select(NIOServerCnxnFactory.java:403)
at app//org.apache.zookeeper.server.NIOServerCnxnFactory$SelectorThread.run(NIOServerCnxnFactory.java:368)
48) Thread[id=67, name=httpShardExecutor-22-thread-2, state=RUNNABLE, group=TGRP-JWTAuthPluginIntegrationTest]
at java.base@11.0.16.1/sun.nio.ch.EPoll.wait(Native Method)
at java.base@11.0.16.1/sun.nio.ch.EPollSelectorImpl.doSelect(EPollSelectorImpl.java:120)
at java.base@11.0.16.1/sun.nio.ch.SelectorImpl.lockAndDoSelect(SelectorImpl.java:124)
at java.base@11.0.16.1/sun.nio.ch.SelectorImpl.select(SelectorImpl.java:141)
at app//org.eclipse.jetty.io.ManagedSelector.nioSelect(ManagedSelector.java:180)
at app//org.eclipse.jetty.io.ManagedSelector.select(ManagedSelector.java:187)
at app//org.eclipse.jetty.io.ManagedSelector$SelectorProducer.select(ManagedSelector.java:604)
at app//org.eclipse.jetty.io.ManagedSelector$SelectorProducer.produce(ManagedSelector.java:541)
at app//org.eclipse.jetty.util.thread.strategy.AdaptiveExecutionStrategy.produceTask(AdaptiveExecutionStrategy.java:450)
at app//org.eclipse.jetty.util.thread.strategy.AdaptiveExecutionStrategy.tryProduce(AdaptiveExecutionStrategy.java:243)
at app//org.eclipse.jetty.util.thread.strategy.AdaptiveExecutionStrategy.produce(AdaptiveExecutionStrategy.java:194)
at app//org.eclipse.jetty.io.ManagedSelector$$Lambda$355/0x0000000100586040.run(Unknown Source)
at app//org.apache.solr.common.util.ExecutorUtil$MDCAwareThreadPoolExecutor.lambda$execute$0(ExecutorUtil.java:289)
at app//org.apache.solr.common.util.ExecutorUtil$MDCAwareThreadPoolExecutor$$Lambda$275/0x000000010051fc40.run(Unknown Source)
at java.base@11.0.16.1/java.util.concurrent.ThreadPoolExecutor.runWorker(ThreadPoolExecutor.java:1128)
at java.base@11.0.16.1/java.util.concurrent.ThreadPoolExecutor$Worker.run(ThreadPoolExecutor.java:628)
at java.base@11.0.16.1/java.lang.Thread.run(Thread.java:829)
49) Thread[id=68, name=httpShardExecutor-21-thread-2, state=RUNNABLE, group=TGRP-JWTAuthPluginIntegrationTest]
at java.base@11.0.16.1/sun.nio.ch.EPoll.wait(Native Method)
at java.base@11.0.16.1/sun.nio.ch.EPollSelectorImpl.doSelect(EPollSelectorImpl.java:120)
at java.base@11.0.16.1/sun.nio.ch.SelectorImpl.lockAndDoSelect(SelectorImpl.java:124)
at java.base@11.0.16.1/sun.nio.ch.SelectorImpl.select(SelectorImpl.java:141)
at app//org.eclipse.jetty.io.ManagedSelector.nioSelect(ManagedSelector.java:180)
at app//org.eclipse.jetty.io.ManagedSelector.select(ManagedSelector.java:187)
at app//org.eclipse.jetty.io.ManagedSelector$SelectorProducer.select(ManagedSelector.java:604)
at app//org.eclipse.jetty.io.ManagedSelector$SelectorProducer.produce(ManagedSelector.java:541)
at app//org.eclipse.jetty.util.thread.strategy.AdaptiveExecutionStrategy.produceTask(AdaptiveExecutionStrategy.java:450)
at app//org.eclipse.jetty.util.thread.strategy.AdaptiveExecutionStrategy.tryProduce(AdaptiveExecutionStrategy.java:243)
at app//org.eclipse.jetty.util.thread.strategy.AdaptiveExecutionStrategy.produce(AdaptiveExecutionStrategy.java:194)
at app//org.eclipse.jetty.io.ManagedSelector$$Lambda$355/0x0000000100586040.run(Unknown Source)
at app//org.apache.solr.common.util.ExecutorUtil$MDCAwareThreadPoolExecutor.lambda$execute$0(ExecutorUtil.java:289)
at app//org.apache.solr.common.util.ExecutorUtil$MDCAwareThreadPoolExecutor$$Lambda$275/0x000000010051fc40.run(Unknown Source)
at java.base@11.0.16.1/java.util.concurrent.ThreadPoolExecutor.runWorker(ThreadPoolExecutor.java:1128)
at java.base@11.0.16.1/java.util.concurrent.ThreadPoolExecutor$Worker.run(ThreadPoolExecutor.java:628)
at java.base@11.0.16.1/java.lang.Thread.run(Thread.java:829)
50) Thread[id=48, name=qtp1450297482-48, state=TIMED_WAITING, group=TGRP-JWTAuthPluginIntegrationTest]
at java.base@11.0.16.1/jdk.internal.misc.Unsafe.park(Native Method)
at java.base@11.0.16.1/java.util.concurrent.locks.LockSupport.parkNanos(LockSupport.java:234)
at java.base@11.0.16.1/java.util.concurrent.locks.AbstractQueuedSynchronizer$ConditionObject.awaitNanos(AbstractQueuedSynchronizer.java:2123)
at app//org.eclipse.jetty.util.BlockingArrayQueue.poll(BlockingArrayQueue.java:219)
at app//org.eclipse.jetty.util.thread.QueuedThreadPool$Runner.idleJobPoll(QueuedThreadPool.java:1124)
at app//org.eclipse.jetty.util.thread.QueuedThreadPool$Runner.run(QueuedThreadPool.java:1141)
at java.base@11.0.16.1/java.lang.Thread.run(Thread.java:829)
51) Thread[id=66, name=httpShardExecutor-21-thread-1, state=RUNNABLE, group=TGRP-JWTAuthPluginIntegrationTest]
at java.base@11.0.16.1/sun.nio.ch.EPoll.wait(Native Method)
at java.base@11.0.16.1/sun.nio.ch.EPollSelectorImpl.doSelect(EPollSelectorImpl.java:120)
at java.base@11.0.16.1/sun.nio.ch.SelectorImpl.lockAndDoSelect(SelectorImpl.java:124)
at java.base@11.0.16.1/sun.nio.ch.SelectorImpl.select(SelectorImpl.java:141)
at app//org.eclipse.jetty.io.ManagedSelector.nioSelect(ManagedSelector.java:180)
at app//org.eclipse.jetty.io.ManagedSelector.select(ManagedSelector.java:187)
at app//org.eclipse.jetty.io.ManagedSelector$SelectorProducer.select(ManagedSelector.java:604)
at app//org.eclipse.jetty.io.ManagedSelector$SelectorProducer.produce(ManagedSelector.java:541)
at app//org.eclipse.jetty.util.thread.strategy.AdaptiveExecutionStrategy.produceTask(AdaptiveExecutionStrategy.java:450)
at app//org.eclipse.jetty.util.thread.strategy.AdaptiveExecutionStrategy.tryProduce(AdaptiveExecutionStrategy.java:243)
at app//org.eclipse.jetty.util.thread.strategy.AdaptiveExecutionStrategy.produce(AdaptiveExecutionStrategy.java:194)
at app//org.eclipse.jetty.io.ManagedSelector$$Lambda$355/0x0000000100586040.run(Unknown Source)
at app//org.apache.solr.common.util.ExecutorUtil$MDCAwareThreadPoolExecutor.lambda$execute$0(ExecutorUtil.java:289)
at app//org.apache.solr.common.util.ExecutorUtil$MDCAwareThreadPoolExecutor$$Lambda$275/0x000000010051fc40.run(Unknown Source)
at java.base@11.0.16.1/java.util.concurrent.ThreadPoolExecutor.runWorker(ThreadPoolExecutor.java:1128)
at java.base@11.0.16.1/java.util.concurrent.ThreadPoolExecutor$Worker.run(ThreadPoolExecutor.java:628)
at java.base@11.0.16.1/java.lang.Thread.run(Thread.java:829)
52) Thread[id=86, name=OverseerCollectionConfigSetProcessor-72416646544031749-127.0.0.1:39757_solr-n_0000000000, state=TIMED_WAITING, group=Overseer collection creation process.]
at java.base@11.0.16.1/jdk.internal.misc.Unsafe.park(Native Method)
at java.base@11.0.16.1/java.util.concurrent.locks.LockSupport.parkNanos(LockSupport.java:234)
at java.base@11.0.16.1/java.util.concurrent.locks.AbstractQueuedSynchronizer$ConditionObject.awaitNanos(AbstractQueuedSynchronizer.java:2123)
at app//org.apache.solr.cloud.ZkDistributedQueue.peekElements(ZkDistributedQueue.java:488)
at app//org.apache.solr.cloud.OverseerTaskQueue.peekTopN(OverseerTaskQueue.java:267)
at app//org.apache.solr.cloud.OverseerTaskProcessor.run(OverseerTaskProcessor.java:272)
at java.base@11.0.16.1/java.lang.Thread.run(Thread.java:829)
53) Thread[id=32, name=TEST-JWTAuthPluginIntegrationTest.mockOAuth2Server-seed#[E0AC17E008E3B44E]-SendThread(127.0.0.1:41873), state=RUNNABLE, group=TGRP-JWTAuthPluginIntegrationTest]
at java.base@11.0.16.1/sun.nio.ch.EPoll.wait(Native Method)
at java.base@11.0.16.1/sun.nio.ch.EPollSelectorImpl.doSelect(EPollSelectorImpl.java:120)
at java.base@11.0.16.1/sun.nio.ch.SelectorImpl.lockAndDoSelect(SelectorImpl.java:124)
at java.base@11.0.16.1/sun.nio.ch.SelectorImpl.select(SelectorImpl.java:136)
at app//org.apache.zookeeper.ClientCnxnSocketNIO.doTransport(ClientCnxnSocketNIO.java:332)
at app//org.apache.zookeeper.ClientCnxn$SendThread.run(ClientCnxn.java:1274)
54) Thread[id=93, name=TEST-JWTAuthPluginIntegrationTest.mockOAuth2Server-seed#[E0AC17E008E3B44E]-EventThread, state=WAITING, group=TGRP-JWTAuthPluginIntegrationTest]
at java.base@11.0.16.1/jdk.internal.misc.Unsafe.park(Native Method)
at java.base@11.0.16.1/java.util.concurrent.locks.LockSupport.park(LockSupport.java:194)
at java.base@11.0.16.1/java.util.concurrent.locks.AbstractQueuedSynchronizer$ConditionObject.await(AbstractQueuedSynchronizer.java:2081)
at java.base@11.0.16.1/java.util.concurrent.LinkedBlockingQueue.take(LinkedBlockingQueue.java:433)
at app//org.apache.zookeeper.ClientCnxn$EventThread.run(ClientCnxn.java:534)
55) Thread[id=104, name=Connector-Scheduler-32b21d2d-1, state=TIMED_WAITING, group=TGRP-JWTAuthPluginIntegrationTest]
at java.base@11.0.16.1/jdk.internal.misc.Unsafe.park(Native Method)
at java.base@11.0.16.1/java.util.concurrent.locks.LockSupport.parkNanos(LockSupport.java:234)
at java.base@11.0.16.1/java.util.concurrent.locks.AbstractQueuedSynchronizer$ConditionObject.awaitNanos(AbstractQueuedSynchronizer.java:2123)
at java.base@11.0.16.1/java.util.concurrent.ScheduledThreadPoolExecutor$DelayedWorkQueue.take(ScheduledThreadPoolExecutor.java:1182)
at java.base@11.0.16.1/java.util.concurrent.ScheduledThreadPoolExecutor$DelayedWorkQueue.take(ScheduledThreadPoolExecutor.java:899)
at java.base@11.0.16.1/java.util.concurrent.ThreadPoolExecutor.getTask(ThreadPoolExecutor.java:1054)
at java.base@11.0.16.1/java.util.concurrent.ThreadPoolExecutor.runWorker(ThreadPoolExecutor.java:1114)
at java.base@11.0.16.1/java.util.concurrent.ThreadPoolExecutor$Worker.run(ThreadPoolExecutor.java:628)
at java.base@11.0.16.1/java.lang.Thread.run(Thread.java:829)
56) Thread[id=17, name=ZkTestServer Run Thread, state=WAITING, group=TGRP-JWTAuthPluginIntegrationTest]
at java.base@11.0.16.1/java.lang.Object.wait(Native Method)
at java.base@11.0.16.1/java.lang.Thread.join(Thread.java:1300)
at java.base@11.0.16.1/java.lang.Thread.join(Thread.java:1375)
at app//org.apache.zookeeper.server.NIOServerCnxnFactory.join(NIOServerCnxnFactory.java:919)
at app//org.apache.solr.cloud.ZkTestServer$ZKServerMain.runFromConfig(ZkTestServer.java:337)
at app//org.apache.solr.cloud.ZkTestServer$1.run(ZkTestServer.java:581)
57) Thread[id=23, name=SyncThread:0, state=WAITING, group=TGRP-JWTAuthPluginIntegrationTest]
at java.base@11.0.16.1/jdk.internal.misc.Unsafe.park(Native Method)
at java.base@11.0.16.1/java.util.concurrent.locks.LockSupport.park(LockSupport.java:194)
at java.base@11.0.16.1/java.util.concurrent.locks.AbstractQueuedSynchronizer$ConditionObject.await(AbstractQueuedSynchronizer.java:2081)
at java.base@11.0.16.1/java.util.concurrent.LinkedBlockingQueue.take(LinkedBlockingQueue.java:433)
at app//org.apache.zookeeper.server.SyncRequestProcessor.run(SyncRequestProcessor.java:170)
58) Thread[id=94, name=zkConnectionManagerCallback-48-thread-1, state=WAITING, group=TGRP-JWTAuthPluginIntegrationTest]
at java.base@11.0.16.1/jdk.internal.misc.Unsafe.park(Native Method)
at java.base@11.0.16.1/java.util.concurrent.locks.LockSupport.park(LockSupport.java:194)
at java.base@11.0.16.1/java.util.concurrent.locks.AbstractQueuedSynchronizer$ConditionObject.await(AbstractQueuedSynchronizer.java:2081)
at java.base@11.0.16.1/java.util.concurrent.LinkedBlockingQueue.take(LinkedBlockingQueue.java:433)
at java.base@11.0.16.1/java.util.concurrent.ThreadPoolExecutor.getTask(ThreadPoolExecutor.java:1054)
at java.base@11.0.16.1/java.util.concurrent.ThreadPoolExecutor.runWorker(ThreadPoolExecutor.java:1114)
at java.base@11.0.16.1/java.util.concurrent.ThreadPoolExecutor$Worker.run(ThreadPoolExecutor.java:628)
at java.base@11.0.16.1/java.lang.Thread.run(Thread.java:829)
59) Thread[id=45, name=qtp1912313968-45, state=TIMED_WAITING, group=TGRP-JWTAuthPluginIntegrationTest]
at java.base@11.0.16.1/jdk.internal.misc.Unsafe.park(Native Method)
at java.base@11.0.16.1/java.util.concurrent.locks.LockSupport.parkNanos(LockSupport.java:234)
at java.base@11.0.16.1/java.util.concurrent.locks.AbstractQueuedSynchronizer$ConditionObject.awaitNanos(AbstractQueuedSynchronizer.java:2123)
at app//org.eclipse.jetty.util.BlockingArrayQueue.poll(BlockingArrayQueue.java:219)
at app//org.eclipse.jetty.util.thread.QueuedThreadPool$Runner.idleJobPoll(QueuedThreadPool.java:1124)
at app//org.eclipse.jetty.util.thread.QueuedThreadPool$Runner.run(QueuedThreadPool.java:1141)
at java.base@11.0.16.1/java.lang.Thread.run(Thread.java:829)
60) Thread[id=30, name=NIOWorkerThread-3, state=WAITING, group=TGRP-JWTAuthPluginIntegrationTest]
at java.base@11.0.16.1/jdk.internal.misc.Unsafe.park(Native Method)
at java.base@11.0.16.1/java.util.concurrent.locks.LockSupport.park(LockSupport.java:194)
at java.base@11.0.16.1/java.util.concurrent.locks.AbstractQueuedSynchronizer$ConditionObject.await(AbstractQueuedSynchronizer.java:2081)
at java.base@11.0.16.1/java.util.concurrent.LinkedBlockingQueue.take(LinkedBlockingQueue.java:433)
at java.base@11.0.16.1/java.util.concurrent.ThreadPoolExecutor.getTask(ThreadPoolExecutor.java:1054)
at java.base@11.0.16.1/java.util.concurrent.ThreadPoolExecutor.runWorker(ThreadPoolExecutor.java:1114)
at java.base@11.0.16.1/java.util.concurrent.ThreadPoolExecutor$Worker.run(ThreadPoolExecutor.java:628)
at java.base@11.0.16.1/java.lang.Thread.run(Thread.java:829)
61) Thread[id=26, name=NIOWorkerThread-1, state=WAITING, group=TGRP-JWTAuthPluginIntegrationTest]
at java.base@11.0.16.1/jdk.internal.misc.Unsafe.park(Native Method)
at java.base@11.0.16.1/java.util.concurrent.locks.LockSupport.park(LockSupport.java:194)
at java.base@11.0.16.1/java.util.concurrent.locks.AbstractQueuedSynchronizer$ConditionObject.await(AbstractQueuedSynchronizer.java:2081)
at java.base@11.0.16.1/java.util.concurrent.LinkedBlockingQueue.take(LinkedBlockingQueue.java:433)
at java.base@11.0.16.1/java.util.concurrent.ThreadPoolExecutor.getTask(ThreadPoolExecutor.java:1054)
at java.base@11.0.16.1/java.util.concurrent.ThreadPoolExecutor.runWorker(ThreadPoolExecutor.java:1114)
at java.base@11.0.16.1/java.util.concurrent.ThreadPoolExecutor$Worker.run(ThreadPoolExecutor.java:628)
at java.base@11.0.16.1/java.lang.Thread.run(Thread.java:829)
Stack Trace:
com.carrotsearch.randomizedtesting.ThreadLeakError: 61 threads leaked from SUITE scope at org.apache.solr.security.jwt.JWTAuthPluginIntegrationTest:
1) Thread[id=73, name=h2sc-25-thread-1, state=RUNNABLE, group=TGRP-JWTAuthPluginIntegrationTest]
at java.base@11.0.16.1/sun.nio.ch.EPoll.wait(Native Method)
at java.base@11.0.16.1/sun.nio.ch.EPollSelectorImpl.doSelect(EPollSelectorImpl.java:120)
at java.base@11.0.16.1/sun.nio.ch.SelectorImpl.lockAndDoSelect(SelectorImpl.java:124)
at java.base@11.0.16.1/sun.nio.ch.SelectorImpl.select(SelectorImpl.java:141)
at app//org.eclipse.jetty.io.ManagedSelector.nioSelect(ManagedSelector.java:180)
at app//org.eclipse.jetty.io.ManagedSelector.select(ManagedSelector.java:187)
at app//org.eclipse.jetty.io.ManagedSelector$SelectorProducer.select(ManagedSelector.java:604)
at app//org.eclipse.jetty.io.ManagedSelector$SelectorProducer.produce(ManagedSelector.java:541)
at app//org.eclipse.jetty.util.thread.strategy.AdaptiveExecutionStrategy.produceTask(AdaptiveExecutionStrategy.java:450)
at app//org.eclipse.jetty.util.thread.strategy.AdaptiveExecutionStrategy.tryProduce(AdaptiveExecutionStrategy.java:243)
at app//org.eclipse.jetty.util.thread.strategy.AdaptiveExecutionStrategy.produce(AdaptiveExecutionStrategy.java:194)
at app//org.eclipse.jetty.io.ManagedSelector$$Lambda$355/0x0000000100586040.run(Unknown Source)
at app//org.apache.solr.common.util.ExecutorUtil$MDCAwareThreadPoolExecutor.lambda$execute$0(ExecutorUtil.java:289)
at app//org.apache.solr.common.util.ExecutorUtil$MDCAwareThreadPoolExecutor$$Lambda$275/0x000000010051fc40.run(Unknown Source)
at java.base@11.0.16.1/java.util.concurrent.ThreadPoolExecutor.runWorker(ThreadPoolExecutor.java:1128)
at java.base@11.0.16.1/java.util.concurrent.ThreadPoolExecutor$Worker.run(ThreadPoolExecutor.java:628)
at java.base@11.0.16.1/java.lang.Thread.run(Thread.java:829)
2) Thread[id=85, name=OverseerStateUpdate-72416646544031749-127.0.0.1:39757_solr-n_0000000000, state=TIMED_WAITING, group=Overseer state updater.]
at java.base@11.0.16.1/jdk.internal.misc.Unsafe.park(Native Method)
at java.base@11.0.16.1/java.util.concurrent.locks.LockSupport.parkNanos(LockSupport.java:234)
at java.base@11.0.16.1/java.util.concurrent.locks.AbstractQueuedSynchronizer$ConditionObject.awaitNanos(AbstractQueuedSynchronizer.java:2123)
at app//org.apache.solr.cloud.ZkDistributedQueue.peekElements(ZkDistributedQueue.java:488)
at app//org.apache.solr.cloud.Overseer$ClusterStateUpdater.run(Overseer.java:338)
at java.base@11.0.16.1/java.lang.Thread.run(Thread.java:829)
3) Thread[id=55, name=qtp1450297482-55, state=TIMED_WAITING, group=TGRP-JWTAuthPluginIntegrationTest]
at java.base@11.0.16.1/jdk.internal.misc.Unsafe.park(Native Method)
at java.base@11.0.16.1/java.util.concurrent.locks.LockSupport.parkNanos(LockSupport.java:234)
at java.base@11.0.16.1/java.util.concurrent.locks.AbstractQueuedSynchronizer$ConditionObject.awaitNanos(AbstractQueuedSynchronizer.java:2123)
at app//org.eclipse.jetty.util.BlockingArrayQueue.poll(BlockingArrayQueue.java:219)
at app//org.eclipse.jetty.util.thread.QueuedThreadPool$Runner.idleJobPoll(QueuedThreadPool.java:1124)
at app//org.eclipse.jetty.util.thread.QueuedThreadPool$Runner.run(QueuedThreadPool.java:1141)
at java.base@11.0.16.1/java.lang.Thread.run(Thread.java:829)
4) Thread[id=65, name=httpShardExecutor-22-thread-1, state=RUNNABLE, group=TGRP-JWTAuthPluginIntegrationTest]
at java.base@11.0.16.1/sun.nio.ch.EPoll.wait(Native Method)
at java.base@11.0.16.1/sun.nio.ch.EPollSelectorImpl.doSelect(EPollSelectorImpl.java:120)
at java.base@11.0.16.1/sun.nio.ch.SelectorImpl.lockAndDoSelect(SelectorImpl.java:124)
at java.base@11.0.16.1/sun.nio.ch.SelectorImpl.select(SelectorImpl.java:141)
at app//org.eclipse.jetty.io.ManagedSelector.nioSelect(ManagedSelector.java:180)
at app//org.eclipse.jetty.io.ManagedSelector.select(ManagedSelector.java:187)
at app//org.eclipse.jetty.io.ManagedSelector$SelectorProducer.select(ManagedSelector.java:604)
at app//org.eclipse.jetty.io.ManagedSelector$SelectorProducer.produce(ManagedSelector.java:541)
at app//org.eclipse.jetty.util.thread.strategy.AdaptiveExecutionStrategy.produceTask(AdaptiveExecutionStrategy.java:450)
at app//org.eclipse.jetty.util.thread.strategy.AdaptiveExecutionStrategy.tryProduce(AdaptiveExecutionStrategy.java:243)
at app//org.eclipse.jetty.util.thread.strategy.AdaptiveExecutionStrategy.produce(AdaptiveExecutionStrategy.java:194)
at app//org.eclipse.jetty.io.ManagedSelector$$Lambda$355/0x0000000100586040.run(Unknown Source)
at app//org.apache.solr.common.util.ExecutorUtil$MDCAwareThreadPoolExecutor.lambda$execute$0(ExecutorUtil.java:289)
at app//org.apache.solr.common.util.ExecutorUtil$MDCAwareThreadPoolExecutor$$Lambda$275/0x000000010051fc40.run(Unknown Source)
at java.base@11.0.16.1/java.util.concurrent.ThreadPoolExecutor.runWorker(ThreadPoolExecutor.java:1128)
at java.base@11.0.16.1/java.util.concurrent.ThreadPoolExecutor$Worker.run(ThreadPoolExecutor.java:628)
at java.base@11.0.16.1/java.lang.Thread.run(Thread.java:829)
5) Thread[id=34, name=zkConnectionManagerCallback-5-thread-1, state=WAITING, group=TGRP-JWTAuthPluginIntegrationTest]
at java.base@11.0.16.1/jdk.internal.misc.Unsafe.park(Native Method)
at java.base@11.0.16.1/java.util.concurrent.locks.LockSupport.park(LockSupport.java:194)
at java.base@11.0.16.1/java.util.concurrent.locks.AbstractQueuedSynchronizer$ConditionObject.await(AbstractQueuedSynchronizer.java:2081)
at java.base@11.0.16.1/java.util.concurrent.LinkedBlockingQueue.take(LinkedBlockingQueue.java:433)
at java.base@11.0.16.1/java.util.concurrent.ThreadPoolExecutor.getTask(ThreadPoolExecutor.java:1054)
at java.base@11.0.16.1/java.util.concurrent.ThreadPoolExecutor.runWorker(ThreadPoolExecutor.java:1114)
at java.base@11.0.16.1/java.util.concurrent.ThreadPoolExecutor$Worker.run(ThreadPoolExecutor.java:628)
at java.base@11.0.16.1/java.lang.Thread.run(Thread.java:829)
6) Thread[id=80, name=jetty-launcher-8-thread-2-EventThread, state=WAITING, group=TGRP-JWTAuthPluginIntegrationTest]
at java.base@11.0.16.1/jdk.internal.misc.Unsafe.park(Native Method)
at java.base@11.0.16.1/java.util.concurrent.locks.LockSupport.park(LockSupport.java:194)
at java.base@11.0.16.1/java.util.concurrent.locks.AbstractQueuedSynchronizer$ConditionObject.await(AbstractQueuedSynchronizer.java:2081)
at java.base@11.0.16.1/java.util.concurrent.LinkedBlockingQueue.take(LinkedBlockingQueue.java:433)
at app//org.apache.zookeeper.ClientCnxn$EventThread.run(ClientCnxn.java:534)
7) Thread[id=49, name=qtp1912313968-49, state=TIMED_WAITING, group=TGRP-JWTAuthPluginIntegrationTest]
at java.base@11.0.16.1/jdk.internal.misc.Unsafe.park(Native Method)
at java.base@11.0.16.1/java.util.concurrent.locks.LockSupport.parkNanos(LockSupport.java:234)
at java.base@11.0.16.1/java.util.concurrent.locks.AbstractQueuedSynchronizer$ConditionObject.awaitNanos(AbstractQueuedSynchronizer.java:2123)
at app//org.eclipse.jetty.util.BlockingArrayQueue.poll(BlockingArrayQueue.java:219)
at app//org.eclipse.jetty.util.thread.QueuedThreadPool$Runner.idleJobPoll(QueuedThreadPool.java:1124)
at app//org.eclipse.jetty.util.thread.QueuedThreadPool$Runner.run(QueuedThreadPool.java:1141)
at java.base@11.0.16.1/java.lang.Thread.run(Thread.java:829)
8) Thread[id=52, name=qtp1450297482-52, state=TIMED_WAITING, group=TGRP-JWTAuthPluginIntegrationTest]
at java.base@11.0.16.1/jdk.internal.misc.Unsafe.park(Native Method)
at java.base@11.0.16.1/java.util.concurrent.locks.LockSupport.parkNanos(LockSupport.java:234)
at java.base@11.0.16.1/java.util.concurrent.locks.AbstractQueuedSynchronizer$ConditionObject.awaitNanos(AbstractQueuedSynchronizer.java:2123)
at app//org.eclipse.jetty.util.BlockingArrayQueue.poll(BlockingArrayQueue.java:219)
at app//org.eclipse.jetty.util.thread.QueuedThreadPool$Runner.idleJobPoll(QueuedThreadPool.java:1124)
at app//org.eclipse.jetty.util.thread.QueuedThreadPool$Runner.run(QueuedThreadPool.java:1141)
at java.base@11.0.16.1/java.lang.Thread.run(Thread.java:829)
9) Thread[id=79, name=jetty-launcher-8-thread-1-EventThread, state=WAITING, group=TGRP-JWTAuthPluginIntegrationTest]
at java.base@11.0.16.1/jdk.internal.misc.Unsafe.park(Native Method)
at java.base@11.0.16.1/java.util.concurrent.locks.LockSupport.park(LockSupport.java:194)
at java.base@11.0.16.1/java.util.concurrent.locks.AbstractQueuedSynchronizer$ConditionObject.await(AbstractQueuedSynchronizer.java:2081)
at java.base@11.0.16.1/java.util.concurrent.LinkedBlockingQueue.take(LinkedBlockingQueue.java:433)
at app//org.apache.zookeeper.ClientCnxn$EventThread.run(ClientCnxn.java:534)
10) Thread[id=46, name=qtp1450297482-46, state=TIMED_WAITING, group=TGRP-JWTAuthPluginIntegrationTest]
at java.base@11.0.16.1/jdk.internal.misc.Unsafe.park(Native Method)
at java.base@11.0.16.1/java.util.concurrent.locks.LockSupport.parkNanos(LockSupport.java:234)
at java.base@11.0.16.1/java.util.concurrent.locks.AbstractQueuedSynchronizer$ConditionObject.awaitNanos(AbstractQueuedSynchronizer.java:2123)
at app//org.eclipse.jetty.util.BlockingArrayQueue.poll(BlockingArrayQueue.java:219)
at app//org.eclipse.jetty.util.thread.QueuedThreadPool$Runner.idleJobPoll(QueuedThreadPool.java:1124)
at app//org.eclipse.jetty.util.thread.QueuedThreadPool$Runner.run(QueuedThreadPool.java:1141)
at java.base@11.0.16.1/java.lang.Thread.run(Thread.java:829)
11) Thread[id=53, name=qtp1450297482-53, state=TIMED_WAITING, group=TGRP-JWTAuthPluginIntegrationTest]
at java.base@11.0.16.1/jdk.internal.misc.Unsafe.park(Native Method)
at java.base@11.0.16.1/java.util.concurrent.locks.LockSupport.parkNanos(LockSupport.java:234)
at java.base@11.0.16.1/java.util.concurrent.locks.AbstractQueuedSynchronizer$ConditionObject.awaitNanos(AbstractQueuedSynchronizer.java:2123)
at app//org.eclipse.jetty.util.BlockingArrayQueue.poll(BlockingArrayQueue.java:219)
at app//org.eclipse.jetty.util.thread.QueuedThreadPool$Runner.idleJobPoll(QueuedThreadPool.java:1124)
at app//org.eclipse.jetty.util.thread.QueuedThreadPool$Runner.run(QueuedThreadPool.java:1141)
at java.base@11.0.16.1/java.lang.Thread.run(Thread.java:829)
12) Thread[id=56, name=qtp1912313968-56, state=TIMED_WAITING, group=TGRP-JWTAuthPluginIntegrationTest]
at java.base@11.0.16.1/jdk.internal.misc.Unsafe.park(Native Method)
at java.base@11.0.16.1/java.util.concurrent.locks.LockSupport.parkNanos(LockSupport.java:234)
at java.base@11.0.16.1/java.util.concurrent.locks.AbstractQueuedSynchronizer$ConditionObject.awaitNanos(AbstractQueuedSynchronizer.java:2123)
at app//org.eclipse.jetty.util.BlockingArrayQueue.poll(BlockingArrayQueue.java:219)
at app//org.eclipse.jetty.util.thread.QueuedThreadPool$Runner.idleJobPoll(QueuedThreadPool.java:1124)
at app//org.eclipse.jetty.util.thread.QueuedThreadPool$Runner.run(QueuedThreadPool.java:1141)
at java.base@11.0.16.1/java.lang.Thread.run(Thread.java:829)
13) Thread[id=57, name=Session-HouseKeeper-668cf821-1, state=TIMED_WAITING, group=TGRP-JWTAuthPluginIntegrationTest]
at java.base@11.0.16.1/jdk.internal.misc.Unsafe.park(Native Method)
at java.base@11.0.16.1/java.util.concurrent.locks.LockSupport.parkNanos(LockSupport.java:234)
at java.base@11.0.16.1/java.util.concurrent.locks.AbstractQueuedSynchronizer$ConditionObject.awaitNanos(AbstractQueuedSynchronizer.java:2123)
at java.base@11.0.16.1/java.util.concurrent.ScheduledThreadPoolExecutor$DelayedWorkQueue.take(ScheduledThreadPoolExecutor.java:1182)
at java.base@11.0.16.1/java.util.concurrent.ScheduledThreadPoolExecutor$DelayedWorkQueue.take(ScheduledThreadPoolExecutor.java:899)
at java.base@11.0.16.1/java.util.concurrent.ThreadPoolExecutor.getTask(ThreadPoolExecutor.java:1054)
at java.base@11.0.16.1/java.util.concurrent.ThreadPoolExecutor.runWorker(ThreadPoolExecutor.java:1114)
at java.base@11.0.16.1/java.util.concurrent.ThreadPoolExecutor$Worker.run(ThreadPoolExecutor.java:628)
at java.base@11.0.16.1/java.lang.Thread.run(Thread.java:829)
14) Thread[id=31, name=zkConnectionManagerCallback-3-thread-1, state=WAITING, group=TGRP-JWTAuthPluginIntegrationTest]
at java.base@11.0.16.1/jdk.internal.misc.Unsafe.park(Native Method)
at java.base@11.0.16.1/java.util.concurrent.locks.LockSupport.park(LockSupport.java:194)
at java.base@11.0.16.1/java.util.concurrent.locks.AbstractQueuedSynchronizer$ConditionObject.await(AbstractQueuedSynchronizer.java:2081)
at java.base@11.0.16.1/java.util.concurrent.LinkedBlockingQueue.take(LinkedBlockingQueue.java:433)
at java.base@11.0.16.1/java.util.concurrent.ThreadPoolExecutor.getTask(ThreadPoolExecutor.java:1054)
at java.base@11.0.16.1/java.util.concurrent.ThreadPoolExecutor.runWorker(ThreadPoolExecutor.java:1114)
at java.base@11.0.16.1/java.util.concurrent.ThreadPoolExecutor$Worker.run(ThreadPoolExecutor.java:628)
at java.base@11.0.16.1/java.lang.Thread.run(Thread.java:829)
15) Thread[id=84, name=zkCallback-30-thread-1, state=TIMED_WAITING, group=TGRP-JWTAuthPluginIntegrationTest]
at java.base@11.0.16.1/jdk.internal.misc.Unsafe.park(Native Method)
at java.base@11.0.16.1/java.util.concurrent.locks.LockSupport.parkNanos(LockSupport.java:234)
at java.base@11.0.16.1/java.util.concurrent.SynchronousQueue$TransferStack.awaitFulfill(SynchronousQueue.java:462)
at java.base@11.0.16.1/java.util.concurrent.SynchronousQueue$TransferStack.transfer(SynchronousQueue.java:361)
at java.base@11.0.16.1/java.util.concurrent.SynchronousQueue.poll(SynchronousQueue.java:937)
at java.base@11.0.16.1/java.util.concurrent.ThreadPoolExecutor.getTask(ThreadPoolExecutor.java:1053)
at java.base@11.0.16.1/java.util.concurrent.ThreadPoolExecutor.runWorker(ThreadPoolExecutor.java:1114)
at java.base@11.0.16.1/java.util.concurrent.ThreadPoolExecutor$Worker.run(ThreadPoolExecutor.java:628)
at java.base@11.0.16.1/java.lang.Thread.run(Thread.java:829)
16) Thread[id=29, name=NIOWorkerThread-2, state=WAITING, group=TGRP-JWTAuthPluginIntegrationTest]
at java.base@11.0.16.1/jdk.internal.misc.Unsafe.park(Native Method)
at java.base@11.0.16.1/java.util.concurrent.locks.LockSupport.park(LockSupport.java:194)
at java.base@11.0.16.1/java.util.concurrent.locks.AbstractQueuedSynchronizer$ConditionObject.await(AbstractQueuedSynchronizer.java:2081)
at java.base@11.0.16.1/java.util.concurrent.LinkedBlockingQueue.take(LinkedBlockingQueue.java:433)
at java.base@11.0.16.1/java.util.concurrent.ThreadPoolExecutor.getTask(ThreadPoolExecutor.java:1054)
at java.base@11.0.16.1/java.util.concurrent.ThreadPoolExecutor.runWorker(ThreadPoolExecutor.java:1114)
at java.base@11.0.16.1/java.util.concurrent.ThreadPoolExecutor$Worker.run(ThreadPoolExecutor.java:628)
at java.base@11.0.16.1/java.lang.Thread.run(Thread.java:829)
17) Thread[id=51, name=qtp1912313968-51, state=TIMED_WAITING, group=TGRP-JWTAuthPluginIntegrationTest]
at java.base@11.0.16.1/jdk.internal.misc.Unsafe.park(Native Method)
at java.base@11.0.16.1/java.util.concurrent.locks.LockSupport.parkNanos(LockSupport.java:234)
at java.base@11.0.16.1/java.util.concurrent.locks.AbstractQueuedSynchronizer$ConditionObject.awaitNanos(AbstractQueuedSynchronizer.java:2123)
at app//org.eclipse.jetty.util.BlockingArrayQueue.poll(BlockingArrayQueue.java:219)
at app//org.eclipse.jetty.util.thread.QueuedThreadPool$Runner.idleJobPoll(QueuedThreadPool.java:1124)
at app//org.eclipse.jetty.util.thread.QueuedThreadPool$Runner.run(QueuedThreadPool.java:1141)
at java.base@11.0.16.1/java.lang.Thread.run(Thread.java:829)
18) Thread[id=87, name=CloserThread, state=WAITING, group=TGRP-JWTAuthPluginIntegrationTest]
at java.base@11.0.16.1/java.lang.Object.wait(Native Method)
at java.base@11.0.16.1/java.lang.Object.wait(Object.java:328)
at app//org.apache.solr.core.CloserThread.run(CoreContainer.java:2595)
19) Thread[id=98, name=zkCallback-47-thread-1, state=TIMED_WAITING, group=TGRP-JWTAuthPluginIntegrationTest]
at java.base@11.0.16.1/jdk.internal.misc.Unsafe.park(Native Method)
at java.base@11.0.16.1/java.util.concurrent.locks.LockSupport.parkNanos(LockSupport.java:234)
at java.base@11.0.16.1/java.util.concurrent.SynchronousQueue$TransferStack.awaitFulfill(SynchronousQueue.java:462)
at java.base@11.0.16.1/java.util.concurrent.SynchronousQueue$TransferStack.transfer(SynchronousQueue.java:361)
at java.base@11.0.16.1/java.util.concurrent.SynchronousQueue.poll(SynchronousQueue.java:937)
at java.base@11.0.16.1/java.util.concurrent.ThreadPoolExecutor.getTask(ThreadPoolExecutor.java:1053)
at java.base@11.0.16.1/java.util.concurrent.ThreadPoolExecutor.runWorker(ThreadPoolExecutor.java:1114)
at java.base@11.0.16.1/java.util.concurrent.ThreadPoolExecutor$Worker.run(ThreadPoolExecutor.java:628)
at java.base@11.0.16.1/java.lang.Thread.run(Thread.java:829)
20) Thread[id=54, name=qtp1912313968-54, state=TIMED_WAITING, group=TGRP-JWTAuthPluginIntegrationTest]
at java.base@11.0.16.1/jdk.internal.misc.Unsafe.park(Native Method)
at java.base@11.0.16.1/java.util.concurrent.locks.LockSupport.parkNanos(LockSupport.java:234)
at java.base@11.0.16.1/java.util.concurrent.locks.AbstractQueuedSynchronizer$ConditionObject.awaitNanos(AbstractQueuedSynchronizer.java:2123)
at app//org.eclipse.jetty.util.BlockingArrayQueue.poll(BlockingArrayQueue.java:219)
at app//org.eclipse.jetty.util.thread.QueuedThreadPool$Runner.idleJobPoll(QueuedThreadPool.java:1124)
at app//org.eclipse.jetty.util.thread.QueuedThreadPool$Runner.run(QueuedThreadPool.java:1141)
at java.base@11.0.16.1/java.lang.Thread.run(Thread.java:829)
21) Thread[id=90, name=coreContainerWorkExecutor-15-thread-1, state=TIMED_WAITING, group=TGRP-JWTAuthPluginIntegrationTest]
at java.base@11.0.16.1/jdk.internal.misc.Unsafe.park(Native Method)
at java.base@11.0.16.1/java.util.concurrent.locks.LockSupport.parkNanos(LockSupport.java:234)
at java.base@11.0.16.1/java.util.concurrent.SynchronousQueue$TransferStack.awaitFulfill(SynchronousQueue.java:462)
at java.base@11.0.16.1/java.util.concurrent.SynchronousQueue$TransferStack.transfer(SynchronousQueue.java:361)
at java.base@11.0.16.1/java.util.concurrent.SynchronousQueue.poll(SynchronousQueue.java:937)
at java.base@11.0.16.1/java.util.concurrent.ThreadPoolExecutor.getTask(ThreadPoolExecutor.java:1053)
at java.base@11.0.16.1/java.util.concurrent.ThreadPoolExecutor.runWorker(ThreadPoolExecutor.java:1114)
at java.base@11.0.16.1/java.util.concurrent.ThreadPoolExecutor$Worker.run(ThreadPoolExecutor.java:628)
at java.base@11.0.16.1/java.lang.Thread.run(Thread.java:829)
22) Thread[id=28, name=TEST-JWTAuthPluginIntegrationTest.mockOAuth2Server-seed#[E0AC17E008E3B44E]-EventThread, state=WAITING, group=TGRP-JWTAuthPluginIntegrationTest]
at java.base@11.0.16.1/jdk.internal.misc.Unsafe.park(Native Method)
at java.base@11.0.16.1/java.util.concurrent.locks.LockSupport.park(LockSupport.java:194)
at java.base@11.0.16.1/java.util.concurrent.locks.AbstractQueuedSynchronizer$ConditionObject.await(AbstractQueuedSynchronizer.java:2081)
at java.base@11.0.16.1/java.util.concurrent.LinkedBlockingQueue.take(LinkedBlockingQueue.java:433)
at app//org.apache.zookeeper.ClientCnxn$EventThread.run(ClientCnxn.java:534)
23) Thread[id=21, name=NIOServerCxnFactory.AcceptThread:0.0.0.0/0.0.0.0:0, state=RUNNABLE, group=TGRP-JWTAuthPluginIntegrationTest]
at java.base@11.0.16.1/sun.nio.ch.EPoll.wait(Native Method)
at java.base@11.0.16.1/sun.nio.ch.EPollSelectorImpl.doSelect(EPollSelectorImpl.java:120)
at java.base@11.0.16.1/sun.nio.ch.SelectorImpl.lockAndDoSelect(SelectorImpl.java:124)
at java.base@11.0.16.1/sun.nio.ch.SelectorImpl.select(SelectorImpl.java:141)
at app//org.apache.zookeeper.server.NIOServerCnxnFactory$AcceptThread.select(NIOServerCnxnFactory.java:205)
at app//org.apache.zookeeper.server.NIOServerCnxnFactory$AcceptThread.run(NIOServerCnxnFactory.java:181)
24) Thread[id=50, name=qtp1450297482-50, state=TIMED_WAITING, group=TGRP-JWTAuthPluginIntegrationTest]
at java.base@11.0.16.1/jdk.internal.misc.Unsafe.park(Native Method)
at java.base@11.0.16.1/java.util.concurrent.locks.LockSupport.parkNanos(LockSupport.java:234)
at java.base@11.0.16.1/java.util.concurrent.locks.AbstractQueuedSynchronizer$ConditionObject.awaitNanos(AbstractQueuedSynchronizer.java:2123)
at app//org.eclipse.jetty.util.BlockingArrayQueue.poll(BlockingArrayQueue.java:219)
at app//org.eclipse.jetty.util.thread.QueuedThreadPool$Runner.idleJobPoll(QueuedThreadPool.java:1124)
at app//org.eclipse.jetty.util.thread.QueuedThreadPool$Runner.run(QueuedThreadPool.java:1141)
at java.base@11.0.16.1/java.lang.Thread.run(Thread.java:829)
25) Thread[id=88, name=CloserThread, state=WAITING, group=TGRP-JWTAuthPluginIntegrationTest]
at java.base@11.0.16.1/java.lang.Object.wait(Native Method)
at java.base@11.0.16.1/java.lang.Object.wait(Object.java:328)
at app//org.apache.solr.core.CloserThread.run(CoreContainer.java:2595)
26) Thread[id=89, name=coreContainerWorkExecutor-16-thread-1, state=TIMED_WAITING, group=TGRP-JWTAuthPluginIntegrationTest]
at java.base@11.0.16.1/jdk.internal.misc.Unsafe.park(Native Method)
at java.base@11.0.16.1/java.util.concurrent.locks.LockSupport.parkNanos(LockSupport.java:234)
at java.base@11.0.16.1/java.util.concurrent.SynchronousQueue$TransferStack.awaitFulfill(SynchronousQueue.java:462)
at java.base@11.0.16.1/java.util.concurrent.SynchronousQueue$TransferStack.transfer(SynchronousQueue.java:361)
at java.base@11.0.16.1/java.util.concurrent.SynchronousQueue.poll(SynchronousQueue.java:937)
at java.base@11.0.16.1/java.util.concurrent.ThreadPoolExecutor.getTask(ThreadPoolExecutor.java:1053)
at java.base@11.0.16.1/java.util.concurrent.ThreadPoolExecutor.runWorker(ThreadPoolExecutor.java:1114)
at java.base@11.0.16.1/java.util.concurrent.ThreadPoolExecutor$Worker.run(ThreadPoolExecutor.java:628)
at java.base@11.0.16.1/java.lang.Thread.run(Thread.java:829)
27) Thread[id=83, name=zkCallback-29-thread-1, state=TIMED_WAITING, group=TGRP-JWTAuthPluginIntegrationTest]
at java.base@11.0.16.1/jdk.internal.misc.Unsafe.park(Native Method)
at java.base@11.0.16.1/java.util.concurrent.locks.LockSupport.parkNanos(LockSupport.java:234)
at java.base@11.0.16.1/java.util.concurrent.SynchronousQueue$TransferStack.awaitFulfill(SynchronousQueue.java:462)
at java.base@11.0.16.1/java.util.concurrent.SynchronousQueue$TransferStack.transfer(SynchronousQueue.java:361)
at java.base@11.0.16.1/java.util.concurrent.SynchronousQueue.poll(SynchronousQueue.java:937)
at java.base@11.0.16.1/java.util.concurrent.ThreadPoolExecutor.getTask(ThreadPoolExecutor.java:1053)
at java.base@11.0.16.1/java.util.concurrent.ThreadPoolExecutor.runWorker(ThreadPoolExecutor.java:1114)
at java.base@11.0.16.1/java.util.concurrent.ThreadPoolExecutor$Worker.run(ThreadPoolExecutor.java:628)
at java.base@11.0.16.1/java.lang.Thread.run(Thread.java:829)
28) Thread[id=92, name=TEST-JWTAuthPluginIntegrationTest.mockOAuth2Server-seed#[E0AC17E008E3B44E]-SendThread(127.0.0.1:41873), state=RUNNABLE, group=TGRP-JWTAuthPluginIntegrationTest]
at java.base@11.0.16.1/sun.nio.ch.EPoll.wait(Native Method)
at java.base@11.0.16.1/sun.nio.ch.EPollSelectorImpl.doSelect(EPollSelectorImpl.java:120)
at java.base@11.0.16.1/sun.nio.ch.SelectorImpl.lockAndDoSelect(SelectorImpl.java:124)
at java.base@11.0.16.1/sun.nio.ch.SelectorImpl.select(SelectorImpl.java:136)
at app//org.apache.zookeeper.ClientCnxnSocketNIO.doTransport(ClientCnxnSocket
[...truncated too long message...]
hronizer.java:2123)
at app//org.eclipse.jetty.util.BlockingArrayQueue.poll(BlockingArrayQueue.java:219)
at app//org.eclipse.jetty.util.thread.QueuedThreadPool$Runner.idleJobPoll(QueuedThreadPool.java:1124)
at app//org.eclipse.jetty.util.thread.QueuedThreadPool$Runner.run(QueuedThreadPool.java:1141)
at java.base@11.0.16.1/java.lang.Thread.run(Thread.java:829)
49) Thread[id=30, name=NIOWorkerThread-3, state=WAITING, group=TGRP-JWTAuthPluginIntegrationTest]
at java.base@11.0.16.1/jdk.internal.misc.Unsafe.park(Native Method)
at java.base@11.0.16.1/java.util.concurrent.locks.LockSupport.park(LockSupport.java:194)
at java.base@11.0.16.1/java.util.concurrent.locks.AbstractQueuedSynchronizer$ConditionObject.await(AbstractQueuedSynchronizer.java:2081)
at java.base@11.0.16.1/java.util.concurrent.LinkedBlockingQueue.take(LinkedBlockingQueue.java:433)
at java.base@11.0.16.1/java.util.concurrent.ThreadPoolExecutor.getTask(ThreadPoolExecutor.java:1054)
at java.base@11.0.16.1/java.util.concurrent.ThreadPoolExecutor.runWorker(ThreadPoolExecutor.java:1114)
at java.base@11.0.16.1/java.util.concurrent.ThreadPoolExecutor$Worker.run(ThreadPoolExecutor.java:628)
at java.base@11.0.16.1/java.lang.Thread.run(Thread.java:829)
50) Thread[id=26, name=NIOWorkerThread-1, state=WAITING, group=TGRP-JWTAuthPluginIntegrationTest]
at java.base@11.0.16.1/jdk.internal.misc.Unsafe.park(Native Method)
at java.base@11.0.16.1/java.util.concurrent.locks.LockSupport.park(LockSupport.java:194)
at java.base@11.0.16.1/java.util.concurrent.locks.AbstractQueuedSynchronizer$ConditionObject.await(AbstractQueuedSynchronizer.java:2081)
at java.base@11.0.16.1/java.util.concurrent.LinkedBlockingQueue.take(LinkedBlockingQueue.java:433)
at java.base@11.0.16.1/java.util.concurrent.ThreadPoolExecutor.getTask(ThreadPoolExecutor.java:1054)
at java.base@11.0.16.1/java.util.concurrent.ThreadPoolExecutor.runWorker(ThreadPoolExecutor.java:1114)
at java.base@11.0.16.1/java.util.concurrent.ThreadPoolExecutor$Worker.run(ThreadPoolExecutor.java:628)
at java.base@11.0.16.1/java.lang.Thread.run(Thread.java:829)
at __randomizedtesting.SeedInfo.seed([E0AC17E008E3B44E]:0)
Build Log:
[...truncated 5400 lines...]
ERROR: The following test(s) have failed:
- org.apache.solr.security.jwt.JWTAuthPluginIntegrationTest.mockOAuth2Server (:solr:modules:jwt-auth)
Test output: /home/jenkins/jenkins-slave/workspace/Solr/Solr-BadApples-Tests-main/solr/modules/jwt-auth/build/test-results/test/outputs/OUTPUT-org.apache.solr.security.jwt.JWTAuthPluginIntegrationTest.txt
Reproduce with: gradlew :solr:modules:jwt-auth:test --tests "org.apache.solr.security.jwt.JWTAuthPluginIntegrationTest.mockOAuth2Server" -Ptests.jvms=4 -Ptests.haltonfailure=false "-Ptests.jvmargs=-XX:TieredStopAtLevel=1 -XX:+UseParallelGC -XX:ActiveProcessorCount=1 -XX:ReservedCodeCacheSize=120m" -Ptests.seed=E0AC17E008E3B44E -Ptests.multiplier=2 -Ptests.badapples=true -Ptests.file.encoding=US-ASCII
- org.apache.solr.security.jwt.JWTAuthPluginIntegrationTest.classMethod (:solr:modules:jwt-auth)
Test output: /home/jenkins/jenkins-slave/workspace/Solr/Solr-BadApples-Tests-main/solr/modules/jwt-auth/build/test-results/test/outputs/OUTPUT-org.apache.solr.security.jwt.JWTAuthPluginIntegrationTest.txt
Reproduce with: gradlew :solr:modules:jwt-auth:test --tests "org.apache.solr.security.jwt.JWTAuthPluginIntegrationTest.classMethod" -Ptests.jvms=4 -Ptests.haltonfailure=false "-Ptests.jvmargs=-XX:TieredStopAtLevel=1 -XX:+UseParallelGC -XX:ActiveProcessorCount=1 -XX:ReservedCodeCacheSize=120m" -Ptests.seed=E0AC17E008E3B44E -Ptests.multiplier=2 -Ptests.badapples=true -Ptests.file.encoding=US-ASCII
- org.apache.solr.security.jwt.JWTAuthPluginIntegrationTest.classMethod (:solr:modules:jwt-auth)
Test output: /home/jenkins/jenkins-slave/workspace/Solr/Solr-BadApples-Tests-main/solr/modules/jwt-auth/build/test-results/test/outputs/OUTPUT-org.apache.solr.security.jwt.JWTAuthPluginIntegrationTest.txt
Reproduce with: gradlew :solr:modules:jwt-auth:test --tests "org.apache.solr.security.jwt.JWTAuthPluginIntegrationTest.classMethod" -Ptests.jvms=4 -Ptests.haltonfailure=false "-Ptests.jvmargs=-XX:TieredStopAtLevel=1 -XX:+UseParallelGC -XX:ActiveProcessorCount=1 -XX:ReservedCodeCacheSize=120m" -Ptests.seed=E0AC17E008E3B44E -Ptests.multiplier=2 -Ptests.badapples=true -Ptests.file.encoding=US-ASCII
Deprecated Gradle features were used in this build, making it incompatible with Gradle 8.0.
You can use '--warning-mode all' to show the individual deprecation warnings and determine if they come from your own scripts or plugins.
See https://docs.gradle.org/7.6/userguide/command_line_interface.html#sec:command_line_warnings
BUILD SUCCESSFUL in 42m 36s
141 actionable tasks: 141 executed
Publishing build scan...
https://ge.apache.org/s/sbuy5cwx4bgro
Build step 'Invoke Gradle script' changed build result to SUCCESS
Archiving artifacts
hudson.FilePath$ValidateAntFileMask$1Cancel
at hudson.FilePath$ValidateAntFileMask$1.isCaseSensitive(FilePath.java:3300)
at org.apache.tools.ant.DirectoryScanner.isIncluded(DirectoryScanner.java:1370)
at org.apache.tools.ant.DirectoryScanner.scandir(DirectoryScanner.java:1260)
at org.apache.tools.ant.DirectoryScanner.scandir(DirectoryScanner.java:1267)
at org.apache.tools.ant.DirectoryScanner.scandir(DirectoryScanner.java:1267)
at org.apache.tools.ant.DirectoryScanner.scandir(DirectoryScanner.java:1267)
at org.apache.tools.ant.DirectoryScanner.scandir(DirectoryScanner.java:1267)
at org.apache.tools.ant.DirectoryScanner.scandir(DirectoryScanner.java:1267)
at org.apache.tools.ant.DirectoryScanner.scandir(DirectoryScanner.java:1267)
at org.apache.tools.ant.DirectoryScanner.scandir(DirectoryScanner.java:1267)
at org.apache.tools.ant.DirectoryScanner.scandir(DirectoryScanner.java:1194)
at org.apache.tools.ant.DirectoryScanner.scandir(DirectoryScanner.java:1156)
at org.apache.tools.ant.DirectoryScanner.checkIncludePatterns(DirectoryScanner.java:954)
at org.apache.tools.ant.DirectoryScanner.scan(DirectoryScanner.java:912)
at hudson.FilePath$ValidateAntFileMask.hasMatch(FilePath.java:3313)
Caused: hudson.FilePath$FileMaskNoMatchesFoundException: no matches found within 10000
at hudson.FilePath$ValidateAntFileMask.hasMatch(FilePath.java:3318)
at hudson.FilePath$ValidateAntFileMask.invoke(FilePath.java:3196)
at hudson.FilePath$ValidateAntFileMask.invoke(FilePath.java:3174)
at hudson.FilePath$FileCallableWrapper.call(FilePath.java:3578)
Also: hudson.remoting.Channel$CallSiteStackTrace: Remote call to lucene-solr-1
at hudson.remoting.Channel.attachCallSiteStackTrace(Channel.java:1784)
at hudson.remoting.UserRequest$ExceptionResponse.retrieve(UserRequest.java:356)
at hudson.remoting.Channel.call(Channel.java:1000)
at hudson.FilePath.act(FilePath.java:1192)
at hudson.FilePath.act(FilePath.java:1181)
at hudson.FilePath.validateAntFileMask(FilePath.java:3171)
at hudson.tasks.ArtifactArchiver.perform(ArtifactArchiver.java:271)
at hudson.tasks.BuildStepCompatibilityLayer.perform(BuildStepCompatibilityLayer.java:80)
at hudson.tasks.BuildStepMonitor$1.perform(BuildStepMonitor.java:20)
at hudson.model.AbstractBuild$AbstractBuildExecution.perform(AbstractBuild.java:818)
at hudson.model.AbstractBuild$AbstractBuildExecution.performAllBuildSteps(AbstractBuild.java:767)
at hudson.model.Build$BuildExecution.post2(Build.java:179)
at hudson.model.AbstractBuild$AbstractBuildExecution.post(AbstractBuild.java:711)
at hudson.model.Run.execute(Run.java:1925)
at hudson.model.FreeStyleBuild.run(FreeStyleBuild.java:44)
at hudson.model.ResourceController.execute(ResourceController.java:101)
at hudson.model.Executor.run(Executor.java:442)
Caused: hudson.FilePath$TunneledInterruptedException
at hudson.FilePath$FileCallableWrapper.call(FilePath.java:3580)
at hudson.remoting.UserRequest.perform(UserRequest.java:211)
at hudson.remoting.UserRequest.perform(UserRequest.java:54)
at hudson.remoting.Request$2.run(Request.java:377)
at hudson.remoting.InterceptingExecutorService.lambda$wrap$0(InterceptingExecutorService.java:78)
at java.base/java.util.concurrent.FutureTask.run(FutureTask.java:264)
at java.base/java.util.concurrent.ThreadPoolExecutor.runWorker(ThreadPoolExecutor.java:1128)
at java.base/java.util.concurrent.ThreadPoolExecutor$Worker.run(ThreadPoolExecutor.java:628)
at java.base/java.lang.Thread.run(Thread.java:829)
Caused: java.lang.InterruptedException: hudson.FilePath$FileMaskNoMatchesFoundException: no matches found within 10000
at hudson.FilePath.act(FilePath.java:1194)
at hudson.FilePath.act(FilePath.java:1181)
at hudson.FilePath.validateAntFileMask(FilePath.java:3171)
at hudson.tasks.ArtifactArchiver.perform(ArtifactArchiver.java:271)
at hudson.tasks.BuildStepCompatibilityLayer.perform(BuildStepCompatibilityLayer.java:80)
at hudson.tasks.BuildStepMonitor$1.perform(BuildStepMonitor.java:20)
at hudson.model.AbstractBuild$AbstractBuildExecution.perform(AbstractBuild.java:818)
at hudson.model.AbstractBuild$AbstractBuildExecution.performAllBuildSteps(AbstractBuild.java:767)
at hudson.model.Build$BuildExecution.post2(Build.java:179)
at hudson.model.AbstractBuild$AbstractBuildExecution.post(AbstractBuild.java:711)
at hudson.model.Run.execute(Run.java:1925)
at hudson.model.FreeStyleBuild.run(FreeStyleBuild.java:44)
at hudson.model.ResourceController.execute(ResourceController.java:101)
at hudson.model.Executor.run(Executor.java:442)
No artifacts found that match the file pattern "**/*.events,heapdumps/**,**/hs_err_pid*". Configuration error?
Recording test results
[Checks API] No suitable checks publisher found.
Build step 'Publish JUnit test result report' changed build result to UNSTABLE
Email was triggered for: Unstable (Test Failures)
Sending email for trigger: Unstable (Test Failures)