You are viewing a plain text version of this content. The canonical link for it is here.
Posted to builds@beam.apache.org by Apache Jenkins Server <je...@builds.apache.org> on 2023/04/21 17:55:19 UTC
Build failed in Jenkins: beam_PostCommit_Java_Jpms_Dataflow_Java11 #3675
See <https://ci-beam.apache.org/job/beam_PostCommit_Java_Jpms_Dataflow_Java11/3675/display/redirect?page=changes>
Changes:
[noreply] Fix lint errors from #26170 (#26382)
------------------------------------------
Started by timer
Running as SYSTEM
[EnvInject] - Loading node environment variables.
Building remotely on apache-beam-jenkins-11 (beam) in workspace <https://ci-beam.apache.org/job/beam_PostCommit_Java_Jpms_Dataflow_Java11/ws/>
The recommended git tool is: NONE
No credentials specified
Wiping out workspace first.
Cloning the remote Git repository
Using shallow clone with depth 1
Avoid fetching tags
Cloning repository https://github.com/apache/beam.git
> git init <https://ci-beam.apache.org/job/beam_PostCommit_Java_Jpms_Dataflow_Java11/ws/src> # timeout=10
Fetching upstream changes from https://github.com/apache/beam.git
> git --version # timeout=10
> git --version # 'git version 2.25.1'
> git fetch --no-tags --force --progress --depth=1 -- https://github.com/apache/beam.git +refs/heads/*:refs/remotes/origin/* # timeout=10
> git config remote.origin.url https://github.com/apache/beam.git # timeout=10
> git config --add remote.origin.fetch +refs/heads/*:refs/remotes/origin/* # timeout=10
> git config remote.origin.url https://github.com/apache/beam.git # timeout=10
Using shallow fetch with depth 1
Fetching upstream changes from https://github.com/apache/beam.git
> git fetch --no-tags --force --progress --depth=1 -- https://github.com/apache/beam.git +refs/heads/*:refs/remotes/origin/* +refs/pull/${ghprbPullId}/*:refs/remotes/origin/pr/${ghprbPullId}/* # timeout=10
> git rev-parse origin/master^{commit} # timeout=10
Checking out Revision 818c2b44e998529f3e5727a5d30b75922e0d113d (origin/master)
> git config core.sparsecheckout # timeout=10
> git checkout -f 818c2b44e998529f3e5727a5d30b75922e0d113d # timeout=10
Commit message: "Fix lint errors from #26170 (#26382)"
> git rev-list --no-walk 2c6a215b9d87e2b94809d54f75b2dda12eb92c90 # timeout=10
No emails were triggered.
[EnvInject] - Executing scripts and injecting environment variables after the SCM step.
[EnvInject] - Injecting as environment variables the properties content
SETUPTOOLS_USE_DISTUTILS=stdlib
SPARK_LOCAL_IP=127.0.0.1
[EnvInject] - Variables injected successfully.
[Gradle] - Launching build.
[src] $ <https://ci-beam.apache.org/job/beam_PostCommit_Java_Jpms_Dataflow_Java11/ws/src/gradlew> --continue --max-workers=8 -Dorg.gradle.jvmargs=-Xms2g -Dorg.gradle.jvmargs=-Xmx6g -Dorg.gradle.vfs.watch=false -Pdocker-pull-licenses -Dorg.gradle.java.home=/usr/lib/jvm/java-11-openjdk-amd64 -Pmaven_home=/home/jenkins/tools/maven/apache-maven-3.5.4 :sdks:java:testing:jpms-tests:dataflowRunnerIntegrationTest
To honour the JVM settings for this build a single-use Daemon process will be forked. See https://docs.gradle.org/7.5.1/userguide/gradle_daemon.html#sec:disabling_the_daemon.
Daemon will be stopped at the end of the build
Configuration on demand is an incubating feature.
Gradle Enterprise plugins resolution: https://plugins.gradle.org/m2
Applying com.gradle.CommonCustomUserDataGradlePlugin via init script
> Task :buildSrc:compileJava NO-SOURCE
> Task :buildSrc:compileGroovy FROM-CACHE
> Task :buildSrc:pluginDescriptors
> Task :buildSrc:processResources
> Task :buildSrc:classes
> Task :buildSrc:jar
> Task :buildSrc:assemble
> Task :buildSrc:spotlessGroovy FROM-CACHE
> Task :buildSrc:spotlessGroovyCheck UP-TO-DATE
> Task :buildSrc:spotlessGroovyGradle FROM-CACHE
> Task :buildSrc:spotlessGroovyGradleCheck UP-TO-DATE
> Task :buildSrc:spotlessCheck UP-TO-DATE
> Task :buildSrc:pluginUnderTestMetadata
> Task :buildSrc:compileTestJava NO-SOURCE
> Task :buildSrc:compileTestGroovy NO-SOURCE
> Task :buildSrc:processTestResources NO-SOURCE
> Task :buildSrc:testClasses UP-TO-DATE
> Task :buildSrc:test NO-SOURCE
> Task :buildSrc:validatePlugins FROM-CACHE
> Task :buildSrc:check UP-TO-DATE
> Task :buildSrc:build
> Configure project :sdks:java:container:java8
docker-pull-licenses set, creating go-licenses
> Configure project :sdks:java:container:java11
docker-pull-licenses set, creating go-licenses
> Task :model:pipeline:createCheckerFrameworkManifest
> Task :model:fn-execution:createCheckerFrameworkManifest
> Task :sdks:java:extensions:avro:createCheckerFrameworkManifest
> Task :sdks:java:core:createCheckerFrameworkManifest
> Task :sdks:java:fn-execution:createCheckerFrameworkManifest
> Task :runners:core-construction-java:createCheckerFrameworkManifest
> Task :runners:core-java:createCheckerFrameworkManifest
> Task :model:job-management:createCheckerFrameworkManifest
> Task :sdks:java:extensions:avro:generateAvroProtocol NO-SOURCE
> Task :sdks:java:core:generateAvroProtocol NO-SOURCE
> Task :runners:core-java:processResources NO-SOURCE
> Task :sdks:java:core:generateAvroJava NO-SOURCE
> Task :sdks:java:fn-execution:processResources NO-SOURCE
> Task :runners:core-construction-java:processResources NO-SOURCE
> Task :sdks:java:extensions:avro:generateAvroJava NO-SOURCE
> Task :model:fn-execution:extractProto
> Task :model:job-management:extractProto
> Task :sdks:java:extensions:avro:processResources NO-SOURCE
> Task :runners:java-fn-execution:createCheckerFrameworkManifest
> Task :runners:google-cloud-dataflow-java:createCheckerFrameworkManifest
> Task :runners:java-fn-execution:processResources NO-SOURCE
> Task :sdks:java:testing:jpms-tests:createCheckerFrameworkManifest
> Task :sdks:java:testing:jpms-tests:processResources NO-SOURCE
> Task :sdks:java:testing:jpms-tests:processTestResources NO-SOURCE
> Task :sdks:java:harness:createCheckerFrameworkManifest
> Task :sdks:java:extensions:google-cloud-platform-core:createCheckerFrameworkManifest
> Task :sdks:java:core:generateGrammarSource FROM-CACHE
> Task :sdks:java:extensions:google-cloud-platform-core:processResources NO-SOURCE
> Task :sdks:java:harness:processResources NO-SOURCE
> Task :model:job-management:processResources
> Task :model:fn-execution:processResources
> Task :sdks:java:expansion-service:createCheckerFrameworkManifest
> Task :sdks:java:expansion-service:processResources NO-SOURCE
> Task :sdks:java:extensions:protobuf:createCheckerFrameworkManifest
> Task :sdks:java:extensions:arrow:createCheckerFrameworkManifest
> Task :sdks:java:io:google-cloud-platform:createCheckerFrameworkManifest
> Task :sdks:java:extensions:protobuf:extractProto
> Task :sdks:java:io:kafka:createCheckerFrameworkManifest
> Task :sdks:java:extensions:arrow:processResources NO-SOURCE
> Task :sdks:java:io:kafka:processResources NO-SOURCE
> Task :sdks:java:io:google-cloud-platform:processResources NO-SOURCE
> Task :sdks:java:extensions:protobuf:processResources NO-SOURCE
> Task :sdks:java:core:processResources
> Task :runners:google-cloud-dataflow-java:processResources
> Task :model:pipeline:extractIncludeProto
> Task :model:pipeline:extractProto
> Task :model:pipeline:generateProto FROM-CACHE
> Task :model:pipeline:compileJava FROM-CACHE
> Task :model:pipeline:processResources
> Task :model:pipeline:classes
> Task :model:pipeline:jar
> Task :model:pipeline:shadowJar FROM-CACHE
> Task :model:fn-execution:extractIncludeProto
> Task :model:job-management:extractIncludeProto
> Task :model:job-management:generateProto FROM-CACHE
> Task :model:fn-execution:generateProto FROM-CACHE
> Task :model:job-management:compileJava FROM-CACHE
> Task :model:job-management:classes
> Task :model:fn-execution:compileJava FROM-CACHE
> Task :model:fn-execution:classes
> Task :model:job-management:shadowJar FROM-CACHE
> Task :model:fn-execution:shadowJar FROM-CACHE
> Task :sdks:java:core:compileJava FROM-CACHE
> Task :sdks:java:core:classes
> Task :sdks:java:core:shadowJar FROM-CACHE
> Task :sdks:java:extensions:arrow:compileJava FROM-CACHE
> Task :sdks:java:extensions:arrow:classes UP-TO-DATE
> Task :sdks:java:extensions:arrow:jar
> Task :sdks:java:extensions:avro:compileJava FROM-CACHE
> Task :sdks:java:extensions:avro:classes UP-TO-DATE
> Task :sdks:java:extensions:avro:jar
> Task :sdks:java:fn-execution:compileJava FROM-CACHE
> Task :sdks:java:fn-execution:classes UP-TO-DATE
> Task :sdks:java:fn-execution:jar
> Task :sdks:java:extensions:protobuf:extractIncludeProto
> Task :runners:core-construction-java:compileJava FROM-CACHE
> Task :runners:core-construction-java:classes UP-TO-DATE
> Task :sdks:java:extensions:protobuf:generateProto NO-SOURCE
> Task :sdks:java:extensions:protobuf:compileJava FROM-CACHE
> Task :sdks:java:extensions:protobuf:classes UP-TO-DATE
> Task :runners:core-construction-java:jar
> Task :sdks:java:extensions:protobuf:jar
> Task :runners:core-java:compileJava FROM-CACHE
> Task :runners:core-java:classes UP-TO-DATE
> Task :runners:core-java:jar
> Task :sdks:java:extensions:google-cloud-platform-core:compileJava FROM-CACHE
> Task :sdks:java:extensions:google-cloud-platform-core:classes UP-TO-DATE
> Task :sdks:java:harness:compileJava FROM-CACHE
> Task :sdks:java:harness:classes UP-TO-DATE
> Task :sdks:java:extensions:google-cloud-platform-core:jar
> Task :sdks:java:testing:jpms-tests:compileJava FROM-CACHE
> Task :sdks:java:testing:jpms-tests:classes UP-TO-DATE
> Task :sdks:java:testing:jpms-tests:jar
> Task :sdks:java:harness:jar
> Task :sdks:java:testing:jpms-tests:compileTestJava FROM-CACHE
> Task :sdks:java:testing:jpms-tests:testClasses UP-TO-DATE
> Task :sdks:java:testing:jpms-tests:testJar
> Task :runners:java-fn-execution:compileJava FROM-CACHE
> Task :runners:java-fn-execution:classes UP-TO-DATE
> Task :runners:java-fn-execution:jar
> Task :sdks:java:expansion-service:compileJava FROM-CACHE
> Task :sdks:java:expansion-service:classes UP-TO-DATE
> Task :sdks:java:expansion-service:jar
> Task :sdks:java:io:kafka:compileJava FROM-CACHE
> Task :sdks:java:io:kafka:classes UP-TO-DATE
> Task :sdks:java:io:kafka:jar
> Task :sdks:java:io:google-cloud-platform:compileJava FROM-CACHE
> Task :sdks:java:io:google-cloud-platform:classes UP-TO-DATE
> Task :sdks:java:io:google-cloud-platform:jar
> Task :runners:google-cloud-dataflow-java:compileJava FROM-CACHE
> Task :runners:google-cloud-dataflow-java:classes
> Task :runners:google-cloud-dataflow-java:jar
> Task :sdks:java:testing:jpms-tests:dataflowRunnerIntegrationTest
org.apache.beam.sdk.jpmstests.JpmsIT > testE2EJpms FAILED
java.lang.RuntimeException at JpmsIT.java:63
1 test completed, 1 failed
> Task :sdks:java:testing:jpms-tests:dataflowRunnerIntegrationTest FAILED
FAILURE: Build failed with an exception.
* What went wrong:
Execution failed for task ':sdks:java:testing:jpms-tests:dataflowRunnerIntegrationTest'.
> There were failing tests. See the report at: file://<https://ci-beam.apache.org/job/beam_PostCommit_Java_Jpms_Dataflow_Java11/ws/src/sdks/java/testing/jpms-tests/build/reports/tests/dataflowRunnerIntegrationTest/index.html>
* Try:
> Run with --stacktrace option to get the stack trace.
> Run with --info or --debug option to get more log output.
* Get more help at https://help.gradle.org
Deprecated Gradle features were used in this build, making it incompatible with Gradle 8.0.
You can use '--warning-mode all' to show the individual deprecation warnings and determine if they come from your own scripts or plugins.
See https://docs.gradle.org/7.5.1/userguide/command_line_interface.html#sec:command_line_warnings
BUILD FAILED in 1h 4m 46s
85 actionable tasks: 52 executed, 31 from cache, 2 up-to-date
Build scan background action failed.
java.lang.IllegalArgumentException: com.gradle.enterprise.gradleplugin.internal.extension.a is not an interface
at java.lang.reflect.Proxy$ProxyBuilder.validateProxyInterfaces(Proxy.java:688)
at java.lang.reflect.Proxy$ProxyBuilder.<init>(Proxy.java:627)
at java.lang.reflect.Proxy.lambda$getProxyConstructor$1(Proxy.java:426)
at jdk.internal.loader.AbstractClassLoaderValue$Memoizer.get(AbstractClassLoaderValue.java:329)
at jdk.internal.loader.AbstractClassLoaderValue.computeIfAbsent(AbstractClassLoaderValue.java:205)
at java.lang.reflect.Proxy.getProxyConstructor(Proxy.java:424)
at java.lang.reflect.Proxy.newProxyInstance(Proxy.java:1006)
at com.gradle.ProxyFactory$ProxyingInvocationHandler.createLocalProxy(ProxyFactory.java:64)
at com.gradle.ProxyFactory$ProxyingInvocationHandler.lambda$adaptActionArg$1(ProxyFactory.java:59)
at com.gradle.enterprise.gradleplugin.internal.extension.b$3.run(SourceFile:100)
at java.util.concurrent.Executors$RunnableAdapter.call(Executors.java:515)
at java.util.concurrent.FutureTask.run(FutureTask.java:264)
at java.util.concurrent.ThreadPoolExecutor.runWorker(ThreadPoolExecutor.java:1128)
at java.util.concurrent.ThreadPoolExecutor$Worker.run(ThreadPoolExecutor.java:628)
at java.lang.Thread.run(Thread.java:829)
Publishing build scan...
https://gradle.com/s/x4vwj7oj2u7hi
Build step 'Invoke Gradle script' changed build result to FAILURE
Build step 'Invoke Gradle script' marked build as failure
---------------------------------------------------------------------
To unsubscribe, e-mail: builds-unsubscribe@beam.apache.org
For additional commands, e-mail: builds-help@beam.apache.org
Jenkins build is back to normal : beam_PostCommit_Java_Jpms_Dataflow_Java11 #3703
Posted by Apache Jenkins Server <je...@builds.apache.org>.
See <https://ci-beam.apache.org/job/beam_PostCommit_Java_Jpms_Dataflow_Java11/3703/display/redirect?page=changes>
---------------------------------------------------------------------
To unsubscribe, e-mail: builds-unsubscribe@beam.apache.org
For additional commands, e-mail: builds-help@beam.apache.org
beam_PostCommit_Java_Jpms_Dataflow_Java11 - Build # 3702 - Aborted!
Posted by Apache Jenkins Server <je...@builds.apache.org>.
beam_PostCommit_Java_Jpms_Dataflow_Java11 - Build # 3702 - Aborted:
Check console output at https://ci-beam.apache.org/job/beam_PostCommit_Java_Jpms_Dataflow_Java11/3702/ to view the results.
beam_PostCommit_Java_Jpms_Dataflow_Java11 - Build # 3701 - Aborted!
Posted by Apache Jenkins Server <je...@builds.apache.org>.
beam_PostCommit_Java_Jpms_Dataflow_Java11 - Build # 3701 - Aborted:
Check console output at https://ci-beam.apache.org/job/beam_PostCommit_Java_Jpms_Dataflow_Java11/3701/ to view the results.
beam_PostCommit_Java_Jpms_Dataflow_Java11 - Build # 3700 - Aborted!
Posted by Apache Jenkins Server <je...@builds.apache.org>.
beam_PostCommit_Java_Jpms_Dataflow_Java11 - Build # 3700 - Aborted:
Check console output at https://ci-beam.apache.org/job/beam_PostCommit_Java_Jpms_Dataflow_Java11/3700/ to view the results.
Build failed in Jenkins: beam_PostCommit_Java_Jpms_Dataflow_Java11 #3699
Posted by Apache Jenkins Server <je...@builds.apache.org>.
See <https://ci-beam.apache.org/job/beam_PostCommit_Java_Jpms_Dataflow_Java11/3699/display/redirect>
Changes:
------------------------------------------
Started by timer
Running as SYSTEM
[EnvInject] - Loading node environment variables.
Building remotely on apache-beam-jenkins-8 (beam) in workspace <https://ci-beam.apache.org/job/beam_PostCommit_Java_Jpms_Dataflow_Java11/ws/>
The recommended git tool is: NONE
No credentials specified
Wiping out workspace first.
Cloning the remote Git repository
Using shallow clone with depth 1
Avoid fetching tags
Cloning repository https://github.com/apache/beam.git
> git init <https://ci-beam.apache.org/job/beam_PostCommit_Java_Jpms_Dataflow_Java11/ws/src> # timeout=10
Fetching upstream changes from https://github.com/apache/beam.git
> git --version # timeout=10
> git --version # 'git version 2.25.1'
> git fetch --no-tags --force --progress --depth=1 -- https://github.com/apache/beam.git +refs/heads/*:refs/remotes/origin/* # timeout=10
> git config remote.origin.url https://github.com/apache/beam.git # timeout=10
> git config --add remote.origin.fetch +refs/heads/*:refs/remotes/origin/* # timeout=10
> git config remote.origin.url https://github.com/apache/beam.git # timeout=10
Using shallow fetch with depth 1
Fetching upstream changes from https://github.com/apache/beam.git
> git fetch --no-tags --force --progress --depth=1 -- https://github.com/apache/beam.git +refs/heads/*:refs/remotes/origin/* +refs/pull/${ghprbPullId}/*:refs/remotes/origin/pr/${ghprbPullId}/* # timeout=10
> git rev-parse origin/master^{commit} # timeout=10
Checking out Revision 4f8f446cbb059be4c4080a0b83c1f9e5af206107 (origin/master)
> git config core.sparsecheckout # timeout=10
> git checkout -f 4f8f446cbb059be4c4080a0b83c1f9e5af206107 # timeout=10
Commit message: "Updating Combiners.Top PTransform Documentation (#26406)"
> git rev-list --no-walk 4fce2535f766bcd9e9d722b1b3c1b2d982605b1d # timeout=10
First time build. Skipping changelog.
No emails were triggered.
[EnvInject] - Executing scripts and injecting environment variables after the SCM step.
[EnvInject] - Injecting as environment variables the properties content
SETUPTOOLS_USE_DISTUTILS=stdlib
SPARK_LOCAL_IP=127.0.0.1
[EnvInject] - Variables injected successfully.
[Gradle] - Launching build.
[src] $ <https://ci-beam.apache.org/job/beam_PostCommit_Java_Jpms_Dataflow_Java11/ws/src/gradlew> --continue --max-workers=8 -Dorg.gradle.jvmargs=-Xms2g -Dorg.gradle.jvmargs=-Xmx6g -Dorg.gradle.vfs.watch=false -Pdocker-pull-licenses -Dorg.gradle.java.home=/usr/lib/jvm/java-11-openjdk-amd64 -Pmaven_home=/home/jenkins/tools/maven/apache-maven-3.5.4 :sdks:java:testing:jpms-tests:dataflowRunnerIntegrationTest
To honour the JVM settings for this build a single-use Daemon process will be forked. See https://docs.gradle.org/7.5.1/userguide/gradle_daemon.html#sec:disabling_the_daemon.
Daemon will be stopped at the end of the build
Configuration on demand is an incubating feature.
Gradle Enterprise plugins resolution: https://plugins.gradle.org/m2
Applying com.gradle.CommonCustomUserDataGradlePlugin via init script
> Task :buildSrc:compileJava NO-SOURCE
> Task :buildSrc:compileGroovy FROM-CACHE
> Task :buildSrc:pluginDescriptors
> Task :buildSrc:processResources
> Task :buildSrc:classes
> Task :buildSrc:jar
> Task :buildSrc:assemble
> Task :buildSrc:spotlessGroovy FROM-CACHE
> Task :buildSrc:spotlessGroovyCheck UP-TO-DATE
> Task :buildSrc:spotlessGroovyGradle FROM-CACHE
> Task :buildSrc:spotlessGroovyGradleCheck UP-TO-DATE
> Task :buildSrc:spotlessCheck UP-TO-DATE
> Task :buildSrc:pluginUnderTestMetadata
> Task :buildSrc:compileTestJava NO-SOURCE
> Task :buildSrc:compileTestGroovy NO-SOURCE
> Task :buildSrc:processTestResources NO-SOURCE
> Task :buildSrc:testClasses UP-TO-DATE
> Task :buildSrc:test NO-SOURCE
> Task :buildSrc:validatePlugins FROM-CACHE
> Task :buildSrc:check UP-TO-DATE
> Task :buildSrc:build
> Configure project :sdks:java:container:java8
docker-pull-licenses set, creating go-licenses
> Configure project :sdks:java:container:java11
docker-pull-licenses set, creating go-licenses
> Task :sdks:java:core:createCheckerFrameworkManifest
> Task :runners:core-java:createCheckerFrameworkManifest
> Task :sdks:java:extensions:avro:createCheckerFrameworkManifest
> Task :model:job-management:createCheckerFrameworkManifest
> Task :model:pipeline:createCheckerFrameworkManifest
> Task :model:fn-execution:createCheckerFrameworkManifest
> Task :runners:core-construction-java:createCheckerFrameworkManifest
> Task :sdks:java:fn-execution:createCheckerFrameworkManifest
> Task :sdks:java:core:generateAvroProtocol NO-SOURCE
> Task :sdks:java:extensions:avro:generateAvroProtocol NO-SOURCE
> Task :sdks:java:fn-execution:processResources NO-SOURCE
> Task :runners:core-construction-java:processResources NO-SOURCE
> Task :runners:core-java:processResources NO-SOURCE
> Task :sdks:java:core:generateAvroJava NO-SOURCE
> Task :sdks:java:extensions:avro:generateAvroJava NO-SOURCE
> Task :model:job-management:extractProto
> Task :model:fn-execution:extractProto
> Task :sdks:java:extensions:avro:processResources NO-SOURCE
> Task :sdks:java:extensions:google-cloud-platform-core:createCheckerFrameworkManifest
> Task :runners:google-cloud-dataflow-java:createCheckerFrameworkManifest
> Task :sdks:java:testing:jpms-tests:createCheckerFrameworkManifest
> Task :sdks:java:extensions:google-cloud-platform-core:processResources NO-SOURCE
> Task :sdks:java:testing:jpms-tests:processResources NO-SOURCE
> Task :sdks:java:testing:jpms-tests:processTestResources NO-SOURCE
> Task :model:job-management:processResources
> Task :sdks:java:harness:createCheckerFrameworkManifest
> Task :sdks:java:core:generateGrammarSource FROM-CACHE
> Task :sdks:java:expansion-service:createCheckerFrameworkManifest
> Task :runners:java-fn-execution:createCheckerFrameworkManifest
> Task :model:fn-execution:processResources
> Task :sdks:java:harness:processResources NO-SOURCE
> Task :runners:java-fn-execution:processResources NO-SOURCE
> Task :sdks:java:expansion-service:processResources NO-SOURCE
> Task :sdks:java:extensions:protobuf:createCheckerFrameworkManifest
> Task :sdks:java:extensions:arrow:createCheckerFrameworkManifest
> Task :sdks:java:io:google-cloud-platform:createCheckerFrameworkManifest
> Task :sdks:java:io:kafka:createCheckerFrameworkManifest
> Task :sdks:java:extensions:arrow:processResources NO-SOURCE
> Task :sdks:java:io:google-cloud-platform:processResources NO-SOURCE
> Task :sdks:java:io:kafka:processResources NO-SOURCE
> Task :sdks:java:extensions:protobuf:extractProto
> Task :sdks:java:extensions:protobuf:processResources NO-SOURCE
> Task :runners:google-cloud-dataflow-java:processResources
> Task :sdks:java:core:processResources
> Task :model:pipeline:extractIncludeProto
> Task :model:pipeline:extractProto
> Task :model:pipeline:generateProto FROM-CACHE
> Task :model:pipeline:compileJava FROM-CACHE
> Task :model:pipeline:processResources
> Task :model:pipeline:classes
> Task :model:pipeline:jar
> Task :model:pipeline:shadowJar FROM-CACHE
> Task :model:fn-execution:extractIncludeProto
> Task :model:job-management:extractIncludeProto
> Task :model:job-management:generateProto FROM-CACHE
> Task :model:fn-execution:generateProto FROM-CACHE
> Task :model:job-management:compileJava FROM-CACHE
> Task :model:job-management:classes
> Task :model:fn-execution:compileJava FROM-CACHE
> Task :model:fn-execution:classes
> Task :model:job-management:shadowJar FROM-CACHE
> Task :model:fn-execution:shadowJar FROM-CACHE
> Task :sdks:java:core:compileJava FROM-CACHE
> Task :sdks:java:core:classes
> Task :sdks:java:core:shadowJar FROM-CACHE
> Task :sdks:java:extensions:avro:compileJava FROM-CACHE
> Task :sdks:java:extensions:avro:classes UP-TO-DATE
> Task :sdks:java:extensions:avro:jar
> Task :sdks:java:extensions:arrow:compileJava FROM-CACHE
> Task :sdks:java:extensions:arrow:classes UP-TO-DATE
> Task :sdks:java:extensions:arrow:jar
> Task :sdks:java:fn-execution:compileJava FROM-CACHE
> Task :sdks:java:fn-execution:classes UP-TO-DATE
> Task :sdks:java:fn-execution:jar
> Task :sdks:java:extensions:protobuf:extractIncludeProto
> Task :sdks:java:extensions:protobuf:generateProto NO-SOURCE
> Task :sdks:java:extensions:protobuf:compileJava FROM-CACHE
> Task :sdks:java:extensions:protobuf:classes UP-TO-DATE
> Task :sdks:java:extensions:protobuf:jar
> Task :runners:core-construction-java:compileJava FROM-CACHE
> Task :runners:core-construction-java:classes UP-TO-DATE
> Task :runners:core-construction-java:jar
> Task :runners:core-java:compileJava FROM-CACHE
> Task :runners:core-java:classes UP-TO-DATE
> Task :runners:core-java:jar
> Task :sdks:java:extensions:google-cloud-platform-core:compileJava FROM-CACHE
> Task :sdks:java:extensions:google-cloud-platform-core:classes UP-TO-DATE
> Task :sdks:java:extensions:google-cloud-platform-core:jar
> Task :sdks:java:harness:compileJava FROM-CACHE
> Task :sdks:java:harness:classes UP-TO-DATE
> Task :sdks:java:testing:jpms-tests:compileJava FROM-CACHE
> Task :sdks:java:testing:jpms-tests:classes UP-TO-DATE
> Task :sdks:java:testing:jpms-tests:jar
> Task :sdks:java:testing:jpms-tests:compileTestJava FROM-CACHE
> Task :sdks:java:testing:jpms-tests:testClasses UP-TO-DATE
> Task :sdks:java:testing:jpms-tests:testJar
> Task :sdks:java:harness:jar
> Task :runners:java-fn-execution:compileJava FROM-CACHE
> Task :runners:java-fn-execution:classes UP-TO-DATE
> Task :runners:java-fn-execution:jar
> Task :sdks:java:expansion-service:compileJava FROM-CACHE
> Task :sdks:java:expansion-service:classes UP-TO-DATE
> Task :sdks:java:expansion-service:jar
> Task :sdks:java:io:kafka:compileJava FROM-CACHE
> Task :sdks:java:io:kafka:classes UP-TO-DATE
> Task :sdks:java:io:kafka:jar
> Task :sdks:java:io:google-cloud-platform:compileJava FROM-CACHE
> Task :sdks:java:io:google-cloud-platform:classes UP-TO-DATE
> Task :sdks:java:io:google-cloud-platform:jar
> Task :runners:google-cloud-dataflow-java:compileJava FROM-CACHE
> Task :runners:google-cloud-dataflow-java:classes
> Task :runners:google-cloud-dataflow-java:jar
> Task :sdks:java:testing:jpms-tests:dataflowRunnerIntegrationTest
Build timed out (after 240 minutes). Marking the build as aborted.
FATAL: command execution failed
hudson.remoting.ChannelClosedException: Channel "hudson.remoting.Channel@394104af:apache-beam-jenkins-8": Remote call on apache-beam-jenkins-8 failed. The channel is closing down or has closed down
at hudson.remoting.Channel.call(Channel.java:993)
at hudson.remoting.RemoteInvocationHandler.invoke(RemoteInvocationHandler.java:285)
at com.sun.proxy.$Proxy135.isAlive(Unknown Source)
at hudson.Launcher$RemoteLauncher$ProcImpl.isAlive(Launcher.java:1215)
at hudson.Launcher$RemoteLauncher$ProcImpl.join(Launcher.java:1207)
at hudson.Launcher$ProcStarter.join(Launcher.java:524)
at hudson.plugins.gradle.Gradle.perform(Gradle.java:321)
at hudson.tasks.BuildStepMonitor$1.perform(BuildStepMonitor.java:20)
at hudson.model.AbstractBuild$AbstractBuildExecution.perform(AbstractBuild.java:814)
at hudson.model.Build$BuildExecution.build(Build.java:199)
at hudson.model.Build$BuildExecution.doRun(Build.java:164)
at hudson.model.AbstractBuild$AbstractBuildExecution.run(AbstractBuild.java:522)
at hudson.model.Run.execute(Run.java:1896)
at hudson.model.FreeStyleBuild.run(FreeStyleBuild.java:44)
at hudson.model.ResourceController.execute(ResourceController.java:101)
at hudson.model.Executor.run(Executor.java:442)
Caused by: java.io.IOException
at hudson.remoting.Channel.close(Channel.java:1470)
at hudson.remoting.Channel.close(Channel.java:1447)
at hudson.slaves.SlaveComputer.closeChannel(SlaveComputer.java:902)
at hudson.slaves.SlaveComputer.access$100(SlaveComputer.java:111)
at hudson.slaves.SlaveComputer$2.run(SlaveComputer.java:782)
at jenkins.util.ContextResettingExecutorService$1.run(ContextResettingExecutorService.java:28)
at jenkins.security.ImpersonatingExecutorService$1.run(ImpersonatingExecutorService.java:68)
at java.base/java.util.concurrent.Executors$RunnableAdapter.call(Executors.java:515)
at java.base/java.util.concurrent.FutureTask.run(FutureTask.java:264)
at java.base/java.util.concurrent.ThreadPoolExecutor.runWorker(ThreadPoolExecutor.java:1128)
at java.base/java.util.concurrent.ThreadPoolExecutor$Worker.run(ThreadPoolExecutor.java:628)
at java.base/java.lang.Thread.run(Thread.java:829)
Build step 'Invoke Gradle script' changed build result to FAILURE
Build step 'Invoke Gradle script' marked build as failure
FATAL: Channel "hudson.remoting.Channel@394104af:apache-beam-jenkins-8": Remote call on apache-beam-jenkins-8 failed. The channel is closing down or has closed down
java.io.IOException
at hudson.remoting.Channel.close(Channel.java:1470)
at hudson.remoting.Channel.close(Channel.java:1447)
at hudson.slaves.SlaveComputer.closeChannel(SlaveComputer.java:902)
at hudson.slaves.SlaveComputer.access$100(SlaveComputer.java:111)
at hudson.slaves.SlaveComputer$2.run(SlaveComputer.java:782)
at jenkins.util.ContextResettingExecutorService$1.run(ContextResettingExecutorService.java:28)
at jenkins.security.ImpersonatingExecutorService$1.run(ImpersonatingExecutorService.java:68)
at java.base/java.util.concurrent.Executors$RunnableAdapter.call(Executors.java:515)
at java.base/java.util.concurrent.FutureTask.run(FutureTask.java:264)
at java.base/java.util.concurrent.ThreadPoolExecutor.runWorker(ThreadPoolExecutor.java:1128)
at java.base/java.util.concurrent.ThreadPoolExecutor$Worker.run(ThreadPoolExecutor.java:628)
at java.base/java.lang.Thread.run(Thread.java:829)
Caused: hudson.remoting.ChannelClosedException: Channel "hudson.remoting.Channel@394104af:apache-beam-jenkins-8": Remote call on apache-beam-jenkins-8 failed. The channel is closing down or has closed down
at hudson.remoting.Channel.call(Channel.java:993)
at hudson.Launcher$RemoteLauncher.kill(Launcher.java:1150)
at hudson.model.AbstractBuild$AbstractBuildExecution.run(AbstractBuild.java:534)
at hudson.model.Run.execute(Run.java:1896)
at hudson.model.FreeStyleBuild.run(FreeStyleBuild.java:44)
at hudson.model.ResourceController.execute(ResourceController.java:101)
at hudson.model.Executor.run(Executor.java:442)
---------------------------------------------------------------------
To unsubscribe, e-mail: builds-unsubscribe@beam.apache.org
For additional commands, e-mail: builds-help@beam.apache.org
beam_PostCommit_Java_Jpms_Dataflow_Java11 - Build # 3698 - Aborted!
Posted by Apache Jenkins Server <je...@builds.apache.org>.
beam_PostCommit_Java_Jpms_Dataflow_Java11 - Build # 3698 - Aborted:
Check console output at https://ci-beam.apache.org/job/beam_PostCommit_Java_Jpms_Dataflow_Java11/3698/ to view the results.
Build failed in Jenkins: beam_PostCommit_Java_Jpms_Dataflow_Java11 #3697
Posted by Apache Jenkins Server <je...@builds.apache.org>.
See <https://ci-beam.apache.org/job/beam_PostCommit_Java_Jpms_Dataflow_Java11/3697/display/redirect>
Changes:
------------------------------------------
Started by timer
Running as SYSTEM
[EnvInject] - Loading node environment variables.
Building remotely on apache-beam-jenkins-8 (beam) in workspace <https://ci-beam.apache.org/job/beam_PostCommit_Java_Jpms_Dataflow_Java11/ws/>
The recommended git tool is: NONE
No credentials specified
Wiping out workspace first.
Cloning the remote Git repository
Using shallow clone with depth 1
Avoid fetching tags
Cloning repository https://github.com/apache/beam.git
> git init <https://ci-beam.apache.org/job/beam_PostCommit_Java_Jpms_Dataflow_Java11/ws/src> # timeout=10
Fetching upstream changes from https://github.com/apache/beam.git
> git --version # timeout=10
> git --version # 'git version 2.25.1'
> git fetch --no-tags --force --progress --depth=1 -- https://github.com/apache/beam.git +refs/heads/*:refs/remotes/origin/* # timeout=10
> git config remote.origin.url https://github.com/apache/beam.git # timeout=10
> git config --add remote.origin.fetch +refs/heads/*:refs/remotes/origin/* # timeout=10
> git config remote.origin.url https://github.com/apache/beam.git # timeout=10
Using shallow fetch with depth 1
Fetching upstream changes from https://github.com/apache/beam.git
> git fetch --no-tags --force --progress --depth=1 -- https://github.com/apache/beam.git +refs/heads/*:refs/remotes/origin/* +refs/pull/${ghprbPullId}/*:refs/remotes/origin/pr/${ghprbPullId}/* # timeout=10
> git rev-parse origin/master^{commit} # timeout=10
Checking out Revision bd4ea843d370130140214512ed51869673f6ff72 (origin/master)
> git config core.sparsecheckout # timeout=10
> git checkout -f bd4ea843d370130140214512ed51869673f6ff72 # timeout=10
Commit message: "Bump github.com/lib/pq from 1.10.7 to 1.10.9 in /sdks (#26426)"
> git rev-list --no-walk 3440ae59a815e2ee90528b503d116a21ac5b1672 # timeout=10
First time build. Skipping changelog.
No emails were triggered.
[EnvInject] - Executing scripts and injecting environment variables after the SCM step.
[EnvInject] - Injecting as environment variables the properties content
SETUPTOOLS_USE_DISTUTILS=stdlib
SPARK_LOCAL_IP=127.0.0.1
[EnvInject] - Variables injected successfully.
[Gradle] - Launching build.
[src] $ <https://ci-beam.apache.org/job/beam_PostCommit_Java_Jpms_Dataflow_Java11/ws/src/gradlew> --continue --max-workers=8 -Dorg.gradle.jvmargs=-Xms2g -Dorg.gradle.jvmargs=-Xmx6g -Dorg.gradle.vfs.watch=false -Pdocker-pull-licenses -Dorg.gradle.java.home=/usr/lib/jvm/java-11-openjdk-amd64 -Pmaven_home=/home/jenkins/tools/maven/apache-maven-3.5.4 :sdks:java:testing:jpms-tests:dataflowRunnerIntegrationTest
To honour the JVM settings for this build a single-use Daemon process will be forked. See https://docs.gradle.org/7.5.1/userguide/gradle_daemon.html#sec:disabling_the_daemon.
Daemon will be stopped at the end of the build
Configuration on demand is an incubating feature.
Gradle Enterprise plugins resolution: https://plugins.gradle.org/m2
Applying com.gradle.CommonCustomUserDataGradlePlugin via init script
> Task :buildSrc:compileJava NO-SOURCE
> Task :buildSrc:compileGroovy FROM-CACHE
> Task :buildSrc:pluginDescriptors
> Task :buildSrc:processResources
> Task :buildSrc:classes
> Task :buildSrc:jar
> Task :buildSrc:assemble
> Task :buildSrc:spotlessGroovy FROM-CACHE
> Task :buildSrc:spotlessGroovyCheck UP-TO-DATE
> Task :buildSrc:spotlessGroovyGradle FROM-CACHE
> Task :buildSrc:spotlessGroovyGradleCheck UP-TO-DATE
> Task :buildSrc:spotlessCheck UP-TO-DATE
> Task :buildSrc:pluginUnderTestMetadata
> Task :buildSrc:compileTestJava NO-SOURCE
> Task :buildSrc:compileTestGroovy NO-SOURCE
> Task :buildSrc:processTestResources NO-SOURCE
> Task :buildSrc:testClasses UP-TO-DATE
> Task :buildSrc:test NO-SOURCE
> Task :buildSrc:validatePlugins FROM-CACHE
> Task :buildSrc:check UP-TO-DATE
> Task :buildSrc:build
> Configure project :sdks:java:container:java8
docker-pull-licenses set, creating go-licenses
> Configure project :sdks:java:container:java11
docker-pull-licenses set, creating go-licenses
> Task :model:fn-execution:createCheckerFrameworkManifest
> Task :runners:core-construction-java:createCheckerFrameworkManifest
> Task :model:pipeline:createCheckerFrameworkManifest
> Task :sdks:java:core:createCheckerFrameworkManifest
> Task :sdks:java:fn-execution:createCheckerFrameworkManifest
> Task :sdks:java:extensions:avro:createCheckerFrameworkManifest
> Task :model:job-management:createCheckerFrameworkManifest
> Task :runners:core-java:createCheckerFrameworkManifest
> Task :sdks:java:core:generateAvroProtocol NO-SOURCE
> Task :sdks:java:fn-execution:processResources NO-SOURCE
> Task :runners:core-java:processResources NO-SOURCE
> Task :sdks:java:extensions:avro:generateAvroProtocol NO-SOURCE
> Task :runners:core-construction-java:processResources NO-SOURCE
> Task :sdks:java:core:generateAvroJava NO-SOURCE
> Task :sdks:java:extensions:avro:generateAvroJava NO-SOURCE
> Task :sdks:java:extensions:avro:processResources NO-SOURCE
> Task :sdks:java:testing:jpms-tests:createCheckerFrameworkManifest
> Task :model:fn-execution:extractProto
> Task :sdks:java:extensions:google-cloud-platform-core:createCheckerFrameworkManifest
> Task :model:job-management:extractProto
> Task :runners:google-cloud-dataflow-java:createCheckerFrameworkManifest
> Task :sdks:java:testing:jpms-tests:processResources NO-SOURCE
> Task :sdks:java:extensions:google-cloud-platform-core:processResources NO-SOURCE
> Task :sdks:java:testing:jpms-tests:processTestResources NO-SOURCE
> Task :runners:java-fn-execution:createCheckerFrameworkManifest
> Task :runners:java-fn-execution:processResources NO-SOURCE
> Task :sdks:java:harness:createCheckerFrameworkManifest
> Task :sdks:java:expansion-service:createCheckerFrameworkManifest
> Task :model:job-management:processResources
> Task :sdks:java:expansion-service:processResources NO-SOURCE
> Task :sdks:java:core:generateGrammarSource FROM-CACHE
> Task :sdks:java:extensions:protobuf:createCheckerFrameworkManifest
> Task :sdks:java:extensions:arrow:createCheckerFrameworkManifest
> Task :sdks:java:harness:processResources NO-SOURCE
> Task :sdks:java:io:google-cloud-platform:createCheckerFrameworkManifest
> Task :model:fn-execution:processResources
> Task :sdks:java:io:kafka:createCheckerFrameworkManifest
> Task :sdks:java:extensions:arrow:processResources NO-SOURCE
> Task :sdks:java:io:google-cloud-platform:processResources NO-SOURCE
> Task :sdks:java:io:kafka:processResources NO-SOURCE
> Task :sdks:java:extensions:protobuf:extractProto
> Task :sdks:java:extensions:protobuf:processResources NO-SOURCE
> Task :sdks:java:core:processResources
> Task :runners:google-cloud-dataflow-java:processResources
> Task :model:pipeline:extractIncludeProto
> Task :model:pipeline:extractProto
> Task :model:pipeline:generateProto FROM-CACHE
> Task :model:pipeline:compileJava FROM-CACHE
> Task :model:pipeline:processResources
> Task :model:pipeline:classes
> Task :model:pipeline:jar
> Task :model:pipeline:shadowJar FROM-CACHE
> Task :model:fn-execution:extractIncludeProto
> Task :model:job-management:extractIncludeProto
> Task :model:job-management:generateProto FROM-CACHE
> Task :model:fn-execution:generateProto FROM-CACHE
> Task :model:job-management:compileJava FROM-CACHE
> Task :model:job-management:classes
> Task :model:fn-execution:compileJava FROM-CACHE
> Task :model:fn-execution:classes
> Task :model:job-management:shadowJar FROM-CACHE
> Task :model:fn-execution:shadowJar FROM-CACHE
> Task :sdks:java:core:compileJava FROM-CACHE
> Task :sdks:java:core:classes
> Task :sdks:java:core:shadowJar FROM-CACHE
> Task :sdks:java:extensions:arrow:compileJava FROM-CACHE
> Task :sdks:java:extensions:arrow:classes UP-TO-DATE
> Task :sdks:java:extensions:arrow:jar
> Task :sdks:java:fn-execution:compileJava FROM-CACHE
> Task :sdks:java:fn-execution:classes UP-TO-DATE
> Task :sdks:java:fn-execution:jar
> Task :sdks:java:extensions:avro:compileJava FROM-CACHE
> Task :sdks:java:extensions:avro:classes UP-TO-DATE
> Task :sdks:java:extensions:avro:jar
> Task :sdks:java:extensions:protobuf:extractIncludeProto
> Task :sdks:java:extensions:protobuf:generateProto NO-SOURCE
> Task :sdks:java:extensions:protobuf:compileJava FROM-CACHE
> Task :sdks:java:extensions:protobuf:classes UP-TO-DATE
> Task :sdks:java:extensions:protobuf:jar
> Task :runners:core-construction-java:compileJava FROM-CACHE
> Task :runners:core-construction-java:classes UP-TO-DATE
> Task :runners:core-construction-java:jar
> Task :runners:core-java:compileJava FROM-CACHE
> Task :runners:core-java:classes UP-TO-DATE
> Task :runners:core-java:jar
> Task :sdks:java:harness:compileJava FROM-CACHE
> Task :sdks:java:harness:classes UP-TO-DATE
> Task :sdks:java:extensions:google-cloud-platform-core:compileJava FROM-CACHE
> Task :sdks:java:extensions:google-cloud-platform-core:classes UP-TO-DATE
> Task :sdks:java:extensions:google-cloud-platform-core:jar
> Task :sdks:java:harness:jar
> Task :sdks:java:testing:jpms-tests:compileJava FROM-CACHE
> Task :sdks:java:testing:jpms-tests:classes UP-TO-DATE
> Task :sdks:java:testing:jpms-tests:jar
> Task :sdks:java:testing:jpms-tests:compileTestJava FROM-CACHE
> Task :sdks:java:testing:jpms-tests:testClasses UP-TO-DATE
> Task :sdks:java:testing:jpms-tests:testJar
> Task :runners:java-fn-execution:compileJava FROM-CACHE
> Task :runners:java-fn-execution:classes UP-TO-DATE
> Task :runners:java-fn-execution:jar
> Task :sdks:java:expansion-service:compileJava FROM-CACHE
> Task :sdks:java:expansion-service:classes UP-TO-DATE
> Task :sdks:java:expansion-service:jar
> Task :sdks:java:io:kafka:compileJava FROM-CACHE
> Task :sdks:java:io:kafka:classes UP-TO-DATE
> Task :sdks:java:io:kafka:jar
> Task :sdks:java:io:google-cloud-platform:compileJava FROM-CACHE
> Task :sdks:java:io:google-cloud-platform:classes UP-TO-DATE
> Task :sdks:java:io:google-cloud-platform:jar
> Task :runners:google-cloud-dataflow-java:compileJava FROM-CACHE
> Task :runners:google-cloud-dataflow-java:classes
> Task :runners:google-cloud-dataflow-java:jar
> Task :sdks:java:testing:jpms-tests:dataflowRunnerIntegrationTest
org.apache.beam.sdk.jpmstests.JpmsIT > testE2EJpms FAILED
java.lang.RuntimeException at JpmsIT.java:63
1 test completed, 1 failed
> Task :sdks:java:testing:jpms-tests:dataflowRunnerIntegrationTest FAILED
FAILURE: Build failed with an exception.
* What went wrong:
Execution failed for task ':sdks:java:testing:jpms-tests:dataflowRunnerIntegrationTest'.
> There were failing tests. See the report at: file://<https://ci-beam.apache.org/job/beam_PostCommit_Java_Jpms_Dataflow_Java11/ws/src/sdks/java/testing/jpms-tests/build/reports/tests/dataflowRunnerIntegrationTest/index.html>
* Try:
> Run with --stacktrace option to get the stack trace.
> Run with --info or --debug option to get more log output.
* Get more help at https://help.gradle.org
Deprecated Gradle features were used in this build, making it incompatible with Gradle 8.0.
You can use '--warning-mode all' to show the individual deprecation warnings and determine if they come from your own scripts or plugins.
See https://docs.gradle.org/7.5.1/userguide/command_line_interface.html#sec:command_line_warnings
BUILD FAILED in 3h 13m 3s
85 actionable tasks: 52 executed, 31 from cache, 2 up-to-date
Build scan background action failed.
java.lang.IllegalArgumentException: com.gradle.enterprise.gradleplugin.internal.extension.a is not an interface
at java.lang.reflect.Proxy$ProxyBuilder.validateProxyInterfaces(Proxy.java:688)
at java.lang.reflect.Proxy$ProxyBuilder.<init>(Proxy.java:627)
at java.lang.reflect.Proxy.lambda$getProxyConstructor$1(Proxy.java:426)
at jdk.internal.loader.AbstractClassLoaderValue$Memoizer.get(AbstractClassLoaderValue.java:329)
at jdk.internal.loader.AbstractClassLoaderValue.computeIfAbsent(AbstractClassLoaderValue.java:205)
at java.lang.reflect.Proxy.getProxyConstructor(Proxy.java:424)
at java.lang.reflect.Proxy.newProxyInstance(Proxy.java:1006)
at com.gradle.ProxyFactory$ProxyingInvocationHandler.createLocalProxy(ProxyFactory.java:64)
at com.gradle.ProxyFactory$ProxyingInvocationHandler.lambda$adaptActionArg$1(ProxyFactory.java:59)
at com.gradle.enterprise.gradleplugin.internal.extension.b$3.run(SourceFile:100)
at java.util.concurrent.Executors$RunnableAdapter.call(Executors.java:515)
at java.util.concurrent.FutureTask.run(FutureTask.java:264)
at java.util.concurrent.ThreadPoolExecutor.runWorker(ThreadPoolExecutor.java:1128)
at java.util.concurrent.ThreadPoolExecutor$Worker.run(ThreadPoolExecutor.java:628)
at java.lang.Thread.run(Thread.java:829)
Publishing build scan...
https://gradle.com/s/aiug7tf3galqm
Build step 'Invoke Gradle script' changed build result to FAILURE
Build step 'Invoke Gradle script' marked build as failure
---------------------------------------------------------------------
To unsubscribe, e-mail: builds-unsubscribe@beam.apache.org
For additional commands, e-mail: builds-help@beam.apache.org
beam_PostCommit_Java_Jpms_Dataflow_Java11 - Build # 3696 - Aborted!
Posted by Apache Jenkins Server <je...@builds.apache.org>.
beam_PostCommit_Java_Jpms_Dataflow_Java11 - Build # 3696 - Aborted:
Check console output at https://ci-beam.apache.org/job/beam_PostCommit_Java_Jpms_Dataflow_Java11/3696/ to view the results.
Build failed in Jenkins: beam_PostCommit_Java_Jpms_Dataflow_Java11 #3695
Posted by Apache Jenkins Server <je...@builds.apache.org>.
See <https://ci-beam.apache.org/job/beam_PostCommit_Java_Jpms_Dataflow_Java11/3695/display/redirect?page=changes>
Changes:
[noreply] Merge pull request #26432 from apache/users/damccorm/pythonContainers
------------------------------------------
[...truncated 556 B...]
Wiping out workspace first.
Cloning the remote Git repository
Using shallow clone with depth 1
Avoid fetching tags
Cloning repository https://github.com/apache/beam.git
> git init <https://ci-beam.apache.org/job/beam_PostCommit_Java_Jpms_Dataflow_Java11/ws/src> # timeout=10
Fetching upstream changes from https://github.com/apache/beam.git
> git --version # timeout=10
> git --version # 'git version 2.25.1'
> git fetch --no-tags --force --progress --depth=1 -- https://github.com/apache/beam.git +refs/heads/*:refs/remotes/origin/* # timeout=10
> git config remote.origin.url https://github.com/apache/beam.git # timeout=10
> git config --add remote.origin.fetch +refs/heads/*:refs/remotes/origin/* # timeout=10
> git config remote.origin.url https://github.com/apache/beam.git # timeout=10
Using shallow fetch with depth 1
Fetching upstream changes from https://github.com/apache/beam.git
> git fetch --no-tags --force --progress --depth=1 -- https://github.com/apache/beam.git +refs/heads/*:refs/remotes/origin/* +refs/pull/${ghprbPullId}/*:refs/remotes/origin/pr/${ghprbPullId}/* # timeout=10
> git rev-parse origin/master^{commit} # timeout=10
Checking out Revision 6ab1552b4c7dae2a7cf95f11c01d736c08841516 (origin/master)
> git config core.sparsecheckout # timeout=10
> git checkout -f 6ab1552b4c7dae2a7cf95f11c01d736c08841516 # timeout=10
Commit message: "Merge pull request #26432 from apache/users/damccorm/pythonContainers"
> git rev-list --no-walk 4183e747becebd18becee5fff547af365910fc9c # timeout=10
No emails were triggered.
[EnvInject] - Executing scripts and injecting environment variables after the SCM step.
[EnvInject] - Injecting as environment variables the properties content
SETUPTOOLS_USE_DISTUTILS=stdlib
SPARK_LOCAL_IP=127.0.0.1
[EnvInject] - Variables injected successfully.
[Gradle] - Launching build.
[src] $ <https://ci-beam.apache.org/job/beam_PostCommit_Java_Jpms_Dataflow_Java11/ws/src/gradlew> --continue --max-workers=8 -Dorg.gradle.jvmargs=-Xms2g -Dorg.gradle.jvmargs=-Xmx6g -Dorg.gradle.vfs.watch=false -Pdocker-pull-licenses -Dorg.gradle.java.home=/usr/lib/jvm/java-11-openjdk-amd64 -Pmaven_home=/home/jenkins/tools/maven/apache-maven-3.5.4 :sdks:java:testing:jpms-tests:dataflowRunnerIntegrationTest
To honour the JVM settings for this build a single-use Daemon process will be forked. See https://docs.gradle.org/7.5.1/userguide/gradle_daemon.html#sec:disabling_the_daemon.
Daemon will be stopped at the end of the build
Configuration on demand is an incubating feature.
Gradle Enterprise plugins resolution: https://plugins.gradle.org/m2
Applying com.gradle.CommonCustomUserDataGradlePlugin via init script
> Task :buildSrc:compileJava NO-SOURCE
> Task :buildSrc:compileGroovy FROM-CACHE
> Task :buildSrc:pluginDescriptors
> Task :buildSrc:processResources
> Task :buildSrc:classes
> Task :buildSrc:jar
> Task :buildSrc:assemble
> Task :buildSrc:spotlessGroovy FROM-CACHE
> Task :buildSrc:spotlessGroovyCheck UP-TO-DATE
> Task :buildSrc:spotlessGroovyGradle FROM-CACHE
> Task :buildSrc:spotlessGroovyGradleCheck UP-TO-DATE
> Task :buildSrc:spotlessCheck UP-TO-DATE
> Task :buildSrc:pluginUnderTestMetadata
> Task :buildSrc:compileTestJava NO-SOURCE
> Task :buildSrc:compileTestGroovy NO-SOURCE
> Task :buildSrc:processTestResources NO-SOURCE
> Task :buildSrc:testClasses UP-TO-DATE
> Task :buildSrc:test NO-SOURCE
> Task :buildSrc:validatePlugins FROM-CACHE
> Task :buildSrc:check UP-TO-DATE
> Task :buildSrc:build
> Configure project :sdks:java:container:java8
docker-pull-licenses set, creating go-licenses
> Configure project :sdks:java:container:java11
docker-pull-licenses set, creating go-licenses
> Task :runners:core-java:createCheckerFrameworkManifest
> Task :sdks:java:core:createCheckerFrameworkManifest
> Task :sdks:java:fn-execution:createCheckerFrameworkManifest
> Task :runners:core-construction-java:createCheckerFrameworkManifest
> Task :model:pipeline:createCheckerFrameworkManifest
> Task :sdks:java:extensions:avro:createCheckerFrameworkManifest
> Task :model:fn-execution:createCheckerFrameworkManifest
> Task :model:job-management:createCheckerFrameworkManifest
> Task :sdks:java:extensions:avro:generateAvroProtocol NO-SOURCE
> Task :sdks:java:fn-execution:processResources NO-SOURCE
> Task :runners:core-java:processResources NO-SOURCE
> Task :sdks:java:core:generateAvroProtocol NO-SOURCE
> Task :sdks:java:extensions:avro:generateAvroJava NO-SOURCE
> Task :model:fn-execution:extractProto
> Task :model:job-management:extractProto
> Task :sdks:java:extensions:avro:processResources NO-SOURCE
> Task :sdks:java:core:generateAvroJava NO-SOURCE
> Task :runners:core-construction-java:processResources NO-SOURCE
> Task :sdks:java:testing:jpms-tests:createCheckerFrameworkManifest
> Task :sdks:java:extensions:google-cloud-platform-core:createCheckerFrameworkManifest
> Task :runners:google-cloud-dataflow-java:createCheckerFrameworkManifest
> Task :sdks:java:extensions:google-cloud-platform-core:processResources NO-SOURCE
> Task :sdks:java:testing:jpms-tests:processResources NO-SOURCE
> Task :runners:java-fn-execution:createCheckerFrameworkManifest
> Task :sdks:java:testing:jpms-tests:processTestResources NO-SOURCE
> Task :model:fn-execution:processResources
> Task :runners:java-fn-execution:processResources NO-SOURCE
> Task :model:job-management:processResources
> Task :sdks:java:expansion-service:createCheckerFrameworkManifest
> Task :sdks:java:harness:createCheckerFrameworkManifest
> Task :sdks:java:core:generateGrammarSource FROM-CACHE
> Task :sdks:java:expansion-service:processResources NO-SOURCE
> Task :sdks:java:harness:processResources NO-SOURCE
> Task :sdks:java:io:google-cloud-platform:createCheckerFrameworkManifest
> Task :sdks:java:io:kafka:createCheckerFrameworkManifest
> Task :sdks:java:extensions:protobuf:createCheckerFrameworkManifest
> Task :sdks:java:extensions:arrow:createCheckerFrameworkManifest
> Task :sdks:java:io:google-cloud-platform:processResources NO-SOURCE
> Task :sdks:java:io:kafka:processResources NO-SOURCE
> Task :sdks:java:extensions:arrow:processResources NO-SOURCE
> Task :sdks:java:extensions:protobuf:extractProto
> Task :sdks:java:extensions:protobuf:processResources NO-SOURCE
> Task :runners:google-cloud-dataflow-java:processResources
> Task :sdks:java:core:processResources
> Task :model:pipeline:extractIncludeProto
> Task :model:pipeline:extractProto
> Task :model:pipeline:generateProto FROM-CACHE
> Task :model:pipeline:compileJava FROM-CACHE
> Task :model:pipeline:processResources
> Task :model:pipeline:classes
> Task :model:pipeline:jar
> Task :model:pipeline:shadowJar FROM-CACHE
> Task :model:fn-execution:extractIncludeProto
> Task :model:job-management:extractIncludeProto
> Task :model:job-management:generateProto FROM-CACHE
> Task :model:fn-execution:generateProto FROM-CACHE
> Task :model:job-management:compileJava FROM-CACHE
> Task :model:job-management:classes
> Task :model:fn-execution:compileJava FROM-CACHE
> Task :model:fn-execution:classes
> Task :model:job-management:shadowJar FROM-CACHE
> Task :model:fn-execution:shadowJar FROM-CACHE
> Task :sdks:java:core:compileJava FROM-CACHE
> Task :sdks:java:core:classes
> Task :sdks:java:core:shadowJar FROM-CACHE
> Task :sdks:java:extensions:avro:compileJava FROM-CACHE
> Task :sdks:java:extensions:avro:classes UP-TO-DATE
> Task :sdks:java:extensions:avro:jar
> Task :sdks:java:fn-execution:compileJava FROM-CACHE
> Task :sdks:java:fn-execution:classes UP-TO-DATE
> Task :sdks:java:extensions:protobuf:extractIncludeProto
> Task :sdks:java:extensions:protobuf:generateProto NO-SOURCE
> Task :sdks:java:fn-execution:jar
> Task :runners:core-construction-java:compileJava FROM-CACHE
> Task :runners:core-construction-java:classes UP-TO-DATE
> Task :runners:core-construction-java:jar
> Task :runners:core-java:compileJava FROM-CACHE
> Task :runners:core-java:classes UP-TO-DATE
> Task :runners:core-java:jar
> Task :sdks:java:extensions:google-cloud-platform-core:compileJava FROM-CACHE
> Task :sdks:java:extensions:google-cloud-platform-core:classes UP-TO-DATE
> Task :sdks:java:extensions:google-cloud-platform-core:jar
> Task :sdks:java:harness:compileJava FROM-CACHE
> Task :sdks:java:harness:classes UP-TO-DATE
> Task :sdks:java:testing:jpms-tests:compileJava FROM-CACHE
> Task :sdks:java:testing:jpms-tests:classes UP-TO-DATE
> Task :sdks:java:testing:jpms-tests:jar
> Task :sdks:java:harness:jar
> Task :sdks:java:testing:jpms-tests:compileTestJava FROM-CACHE
> Task :sdks:java:testing:jpms-tests:testClasses UP-TO-DATE
> Task :sdks:java:testing:jpms-tests:testJar
> Task :runners:java-fn-execution:compileJava FROM-CACHE
> Task :runners:java-fn-execution:classes UP-TO-DATE
> Task :runners:java-fn-execution:jar
> Task :sdks:java:expansion-service:compileJava FROM-CACHE
> Task :sdks:java:expansion-service:classes UP-TO-DATE
> Task :sdks:java:expansion-service:jar
> Task :sdks:java:extensions:arrow:compileJava
> Task :sdks:java:extensions:arrow:classes
> Task :sdks:java:extensions:arrow:jar
> Task :sdks:java:extensions:protobuf:compileJava
Note: Some input files use or override a deprecated API.
Note: Recompile with -Xlint:deprecation for details.
Note: Some input files use unchecked or unsafe operations.
Note: Recompile with -Xlint:unchecked for details.
> Task :sdks:java:extensions:protobuf:classes
> Task :sdks:java:extensions:protobuf:jar
> Task :sdks:java:io:kafka:compileJava
Note: Some input files use or override a deprecated API.
Note: Recompile with -Xlint:deprecation for details.
Note: Some input files use unchecked or unsafe operations.
Note: Recompile with -Xlint:unchecked for details.
> Task :sdks:java:io:kafka:classes
> Task :sdks:java:io:kafka:jar
> Task :sdks:java:io:google-cloud-platform:compileJava
Note: Some input files use or override a deprecated API.
Note: Recompile with -Xlint:deprecation for details.
Note: Some input files use unchecked or unsafe operations.
Note: Recompile with -Xlint:unchecked for details.
> Task :sdks:java:io:google-cloud-platform:classes
> Task :sdks:java:io:google-cloud-platform:jar
> Task :runners:google-cloud-dataflow-java:compileJava
Note: Some input files use or override a deprecated API.
Note: Recompile with -Xlint:deprecation for details.
Note: Some input files use unchecked or unsafe operations.
Note: Recompile with -Xlint:unchecked for details.
> Task :runners:google-cloud-dataflow-java:classes
> Task :runners:google-cloud-dataflow-java:jar
> Task :sdks:java:testing:jpms-tests:dataflowRunnerIntegrationTest
org.apache.beam.sdk.jpmstests.JpmsIT > testE2EJpms FAILED
java.lang.RuntimeException at JpmsIT.java:63
1 test completed, 1 failed
> Task :sdks:java:testing:jpms-tests:dataflowRunnerIntegrationTest FAILED
FAILURE: Build failed with an exception.
* What went wrong:
Execution failed for task ':sdks:java:testing:jpms-tests:dataflowRunnerIntegrationTest'.
> There were failing tests. See the report at: file://<https://ci-beam.apache.org/job/beam_PostCommit_Java_Jpms_Dataflow_Java11/ws/src/sdks/java/testing/jpms-tests/build/reports/tests/dataflowRunnerIntegrationTest/index.html>
* Try:
> Run with --stacktrace option to get the stack trace.
> Run with --info or --debug option to get more log output.
* Get more help at https://help.gradle.org
Deprecated Gradle features were used in this build, making it incompatible with Gradle 8.0.
You can use '--warning-mode all' to show the individual deprecation warnings and determine if they come from your own scripts or plugins.
See https://docs.gradle.org/7.5.1/userguide/command_line_interface.html#sec:command_line_warnings
BUILD FAILED in 3h 23m 55s
85 actionable tasks: 57 executed, 26 from cache, 2 up-to-date
Build scan background action failed.
java.lang.IllegalArgumentException: com.gradle.enterprise.gradleplugin.internal.extension.a is not an interface
at java.lang.reflect.Proxy$ProxyBuilder.validateProxyInterfaces(Proxy.java:688)
at java.lang.reflect.Proxy$ProxyBuilder.<init>(Proxy.java:627)
at java.lang.reflect.Proxy.lambda$getProxyConstructor$1(Proxy.java:426)
at jdk.internal.loader.AbstractClassLoaderValue$Memoizer.get(AbstractClassLoaderValue.java:329)
at jdk.internal.loader.AbstractClassLoaderValue.computeIfAbsent(AbstractClassLoaderValue.java:205)
at java.lang.reflect.Proxy.getProxyConstructor(Proxy.java:424)
at java.lang.reflect.Proxy.newProxyInstance(Proxy.java:1006)
at com.gradle.ProxyFactory$ProxyingInvocationHandler.createLocalProxy(ProxyFactory.java:64)
at com.gradle.ProxyFactory$ProxyingInvocationHandler.lambda$adaptActionArg$1(ProxyFactory.java:59)
at com.gradle.enterprise.gradleplugin.internal.extension.b$3.run(SourceFile:100)
at java.util.concurrent.Executors$RunnableAdapter.call(Executors.java:515)
at java.util.concurrent.FutureTask.run(FutureTask.java:264)
at java.util.concurrent.ThreadPoolExecutor.runWorker(ThreadPoolExecutor.java:1128)
at java.util.concurrent.ThreadPoolExecutor$Worker.run(ThreadPoolExecutor.java:628)
at java.lang.Thread.run(Thread.java:829)
Publishing build scan...
https://gradle.com/s/7djhccnpgj27s
Build step 'Invoke Gradle script' changed build result to FAILURE
Build step 'Invoke Gradle script' marked build as failure
---------------------------------------------------------------------
To unsubscribe, e-mail: builds-unsubscribe@beam.apache.org
For additional commands, e-mail: builds-help@beam.apache.org
Build failed in Jenkins: beam_PostCommit_Java_Jpms_Dataflow_Java11 #3694
Posted by Apache Jenkins Server <je...@builds.apache.org>.
See <https://ci-beam.apache.org/job/beam_PostCommit_Java_Jpms_Dataflow_Java11/3694/display/redirect>
Changes:
------------------------------------------
[...truncated 8.25 KB...]
docker-pull-licenses set, creating go-licenses
> Configure project :sdks:java:container:java11
docker-pull-licenses set, creating go-licenses
> Task :sdks:java:extensions:avro:createCheckerFrameworkManifest
> Task :model:fn-execution:createCheckerFrameworkManifest
> Task :sdks:java:fn-execution:createCheckerFrameworkManifest
> Task :runners:core-java:createCheckerFrameworkManifest
> Task :model:job-management:createCheckerFrameworkManifest
> Task :model:pipeline:createCheckerFrameworkManifest
> Task :sdks:java:core:createCheckerFrameworkManifest
> Task :runners:core-java:processResources NO-SOURCE
> Task :runners:core-construction-java:createCheckerFrameworkManifest
> Task :sdks:java:fn-execution:processResources NO-SOURCE
> Task :sdks:java:core:generateAvroProtocol NO-SOURCE
> Task :sdks:java:extensions:avro:generateAvroProtocol NO-SOURCE
> Task :model:fn-execution:extractProto
> Task :sdks:java:extensions:avro:generateAvroJava NO-SOURCE
> Task :sdks:java:core:generateAvroJava NO-SOURCE
> Task :runners:core-construction-java:processResources NO-SOURCE
> Task :sdks:java:extensions:avro:processResources NO-SOURCE
> Task :model:job-management:extractProto
> Task :sdks:java:extensions:google-cloud-platform-core:createCheckerFrameworkManifest
> Task :sdks:java:testing:jpms-tests:createCheckerFrameworkManifest
> Task :sdks:java:extensions:google-cloud-platform-core:processResources NO-SOURCE
> Task :sdks:java:testing:jpms-tests:processResources NO-SOURCE
> Task :sdks:java:testing:jpms-tests:processTestResources NO-SOURCE
> Task :model:fn-execution:processResources
> Task :runners:java-fn-execution:createCheckerFrameworkManifest
> Task :runners:google-cloud-dataflow-java:createCheckerFrameworkManifest
> Task :model:job-management:processResources
> Task :sdks:java:expansion-service:createCheckerFrameworkManifest
> Task :sdks:java:harness:createCheckerFrameworkManifest
> Task :sdks:java:harness:processResources NO-SOURCE
> Task :sdks:java:expansion-service:processResources NO-SOURCE
> Task :runners:java-fn-execution:processResources NO-SOURCE
> Task :sdks:java:io:google-cloud-platform:createCheckerFrameworkManifest
> Task :sdks:java:io:google-cloud-platform:processResources NO-SOURCE
> Task :sdks:java:core:generateGrammarSource FROM-CACHE
> Task :sdks:java:extensions:protobuf:createCheckerFrameworkManifest
> Task :sdks:java:io:kafka:createCheckerFrameworkManifest
> Task :sdks:java:io:kafka:processResources NO-SOURCE
> Task :sdks:java:extensions:arrow:createCheckerFrameworkManifest
> Task :sdks:java:extensions:protobuf:extractProto
> Task :sdks:java:extensions:arrow:processResources NO-SOURCE
> Task :sdks:java:extensions:protobuf:processResources NO-SOURCE
> Task :sdks:java:core:processResources
> Task :runners:google-cloud-dataflow-java:processResources
> Task :model:pipeline:extractIncludeProto
> Task :model:pipeline:extractProto
> Task :model:pipeline:generateProto FROM-CACHE
> Task :model:pipeline:compileJava FROM-CACHE
> Task :model:pipeline:processResources
> Task :model:pipeline:classes
> Task :model:pipeline:jar
> Task :model:pipeline:shadowJar FROM-CACHE
> Task :model:fn-execution:extractIncludeProto
> Task :model:job-management:extractIncludeProto
> Task :model:fn-execution:generateProto FROM-CACHE
> Task :model:job-management:generateProto FROM-CACHE
> Task :model:job-management:compileJava FROM-CACHE
> Task :model:job-management:classes
> Task :model:fn-execution:compileJava FROM-CACHE
> Task :model:fn-execution:classes
> Task :model:job-management:shadowJar FROM-CACHE
> Task :model:fn-execution:shadowJar FROM-CACHE
> Task :sdks:java:core:compileJava FROM-CACHE
> Task :sdks:java:core:classes
> Task :sdks:java:core:shadowJar FROM-CACHE
> Task :sdks:java:extensions:avro:compileJava FROM-CACHE
> Task :sdks:java:extensions:avro:classes UP-TO-DATE
> Task :sdks:java:extensions:arrow:compileJava FROM-CACHE
> Task :sdks:java:extensions:arrow:classes UP-TO-DATE
> Task :sdks:java:extensions:arrow:jar
> Task :sdks:java:extensions:avro:jar
> Task :sdks:java:fn-execution:compileJava FROM-CACHE
> Task :sdks:java:fn-execution:classes UP-TO-DATE
> Task :sdks:java:fn-execution:jar
> Task :sdks:java:extensions:protobuf:extractIncludeProto
> Task :sdks:java:extensions:protobuf:generateProto NO-SOURCE
> Task :sdks:java:extensions:protobuf:compileJava FROM-CACHE
> Task :sdks:java:extensions:protobuf:classes UP-TO-DATE
> Task :sdks:java:extensions:protobuf:jar
> Task :runners:core-construction-java:compileJava FROM-CACHE
> Task :runners:core-construction-java:classes UP-TO-DATE
> Task :runners:core-construction-java:jar
> Task :runners:core-java:compileJava FROM-CACHE
> Task :runners:core-java:classes UP-TO-DATE
> Task :runners:core-java:jar
> Task :sdks:java:extensions:google-cloud-platform-core:compileJava FROM-CACHE
> Task :sdks:java:extensions:google-cloud-platform-core:classes UP-TO-DATE
> Task :sdks:java:harness:compileJava FROM-CACHE
> Task :sdks:java:harness:classes UP-TO-DATE
> Task :sdks:java:extensions:google-cloud-platform-core:jar
> Task :sdks:java:testing:jpms-tests:compileJava FROM-CACHE
> Task :sdks:java:testing:jpms-tests:classes UP-TO-DATE
> Task :sdks:java:testing:jpms-tests:jar
> Task :sdks:java:testing:jpms-tests:compileTestJava FROM-CACHE
> Task :sdks:java:testing:jpms-tests:testClasses UP-TO-DATE
> Task :sdks:java:testing:jpms-tests:testJar
> Task :sdks:java:harness:jar
> Task :runners:java-fn-execution:compileJava FROM-CACHE
> Task :runners:java-fn-execution:classes UP-TO-DATE
> Task :runners:java-fn-execution:jar
> Task :sdks:java:expansion-service:compileJava FROM-CACHE
> Task :sdks:java:expansion-service:classes UP-TO-DATE
> Task :sdks:java:expansion-service:jar
> Task :sdks:java:io:kafka:compileJava FROM-CACHE
> Task :sdks:java:io:kafka:classes UP-TO-DATE
> Task :sdks:java:io:kafka:jar
> Task :sdks:java:io:google-cloud-platform:compileJava FROM-CACHE
> Task :sdks:java:io:google-cloud-platform:classes UP-TO-DATE
> Task :sdks:java:io:google-cloud-platform:jar
> Task :runners:google-cloud-dataflow-java:compileJava FROM-CACHE
> Task :runners:google-cloud-dataflow-java:classes
> Task :runners:google-cloud-dataflow-java:jar
> Task :sdks:java:testing:jpms-tests:dataflowRunnerIntegrationTest
Build timed out (after 240 minutes). Marking the build as aborted.
FATAL: command execution failed
java.io.IOException: Remote call on apache-beam-jenkins-11 failed
at hudson.remoting.Channel.call(Channel.java:1004)
at hudson.remoting.RemoteInvocationHandler.invoke(RemoteInvocationHandler.java:285)
at com.sun.proxy.$Proxy135.isAlive(Unknown Source)
at hudson.Launcher$RemoteLauncher$ProcImpl.isAlive(Launcher.java:1215)
at hudson.Launcher$RemoteLauncher$ProcImpl.join(Launcher.java:1207)
at hudson.Launcher$ProcStarter.join(Launcher.java:524)
at hudson.plugins.gradle.Gradle.perform(Gradle.java:321)
at hudson.tasks.BuildStepMonitor$1.perform(BuildStepMonitor.java:20)
at hudson.model.AbstractBuild$AbstractBuildExecution.perform(AbstractBuild.java:814)
at hudson.model.Build$BuildExecution.build(Build.java:199)
at hudson.model.Build$BuildExecution.doRun(Build.java:164)
at hudson.model.AbstractBuild$AbstractBuildExecution.run(AbstractBuild.java:522)
at hudson.model.Run.execute(Run.java:1896)
at hudson.model.FreeStyleBuild.run(FreeStyleBuild.java:44)
at hudson.model.ResourceController.execute(ResourceController.java:101)
at hudson.model.Executor.run(Executor.java:442)
Caused by: java.lang.OutOfMemoryError: unable to create native thread: possibly out of memory or process/resource limits reached
at java.base/java.lang.Thread.start0(Native Method)
at java.base/java.lang.Thread.start(Thread.java:798)
at java.base/java.util.concurrent.ThreadPoolExecutor.addWorker(ThreadPoolExecutor.java:937)
at java.base/java.util.concurrent.ThreadPoolExecutor.execute(ThreadPoolExecutor.java:1354)
at java.base/java.util.concurrent.AbstractExecutorService.submit(AbstractExecutorService.java:140)
at jenkins.util.InterceptingExecutorService.submit(InterceptingExecutorService.java:36)
at jenkins.util.InterceptingExecutorService.submit(InterceptingExecutorService.java:36)
at hudson.remoting.DelegatingExecutorService.submit(DelegatingExecutorService.java:52)
at hudson.remoting.InterceptingExecutorService.submit(InterceptingExecutorService.java:50)
at hudson.remoting.InterceptingExecutorService.submit(InterceptingExecutorService.java:44)
at org.jenkinsci.remoting.util.AnonymousClassWarnings.check(AnonymousClassWarnings.java:66)
at hudson.remoting.MultiClassLoaderSerializer$Output.annotateClass(MultiClassLoaderSerializer.java:48)
at java.base/java.io.ObjectOutputStream.writeNonProxyDesc(ObjectOutputStream.java:1281)
at java.base/java.io.ObjectOutputStream.writeClassDesc(ObjectOutputStream.java:1222)
at java.base/java.io.ObjectOutputStream.writeNonProxyDesc(ObjectOutputStream.java:1285)
at java.base/java.io.ObjectOutputStream.writeClassDesc(ObjectOutputStream.java:1222)
at java.base/java.io.ObjectOutputStream.writeNonProxyDesc(ObjectOutputStream.java:1285)
at java.base/java.io.ObjectOutputStream.writeClassDesc(ObjectOutputStream.java:1222)
at java.base/java.io.ObjectOutputStream.writeNonProxyDesc(ObjectOutputStream.java:1285)
at java.base/java.io.ObjectOutputStream.writeClassDesc(ObjectOutputStream.java:1222)
at java.base/java.io.ObjectOutputStream.writeOrdinaryObject(ObjectOutputStream.java:1418)
at java.base/java.io.ObjectOutputStream.writeObject0(ObjectOutputStream.java:1169)
at java.base/java.io.ObjectOutputStream.writeObject(ObjectOutputStream.java:345)
at hudson.remoting.UserRequest._serialize(UserRequest.java:263)
at hudson.remoting.UserRequest.serialize(UserRequest.java:272)
at hudson.remoting.UserRequest.<init>(UserRequest.java:101)
at hudson.remoting.Channel.call(Channel.java:998)
... 15 more
Build step 'Invoke Gradle script' changed build result to FAILURE
Build step 'Invoke Gradle script' marked build as failure
> Task :sdks:java:testing:jpms-tests:dataflowRunnerIntegrationTest FAILED
FAILURE: Build failed with an exception.
* What went wrong:
Execution failed for task ':sdks:java:testing:jpms-tests:dataflowRunnerIntegrationTest'.
> Process 'Gradle Test Executor 1' finished with non-zero exit value 143
This problem might be caused by incorrect test process configuration.
Please refer to the test execution section in the User Manual at https://docs.gradle.org/7.5.1/userguide/java_testing.html#sec:test_execution
* Try:
> Run with --stacktrace option to get the stack trace.
> Run with --info or --debug option to get more log output.
* Get more help at https://help.gradle.org
Deprecated Gradle features were used in this build, making it incompatible with Gradle 8.0.
You can use '--warning-mode all' to show the individual deprecation warnings and determine if they come from your own scripts or plugins.
See https://docs.gradle.org/7.5.1/userguide/command_line_interface.html#sec:command_line_warnings
BUILD FAILED in 4h
85 actionable tasks: 52 executed, 31 from cache, 2 up-to-date
Build scan background action failed.
java.lang.IllegalArgumentException: com.gradle.enterprise.gradleplugin.internal.extension.a is not an interface
at java.lang.reflect.Proxy$ProxyBuilder.validateProxyInterfaces(Proxy.java:688)
at java.lang.reflect.Proxy$ProxyBuilder.<init>(Proxy.java:627)
at java.lang.reflect.Proxy.lambda$getProxyConstructor$1(Proxy.java:426)
at jdk.internal.loader.AbstractClassLoaderValue$Memoizer.get(AbstractClassLoaderValue.java:329)
at jdk.internal.loader.AbstractClassLoaderValue.computeIfAbsent(AbstractClassLoaderValue.java:205)
at java.lang.reflect.Proxy.getProxyConstructor(Proxy.java:424)
at java.lang.reflect.Proxy.newProxyInstance(Proxy.java:1006)
at com.gradle.ProxyFactory$ProxyingInvocationHandler.createLocalProxy(ProxyFactory.java:64)
at com.gradle.ProxyFactory$ProxyingInvocationHandler.lambda$adaptActionArg$1(ProxyFactory.java:59)
at com.gradle.enterprise.gradleplugin.internal.extension.b$3.run(SourceFile:100)
at java.util.concurrent.Executors$RunnableAdapter.call(Executors.java:515)
at java.util.concurrent.FutureTask.run(FutureTask.java:264)
at java.util.concurrent.ThreadPoolExecutor.runWorker(ThreadPoolExecutor.java:1128)
at java.util.concurrent.ThreadPoolExecutor$Worker.run(ThreadPoolExecutor.java:628)
at java.lang.Thread.run(Thread.java:829)
The message received from the daemon indicates that the daemon has disappeared.
Build request sent: Build{id=9d1fd243-1ed9-46b5-85bf-c80da2688899, currentDir=<https://ci-beam.apache.org/job/beam_PostCommit_Java_Jpms_Dataflow_Java11/ws/src}>
Attempting to read last messages from the daemon log...
Daemon pid: 2332355
log file: /home/jenkins/.gradle/daemon/7.5.1/daemon-2332355.out.log
----- Last 20 lines from daemon log file - daemon-2332355.out.log -----
Build scan background action failed.
java.lang.IllegalArgumentException: com.gradle.enterprise.gradleplugin.internal.extension.a is not an interface
at java.base/java.lang.reflect.Proxy$ProxyBuilder.validateProxyInterfaces(Proxy.java:688)
at java.base/java.lang.reflect.Proxy$ProxyBuilder.<init>(Proxy.java:627)
at java.base/java.lang.reflect.Proxy.lambda$getProxyConstructor$1(Proxy.java:426)
at java.base/jdk.internal.loader.AbstractClassLoaderValue$Memoizer.get(AbstractClassLoaderValue.java:329)
at java.base/jdk.internal.loader.AbstractClassLoaderValue.computeIfAbsent(AbstractClassLoaderValue.java:205)
at java.base/java.lang.reflect.Proxy.getProxyConstructor(Proxy.java:424)
at java.base/java.lang.reflect.Proxy.newProxyInstance(Proxy.java:1006)
at com.gradle.ProxyFactory$ProxyingInvocationHandler.createLocalProxy(ProxyFactory.java:64)
at com.gradle.ProxyFactory$ProxyingInvocationHandler.lambda$adaptActionArg$1(ProxyFactory.java:59)
at com.gradle.enterprise.gradleplugin.internal.extension.b$3.run(SourceFile:100)
at java.base/java.util.concurrent.Executors$RunnableAdapter.call(Executors.java:515)
at java.base/java.util.concurrent.FutureTask.run(FutureTask.java:264)
at java.base/java.util.concurrent.ThreadPoolExecutor.runWorker(ThreadPoolExecutor.java:1128)
at java.base/java.util.concurrent.ThreadPoolExecutor$Worker.run(ThreadPoolExecutor.java:628)
at java.base/java.lang.Thread.run(Thread.java:829)
Daemon vm is shutting down... The daemon has exited normally or was terminated in response to a user interrupt.
Publishing build scan...
----- End of the daemon log -----
FAILURE: Build failed with an exception.
* What went wrong:
Gradle build daemon disappeared unexpectedly (it may have been killed or may have crashed)
* Try:
> Run with --stacktrace option to get the stack trace.
> Run with --info or --debug option to get more log output.
> Run with --scan to get full insights.
* Get more help at https://help.gradle.org
---------------------------------------------------------------------
To unsubscribe, e-mail: builds-unsubscribe@beam.apache.org
For additional commands, e-mail: builds-help@beam.apache.org
beam_PostCommit_Java_Jpms_Dataflow_Java11 - Build # 3693 - Aborted!
Posted by Apache Jenkins Server <je...@builds.apache.org>.
beam_PostCommit_Java_Jpms_Dataflow_Java11 - Build # 3693 - Aborted:
Check console output at https://ci-beam.apache.org/job/beam_PostCommit_Java_Jpms_Dataflow_Java11/3693/ to view the results.
beam_PostCommit_Java_Jpms_Dataflow_Java11 - Build # 3692 - Aborted!
Posted by Apache Jenkins Server <je...@builds.apache.org>.
beam_PostCommit_Java_Jpms_Dataflow_Java11 - Build # 3692 - Aborted:
Check console output at https://ci-beam.apache.org/job/beam_PostCommit_Java_Jpms_Dataflow_Java11/3692/ to view the results.
beam_PostCommit_Java_Jpms_Dataflow_Java11 - Build # 3691 - Aborted!
Posted by Apache Jenkins Server <je...@builds.apache.org>.
beam_PostCommit_Java_Jpms_Dataflow_Java11 - Build # 3691 - Aborted:
Check console output at https://ci-beam.apache.org/job/beam_PostCommit_Java_Jpms_Dataflow_Java11/3691/ to view the results.
beam_PostCommit_Java_Jpms_Dataflow_Java11 - Build # 3690 - Aborted!
Posted by Apache Jenkins Server <je...@builds.apache.org>.
beam_PostCommit_Java_Jpms_Dataflow_Java11 - Build # 3690 - Aborted:
Check console output at https://ci-beam.apache.org/job/beam_PostCommit_Java_Jpms_Dataflow_Java11/3690/ to view the results.
Build failed in Jenkins: beam_PostCommit_Java_Jpms_Dataflow_Java11 #3689
Posted by Apache Jenkins Server <je...@builds.apache.org>.
See <https://ci-beam.apache.org/job/beam_PostCommit_Java_Jpms_Dataflow_Java11/3689/display/redirect>
Changes:
------------------------------------------
Started by timer
Running as SYSTEM
[EnvInject] - Loading node environment variables.
Building remotely on apache-beam-jenkins-8 (beam) in workspace <https://ci-beam.apache.org/job/beam_PostCommit_Java_Jpms_Dataflow_Java11/ws/>
The recommended git tool is: NONE
No credentials specified
Wiping out workspace first.
Cloning the remote Git repository
Using shallow clone with depth 1
Avoid fetching tags
Cloning repository https://github.com/apache/beam.git
> git init <https://ci-beam.apache.org/job/beam_PostCommit_Java_Jpms_Dataflow_Java11/ws/src> # timeout=10
Fetching upstream changes from https://github.com/apache/beam.git
> git --version # timeout=10
> git --version # 'git version 2.25.1'
> git fetch --no-tags --force --progress --depth=1 -- https://github.com/apache/beam.git +refs/heads/*:refs/remotes/origin/* # timeout=10
> git config remote.origin.url https://github.com/apache/beam.git # timeout=10
> git config --add remote.origin.fetch +refs/heads/*:refs/remotes/origin/* # timeout=10
> git config remote.origin.url https://github.com/apache/beam.git # timeout=10
Using shallow fetch with depth 1
Fetching upstream changes from https://github.com/apache/beam.git
> git fetch --no-tags --force --progress --depth=1 -- https://github.com/apache/beam.git +refs/heads/*:refs/remotes/origin/* +refs/pull/${ghprbPullId}/*:refs/remotes/origin/pr/${ghprbPullId}/* # timeout=10
> git rev-parse origin/master^{commit} # timeout=10
Checking out Revision 85d4276016a1e4388cc9dd431e8f0684eb09fd95 (origin/master)
> git config core.sparsecheckout # timeout=10
> git checkout -f 85d4276016a1e4388cc9dd431e8f0684eb09fd95 # timeout=10
Commit message: "Update dataflow python to use external containers (#26383)"
> git rev-list --no-walk 44a17cbe429699160e689bd88935c32c6c2de6b2 # timeout=10
First time build. Skipping changelog.
No emails were triggered.
[EnvInject] - Executing scripts and injecting environment variables after the SCM step.
[EnvInject] - Injecting as environment variables the properties content
SETUPTOOLS_USE_DISTUTILS=stdlib
SPARK_LOCAL_IP=127.0.0.1
[EnvInject] - Variables injected successfully.
[Gradle] - Launching build.
[src] $ <https://ci-beam.apache.org/job/beam_PostCommit_Java_Jpms_Dataflow_Java11/ws/src/gradlew> --continue --max-workers=8 -Dorg.gradle.jvmargs=-Xms2g -Dorg.gradle.jvmargs=-Xmx6g -Dorg.gradle.vfs.watch=false -Pdocker-pull-licenses -Dorg.gradle.java.home=/usr/lib/jvm/java-11-openjdk-amd64 -Pmaven_home=/home/jenkins/tools/maven/apache-maven-3.5.4 :sdks:java:testing:jpms-tests:dataflowRunnerIntegrationTest
To honour the JVM settings for this build a single-use Daemon process will be forked. See https://docs.gradle.org/7.5.1/userguide/gradle_daemon.html#sec:disabling_the_daemon.
Daemon will be stopped at the end of the build
Configuration on demand is an incubating feature.
Gradle Enterprise plugins resolution: https://plugins.gradle.org/m2
Applying com.gradle.CommonCustomUserDataGradlePlugin via init script
> Task :buildSrc:compileJava NO-SOURCE
> Task :buildSrc:compileGroovy FROM-CACHE
> Task :buildSrc:pluginDescriptors
> Task :buildSrc:processResources
> Task :buildSrc:classes
> Task :buildSrc:jar
> Task :buildSrc:assemble
> Task :buildSrc:spotlessGroovy FROM-CACHE
> Task :buildSrc:spotlessGroovyCheck UP-TO-DATE
> Task :buildSrc:spotlessGroovyGradle FROM-CACHE
> Task :buildSrc:spotlessGroovyGradleCheck UP-TO-DATE
> Task :buildSrc:spotlessCheck UP-TO-DATE
> Task :buildSrc:pluginUnderTestMetadata
> Task :buildSrc:compileTestJava NO-SOURCE
> Task :buildSrc:compileTestGroovy NO-SOURCE
> Task :buildSrc:processTestResources NO-SOURCE
> Task :buildSrc:testClasses UP-TO-DATE
> Task :buildSrc:test NO-SOURCE
> Task :buildSrc:validatePlugins FROM-CACHE
> Task :buildSrc:check UP-TO-DATE
> Task :buildSrc:build
> Configure project :sdks:java:container:java8
docker-pull-licenses set, creating go-licenses
> Configure project :sdks:java:container:java11
docker-pull-licenses set, creating go-licenses
> Task :runners:core-construction-java:createCheckerFrameworkManifest
> Task :model:fn-execution:createCheckerFrameworkManifest
> Task :sdks:java:fn-execution:createCheckerFrameworkManifest
> Task :runners:core-java:createCheckerFrameworkManifest
> Task :model:pipeline:createCheckerFrameworkManifest
> Task :sdks:java:core:createCheckerFrameworkManifest
> Task :model:job-management:createCheckerFrameworkManifest
> Task :sdks:java:extensions:avro:createCheckerFrameworkManifest
> Task :sdks:java:extensions:avro:generateAvroProtocol NO-SOURCE
> Task :sdks:java:fn-execution:processResources NO-SOURCE
> Task :runners:core-construction-java:processResources NO-SOURCE
> Task :sdks:java:core:generateAvroProtocol NO-SOURCE
> Task :runners:core-java:processResources NO-SOURCE
> Task :sdks:java:core:generateAvroJava NO-SOURCE
> Task :sdks:java:extensions:avro:generateAvroJava NO-SOURCE
> Task :sdks:java:extensions:avro:processResources NO-SOURCE
> Task :model:fn-execution:extractProto
> Task :model:job-management:extractProto
> Task :sdks:java:extensions:google-cloud-platform-core:createCheckerFrameworkManifest
> Task :sdks:java:testing:jpms-tests:createCheckerFrameworkManifest
> Task :runners:google-cloud-dataflow-java:createCheckerFrameworkManifest
> Task :sdks:java:extensions:google-cloud-platform-core:processResources NO-SOURCE
> Task :sdks:java:testing:jpms-tests:processResources NO-SOURCE
> Task :sdks:java:testing:jpms-tests:processTestResources NO-SOURCE
> Task :runners:java-fn-execution:createCheckerFrameworkManifest
> Task :sdks:java:harness:createCheckerFrameworkManifest
> Task :sdks:java:expansion-service:createCheckerFrameworkManifest
> Task :sdks:java:core:generateGrammarSource FROM-CACHE
> Task :sdks:java:expansion-service:processResources NO-SOURCE
> Task :sdks:java:harness:processResources NO-SOURCE
> Task :runners:java-fn-execution:processResources NO-SOURCE
> Task :model:job-management:processResources
> Task :model:fn-execution:processResources
> Task :sdks:java:extensions:arrow:createCheckerFrameworkManifest
> Task :sdks:java:io:kafka:createCheckerFrameworkManifest
> Task :sdks:java:extensions:arrow:processResources NO-SOURCE
> Task :sdks:java:extensions:protobuf:createCheckerFrameworkManifest
> Task :sdks:java:io:kafka:processResources NO-SOURCE
> Task :sdks:java:io:google-cloud-platform:createCheckerFrameworkManifest
> Task :sdks:java:io:google-cloud-platform:processResources NO-SOURCE
> Task :sdks:java:extensions:protobuf:extractProto
> Task :sdks:java:extensions:protobuf:processResources NO-SOURCE
> Task :sdks:java:core:processResources
> Task :runners:google-cloud-dataflow-java:processResources
> Task :model:pipeline:extractIncludeProto
> Task :model:pipeline:extractProto
> Task :model:pipeline:generateProto FROM-CACHE
> Task :model:pipeline:compileJava FROM-CACHE
> Task :model:pipeline:processResources
> Task :model:pipeline:classes
> Task :model:pipeline:jar
> Task :model:pipeline:shadowJar FROM-CACHE
> Task :model:fn-execution:extractIncludeProto
> Task :model:job-management:extractIncludeProto
> Task :model:job-management:generateProto FROM-CACHE
> Task :model:fn-execution:generateProto FROM-CACHE
> Task :model:job-management:compileJava FROM-CACHE
> Task :model:job-management:classes
> Task :model:fn-execution:compileJava FROM-CACHE
> Task :model:fn-execution:classes
> Task :model:job-management:shadowJar FROM-CACHE
> Task :model:fn-execution:shadowJar FROM-CACHE
> Task :sdks:java:core:compileJava FROM-CACHE
> Task :sdks:java:core:classes
> Task :sdks:java:core:shadowJar FROM-CACHE
> Task :sdks:java:extensions:arrow:compileJava FROM-CACHE
> Task :sdks:java:extensions:arrow:classes UP-TO-DATE
> Task :sdks:java:extensions:arrow:jar
> Task :sdks:java:extensions:avro:compileJava FROM-CACHE
> Task :sdks:java:extensions:protobuf:extractIncludeProto
> Task :sdks:java:extensions:avro:classes UP-TO-DATE
> Task :sdks:java:extensions:protobuf:generateProto NO-SOURCE
> Task :sdks:java:extensions:avro:jar
> Task :sdks:java:extensions:protobuf:compileJava FROM-CACHE
> Task :sdks:java:extensions:protobuf:classes UP-TO-DATE
> Task :sdks:java:fn-execution:compileJava FROM-CACHE
> Task :sdks:java:fn-execution:classes UP-TO-DATE
> Task :sdks:java:extensions:protobuf:jar
> Task :sdks:java:fn-execution:jar
> Task :runners:core-construction-java:compileJava FROM-CACHE
> Task :runners:core-construction-java:classes UP-TO-DATE
> Task :runners:core-construction-java:jar
> Task :runners:core-java:compileJava FROM-CACHE
> Task :runners:core-java:classes UP-TO-DATE
> Task :runners:core-java:jar
> Task :sdks:java:extensions:google-cloud-platform-core:compileJava FROM-CACHE
> Task :sdks:java:extensions:google-cloud-platform-core:classes UP-TO-DATE
> Task :sdks:java:harness:compileJava FROM-CACHE
> Task :sdks:java:harness:classes UP-TO-DATE
> Task :sdks:java:extensions:google-cloud-platform-core:jar
> Task :sdks:java:harness:jar
> Task :sdks:java:testing:jpms-tests:compileJava FROM-CACHE
> Task :sdks:java:testing:jpms-tests:classes UP-TO-DATE
> Task :sdks:java:testing:jpms-tests:jar
> Task :sdks:java:testing:jpms-tests:compileTestJava FROM-CACHE
> Task :sdks:java:testing:jpms-tests:testClasses UP-TO-DATE
> Task :sdks:java:testing:jpms-tests:testJar
> Task :runners:java-fn-execution:compileJava FROM-CACHE
> Task :runners:java-fn-execution:classes UP-TO-DATE
> Task :runners:java-fn-execution:jar
> Task :sdks:java:expansion-service:compileJava FROM-CACHE
> Task :sdks:java:expansion-service:classes UP-TO-DATE
> Task :sdks:java:expansion-service:jar
> Task :sdks:java:io:kafka:compileJava FROM-CACHE
> Task :sdks:java:io:kafka:classes UP-TO-DATE
> Task :sdks:java:io:kafka:jar
> Task :sdks:java:io:google-cloud-platform:compileJava FROM-CACHE
> Task :sdks:java:io:google-cloud-platform:classes UP-TO-DATE
> Task :sdks:java:io:google-cloud-platform:jar
> Task :runners:google-cloud-dataflow-java:compileJava FROM-CACHE
> Task :runners:google-cloud-dataflow-java:classes
> Task :runners:google-cloud-dataflow-java:jar
> Task :sdks:java:testing:jpms-tests:dataflowRunnerIntegrationTest
org.apache.beam.sdk.jpmstests.JpmsIT > testE2EJpms FAILED
java.lang.RuntimeException at JpmsIT.java:63
1 test completed, 1 failed
> Task :sdks:java:testing:jpms-tests:dataflowRunnerIntegrationTest FAILED
FAILURE: Build failed with an exception.
* What went wrong:
Execution failed for task ':sdks:java:testing:jpms-tests:dataflowRunnerIntegrationTest'.
> There were failing tests. See the report at: file://<https://ci-beam.apache.org/job/beam_PostCommit_Java_Jpms_Dataflow_Java11/ws/src/sdks/java/testing/jpms-tests/build/reports/tests/dataflowRunnerIntegrationTest/index.html>
* Try:
> Run with --stacktrace option to get the stack trace.
> Run with --info or --debug option to get more log output.
* Get more help at https://help.gradle.org
Deprecated Gradle features were used in this build, making it incompatible with Gradle 8.0.
You can use '--warning-mode all' to show the individual deprecation warnings and determine if they come from your own scripts or plugins.
See https://docs.gradle.org/7.5.1/userguide/command_line_interface.html#sec:command_line_warnings
BUILD FAILED in 3h 13m 11s
85 actionable tasks: 52 executed, 31 from cache, 2 up-to-date
Build scan background action failed.
java.lang.IllegalArgumentException: com.gradle.enterprise.gradleplugin.internal.extension.a is not an interface
at java.lang.reflect.Proxy$ProxyBuilder.validateProxyInterfaces(Proxy.java:688)
at java.lang.reflect.Proxy$ProxyBuilder.<init>(Proxy.java:627)
at java.lang.reflect.Proxy.lambda$getProxyConstructor$1(Proxy.java:426)
at jdk.internal.loader.AbstractClassLoaderValue$Memoizer.get(AbstractClassLoaderValue.java:329)
at jdk.internal.loader.AbstractClassLoaderValue.computeIfAbsent(AbstractClassLoaderValue.java:205)
at java.lang.reflect.Proxy.getProxyConstructor(Proxy.java:424)
at java.lang.reflect.Proxy.newProxyInstance(Proxy.java:1006)
at com.gradle.ProxyFactory$ProxyingInvocationHandler.createLocalProxy(ProxyFactory.java:64)
at com.gradle.ProxyFactory$ProxyingInvocationHandler.lambda$adaptActionArg$1(ProxyFactory.java:59)
at com.gradle.enterprise.gradleplugin.internal.extension.b$3.run(SourceFile:100)
at java.util.concurrent.Executors$RunnableAdapter.call(Executors.java:515)
at java.util.concurrent.FutureTask.run(FutureTask.java:264)
at java.util.concurrent.ThreadPoolExecutor.runWorker(ThreadPoolExecutor.java:1128)
at java.util.concurrent.ThreadPoolExecutor$Worker.run(ThreadPoolExecutor.java:628)
at java.lang.Thread.run(Thread.java:829)
Publishing build scan...
https://gradle.com/s/rb66x4q46wkfs
Build step 'Invoke Gradle script' changed build result to FAILURE
Build step 'Invoke Gradle script' marked build as failure
---------------------------------------------------------------------
To unsubscribe, e-mail: builds-unsubscribe@beam.apache.org
For additional commands, e-mail: builds-help@beam.apache.org
beam_PostCommit_Java_Jpms_Dataflow_Java11 - Build # 3688 - Aborted!
Posted by Apache Jenkins Server <je...@builds.apache.org>.
beam_PostCommit_Java_Jpms_Dataflow_Java11 - Build # 3688 - Aborted:
Check console output at https://ci-beam.apache.org/job/beam_PostCommit_Java_Jpms_Dataflow_Java11/3688/ to view the results.
Build failed in Jenkins: beam_PostCommit_Java_Jpms_Dataflow_Java11 #3687
Posted by Apache Jenkins Server <je...@builds.apache.org>.
See <https://ci-beam.apache.org/job/beam_PostCommit_Java_Jpms_Dataflow_Java11/3687/display/redirect?page=changes>
Changes:
[noreply] [#26373] Fix some dataraces in the Go SDK (#26374)
------------------------------------------
Started by timer
Running as SYSTEM
[EnvInject] - Loading node environment variables.
Building remotely on apache-beam-jenkins-11 (beam) in workspace <https://ci-beam.apache.org/job/beam_PostCommit_Java_Jpms_Dataflow_Java11/ws/>
The recommended git tool is: NONE
No credentials specified
Wiping out workspace first.
Cloning the remote Git repository
Using shallow clone with depth 1
Avoid fetching tags
Cloning repository https://github.com/apache/beam.git
> git init <https://ci-beam.apache.org/job/beam_PostCommit_Java_Jpms_Dataflow_Java11/ws/src> # timeout=10
Fetching upstream changes from https://github.com/apache/beam.git
> git --version # timeout=10
> git --version # 'git version 2.25.1'
> git fetch --no-tags --force --progress --depth=1 -- https://github.com/apache/beam.git +refs/heads/*:refs/remotes/origin/* # timeout=10
> git config remote.origin.url https://github.com/apache/beam.git # timeout=10
> git config --add remote.origin.fetch +refs/heads/*:refs/remotes/origin/* # timeout=10
> git config remote.origin.url https://github.com/apache/beam.git # timeout=10
Using shallow fetch with depth 1
Fetching upstream changes from https://github.com/apache/beam.git
> git fetch --no-tags --force --progress --depth=1 -- https://github.com/apache/beam.git +refs/heads/*:refs/remotes/origin/* +refs/pull/${ghprbPullId}/*:refs/remotes/origin/pr/${ghprbPullId}/* # timeout=10
> git rev-parse origin/master^{commit} # timeout=10
Checking out Revision fbc7df425cd0cdd3e5e1dca05601f7b023dbed96 (origin/master)
> git config core.sparsecheckout # timeout=10
> git checkout -f fbc7df425cd0cdd3e5e1dca05601f7b023dbed96 # timeout=10
Commit message: "[#26373] Fix some dataraces in the Go SDK (#26374)"
> git rev-list --no-walk f549fd33abdc672143ccbe3f0f66104995d30fe6 # timeout=10
No emails were triggered.
[EnvInject] - Executing scripts and injecting environment variables after the SCM step.
[EnvInject] - Injecting as environment variables the properties content
SETUPTOOLS_USE_DISTUTILS=stdlib
SPARK_LOCAL_IP=127.0.0.1
[EnvInject] - Variables injected successfully.
[Gradle] - Launching build.
[src] $ <https://ci-beam.apache.org/job/beam_PostCommit_Java_Jpms_Dataflow_Java11/ws/src/gradlew> --continue --max-workers=8 -Dorg.gradle.jvmargs=-Xms2g -Dorg.gradle.jvmargs=-Xmx6g -Dorg.gradle.vfs.watch=false -Pdocker-pull-licenses -Dorg.gradle.java.home=/usr/lib/jvm/java-11-openjdk-amd64 -Pmaven_home=/home/jenkins/tools/maven/apache-maven-3.5.4 :sdks:java:testing:jpms-tests:dataflowRunnerIntegrationTest
To honour the JVM settings for this build a single-use Daemon process will be forked. See https://docs.gradle.org/7.5.1/userguide/gradle_daemon.html#sec:disabling_the_daemon.
Daemon will be stopped at the end of the build
Configuration on demand is an incubating feature.
Gradle Enterprise plugins resolution: https://plugins.gradle.org/m2
Applying com.gradle.CommonCustomUserDataGradlePlugin via init script
> Task :buildSrc:compileJava NO-SOURCE
> Task :buildSrc:compileGroovy FROM-CACHE
> Task :buildSrc:pluginDescriptors
> Task :buildSrc:processResources
> Task :buildSrc:classes
> Task :buildSrc:jar
> Task :buildSrc:assemble
> Task :buildSrc:spotlessGroovy FROM-CACHE
> Task :buildSrc:spotlessGroovyCheck UP-TO-DATE
> Task :buildSrc:spotlessGroovyGradle FROM-CACHE
> Task :buildSrc:spotlessGroovyGradleCheck UP-TO-DATE
> Task :buildSrc:spotlessCheck UP-TO-DATE
> Task :buildSrc:pluginUnderTestMetadata
> Task :buildSrc:compileTestJava NO-SOURCE
> Task :buildSrc:compileTestGroovy NO-SOURCE
> Task :buildSrc:processTestResources NO-SOURCE
> Task :buildSrc:testClasses UP-TO-DATE
> Task :buildSrc:test NO-SOURCE
> Task :buildSrc:validatePlugins FROM-CACHE
> Task :buildSrc:check UP-TO-DATE
> Task :buildSrc:build
> Configure project :sdks:java:container:java8
docker-pull-licenses set, creating go-licenses
> Configure project :sdks:java:container:java11
docker-pull-licenses set, creating go-licenses
> Task :runners:core-construction-java:createCheckerFrameworkManifest
> Task :sdks:java:core:createCheckerFrameworkManifest
> Task :model:pipeline:createCheckerFrameworkManifest
> Task :sdks:java:core:generateAvroProtocol NO-SOURCE
> Task :sdks:java:core:generateAvroJava NO-SOURCE
> Task :runners:core-construction-java:processResources NO-SOURCE
> Task :model:fn-execution:createCheckerFrameworkManifest
> Task :sdks:java:extensions:avro:createCheckerFrameworkManifest
> Task :runners:core-java:createCheckerFrameworkManifest
> Task :sdks:java:fn-execution:createCheckerFrameworkManifest
> Task :model:job-management:createCheckerFrameworkManifest
> Task :sdks:java:extensions:google-cloud-platform-core:createCheckerFrameworkManifest
> Task :runners:core-java:processResources NO-SOURCE
> Task :sdks:java:extensions:avro:generateAvroProtocol NO-SOURCE
> Task :sdks:java:fn-execution:processResources NO-SOURCE
> Task :model:fn-execution:extractProto
> Task :sdks:java:core:generateGrammarSource FROM-CACHE
> Task :sdks:java:extensions:avro:generateAvroJava NO-SOURCE
> Task :model:job-management:extractProto
> Task :sdks:java:extensions:google-cloud-platform-core:processResources NO-SOURCE
> Task :sdks:java:extensions:avro:processResources NO-SOURCE
> Task :sdks:java:testing:jpms-tests:createCheckerFrameworkManifest
> Task :runners:google-cloud-dataflow-java:createCheckerFrameworkManifest
> Task :runners:java-fn-execution:createCheckerFrameworkManifest
> Task :runners:java-fn-execution:processResources NO-SOURCE
> Task :sdks:java:testing:jpms-tests:processResources NO-SOURCE
> Task :sdks:java:testing:jpms-tests:processTestResources NO-SOURCE
> Task :model:job-management:processResources
> Task :sdks:java:harness:createCheckerFrameworkManifest
> Task :sdks:java:expansion-service:createCheckerFrameworkManifest
> Task :sdks:java:harness:processResources NO-SOURCE
> Task :model:fn-execution:processResources
> Task :sdks:java:expansion-service:processResources NO-SOURCE
> Task :sdks:java:extensions:arrow:createCheckerFrameworkManifest
> Task :sdks:java:io:google-cloud-platform:createCheckerFrameworkManifest
> Task :sdks:java:extensions:protobuf:createCheckerFrameworkManifest
> Task :sdks:java:io:google-cloud-platform:processResources NO-SOURCE
> Task :sdks:java:io:kafka:createCheckerFrameworkManifest
> Task :sdks:java:extensions:arrow:processResources NO-SOURCE
> Task :sdks:java:extensions:protobuf:extractProto
> Task :sdks:java:io:kafka:processResources NO-SOURCE
> Task :sdks:java:extensions:protobuf:processResources NO-SOURCE
> Task :sdks:java:core:processResources
> Task :runners:google-cloud-dataflow-java:processResources
> Task :model:pipeline:extractIncludeProto
> Task :model:pipeline:extractProto
> Task :model:pipeline:generateProto FROM-CACHE
> Task :model:pipeline:compileJava FROM-CACHE
> Task :model:pipeline:processResources
> Task :model:pipeline:classes
> Task :model:pipeline:jar
> Task :model:pipeline:shadowJar FROM-CACHE
> Task :model:fn-execution:extractIncludeProto
> Task :model:job-management:extractIncludeProto
> Task :model:fn-execution:generateProto FROM-CACHE
> Task :model:job-management:generateProto FROM-CACHE
> Task :model:job-management:compileJava FROM-CACHE
> Task :model:job-management:classes
> Task :model:fn-execution:compileJava FROM-CACHE
> Task :model:fn-execution:classes
> Task :model:job-management:shadowJar FROM-CACHE
> Task :model:fn-execution:shadowJar FROM-CACHE
> Task :sdks:java:core:compileJava FROM-CACHE
> Task :sdks:java:core:classes
> Task :sdks:java:core:shadowJar FROM-CACHE
> Task :sdks:java:extensions:arrow:compileJava FROM-CACHE
> Task :sdks:java:extensions:arrow:classes UP-TO-DATE
> Task :sdks:java:extensions:arrow:jar
> Task :sdks:java:extensions:avro:compileJava FROM-CACHE
> Task :sdks:java:extensions:avro:classes UP-TO-DATE
> Task :sdks:java:fn-execution:compileJava FROM-CACHE
> Task :sdks:java:fn-execution:classes UP-TO-DATE
> Task :sdks:java:fn-execution:jar
> Task :sdks:java:extensions:avro:jar
> Task :runners:core-construction-java:compileJava FROM-CACHE
> Task :runners:core-construction-java:classes UP-TO-DATE
> Task :sdks:java:extensions:protobuf:extractIncludeProto
> Task :sdks:java:extensions:protobuf:generateProto NO-SOURCE
> Task :sdks:java:extensions:protobuf:compileJava FROM-CACHE
> Task :sdks:java:extensions:protobuf:classes UP-TO-DATE
> Task :runners:core-construction-java:jar
> Task :sdks:java:extensions:protobuf:jar
> Task :runners:core-java:compileJava FROM-CACHE
> Task :runners:core-java:classes UP-TO-DATE
> Task :runners:core-java:jar
> Task :sdks:java:extensions:google-cloud-platform-core:compileJava FROM-CACHE
> Task :sdks:java:extensions:google-cloud-platform-core:classes UP-TO-DATE
> Task :sdks:java:harness:compileJava FROM-CACHE
> Task :sdks:java:harness:classes UP-TO-DATE
> Task :sdks:java:extensions:google-cloud-platform-core:jar
> Task :sdks:java:testing:jpms-tests:compileJava FROM-CACHE
> Task :sdks:java:testing:jpms-tests:classes UP-TO-DATE
> Task :sdks:java:testing:jpms-tests:jar
> Task :sdks:java:harness:jar
> Task :sdks:java:testing:jpms-tests:compileTestJava FROM-CACHE
> Task :sdks:java:testing:jpms-tests:testClasses UP-TO-DATE
> Task :sdks:java:testing:jpms-tests:testJar
> Task :runners:java-fn-execution:compileJava FROM-CACHE
> Task :runners:java-fn-execution:classes UP-TO-DATE
> Task :runners:java-fn-execution:jar
> Task :sdks:java:expansion-service:compileJava FROM-CACHE
> Task :sdks:java:expansion-service:classes UP-TO-DATE
> Task :sdks:java:expansion-service:jar
> Task :sdks:java:io:kafka:compileJava FROM-CACHE
> Task :sdks:java:io:kafka:classes UP-TO-DATE
> Task :sdks:java:io:kafka:jar
> Task :sdks:java:io:google-cloud-platform:compileJava FROM-CACHE
> Task :sdks:java:io:google-cloud-platform:classes UP-TO-DATE
> Task :sdks:java:io:google-cloud-platform:jar
> Task :runners:google-cloud-dataflow-java:compileJava FROM-CACHE
> Task :runners:google-cloud-dataflow-java:classes
> Task :runners:google-cloud-dataflow-java:jar
> Task :sdks:java:testing:jpms-tests:dataflowRunnerIntegrationTest
org.apache.beam.sdk.jpmstests.JpmsIT > testE2EJpms FAILED
java.lang.RuntimeException at JpmsIT.java:63
1 test completed, 1 failed
> Task :sdks:java:testing:jpms-tests:dataflowRunnerIntegrationTest FAILED
FAILURE: Build failed with an exception.
* What went wrong:
Execution failed for task ':sdks:java:testing:jpms-tests:dataflowRunnerIntegrationTest'.
> There were failing tests. See the report at: file://<https://ci-beam.apache.org/job/beam_PostCommit_Java_Jpms_Dataflow_Java11/ws/src/sdks/java/testing/jpms-tests/build/reports/tests/dataflowRunnerIntegrationTest/index.html>
* Try:
> Run with --stacktrace option to get the stack trace.
> Run with --info or --debug option to get more log output.
* Get more help at https://help.gradle.org
Deprecated Gradle features were used in this build, making it incompatible with Gradle 8.0.
You can use '--warning-mode all' to show the individual deprecation warnings and determine if they come from your own scripts or plugins.
See https://docs.gradle.org/7.5.1/userguide/command_line_interface.html#sec:command_line_warnings
BUILD FAILED in 3h 13m 5s
85 actionable tasks: 52 executed, 31 from cache, 2 up-to-date
Build scan background action failed.
java.lang.IllegalArgumentException: com.gradle.enterprise.gradleplugin.internal.extension.a is not an interface
at java.lang.reflect.Proxy$ProxyBuilder.validateProxyInterfaces(Proxy.java:688)
at java.lang.reflect.Proxy$ProxyBuilder.<init>(Proxy.java:627)
at java.lang.reflect.Proxy.lambda$getProxyConstructor$1(Proxy.java:426)
at jdk.internal.loader.AbstractClassLoaderValue$Memoizer.get(AbstractClassLoaderValue.java:329)
at jdk.internal.loader.AbstractClassLoaderValue.computeIfAbsent(AbstractClassLoaderValue.java:205)
at java.lang.reflect.Proxy.getProxyConstructor(Proxy.java:424)
at java.lang.reflect.Proxy.newProxyInstance(Proxy.java:1006)
at com.gradle.ProxyFactory$ProxyingInvocationHandler.createLocalProxy(ProxyFactory.java:64)
at com.gradle.ProxyFactory$ProxyingInvocationHandler.lambda$adaptActionArg$1(ProxyFactory.java:59)
at com.gradle.enterprise.gradleplugin.internal.extension.b$3.run(SourceFile:100)
at java.util.concurrent.Executors$RunnableAdapter.call(Executors.java:515)
at java.util.concurrent.FutureTask.run(FutureTask.java:264)
at java.util.concurrent.ThreadPoolExecutor.runWorker(ThreadPoolExecutor.java:1128)
at java.util.concurrent.ThreadPoolExecutor$Worker.run(ThreadPoolExecutor.java:628)
at java.lang.Thread.run(Thread.java:829)
Publishing build scan...
https://gradle.com/s/i5m6yzn6gdxfs
Build step 'Invoke Gradle script' changed build result to FAILURE
Build step 'Invoke Gradle script' marked build as failure
---------------------------------------------------------------------
To unsubscribe, e-mail: builds-unsubscribe@beam.apache.org
For additional commands, e-mail: builds-help@beam.apache.org
beam_PostCommit_Java_Jpms_Dataflow_Java11 - Build # 3686 - Aborted!
Posted by Apache Jenkins Server <je...@builds.apache.org>.
beam_PostCommit_Java_Jpms_Dataflow_Java11 - Build # 3686 - Aborted:
Check console output at https://ci-beam.apache.org/job/beam_PostCommit_Java_Jpms_Dataflow_Java11/3686/ to view the results.
Build failed in Jenkins: beam_PostCommit_Java_Jpms_Dataflow_Java11 #3685
Posted by Apache Jenkins Server <je...@builds.apache.org>.
See <https://ci-beam.apache.org/job/beam_PostCommit_Java_Jpms_Dataflow_Java11/3685/display/redirect>
Changes:
------------------------------------------
Started by timer
Running as SYSTEM
[EnvInject] - Loading node environment variables.
Building remotely on apache-beam-jenkins-11 (beam) in workspace <https://ci-beam.apache.org/job/beam_PostCommit_Java_Jpms_Dataflow_Java11/ws/>
The recommended git tool is: NONE
No credentials specified
Wiping out workspace first.
Cloning the remote Git repository
Using shallow clone with depth 1
Avoid fetching tags
Cloning repository https://github.com/apache/beam.git
> git init <https://ci-beam.apache.org/job/beam_PostCommit_Java_Jpms_Dataflow_Java11/ws/src> # timeout=10
Fetching upstream changes from https://github.com/apache/beam.git
> git --version # timeout=10
> git --version # 'git version 2.25.1'
> git fetch --no-tags --force --progress --depth=1 -- https://github.com/apache/beam.git +refs/heads/*:refs/remotes/origin/* # timeout=10
> git config remote.origin.url https://github.com/apache/beam.git # timeout=10
> git config --add remote.origin.fetch +refs/heads/*:refs/remotes/origin/* # timeout=10
> git config remote.origin.url https://github.com/apache/beam.git # timeout=10
Using shallow fetch with depth 1
Fetching upstream changes from https://github.com/apache/beam.git
> git fetch --no-tags --force --progress --depth=1 -- https://github.com/apache/beam.git +refs/heads/*:refs/remotes/origin/* +refs/pull/${ghprbPullId}/*:refs/remotes/origin/pr/${ghprbPullId}/* # timeout=10
> git rev-parse origin/master^{commit} # timeout=10
Checking out Revision f549fd33abdc672143ccbe3f0f66104995d30fe6 (origin/master)
> git config core.sparsecheckout # timeout=10
> git checkout -f f549fd33abdc672143ccbe3f0f66104995d30fe6 # timeout=10
Commit message: "Merge pull request #26063: #21431 Pubsub dynamic topic destinations"
> git rev-list --no-walk f549fd33abdc672143ccbe3f0f66104995d30fe6 # timeout=10
No emails were triggered.
[EnvInject] - Executing scripts and injecting environment variables after the SCM step.
[EnvInject] - Injecting as environment variables the properties content
SETUPTOOLS_USE_DISTUTILS=stdlib
SPARK_LOCAL_IP=127.0.0.1
[EnvInject] - Variables injected successfully.
[Gradle] - Launching build.
[src] $ <https://ci-beam.apache.org/job/beam_PostCommit_Java_Jpms_Dataflow_Java11/ws/src/gradlew> --continue --max-workers=8 -Dorg.gradle.jvmargs=-Xms2g -Dorg.gradle.jvmargs=-Xmx6g -Dorg.gradle.vfs.watch=false -Pdocker-pull-licenses -Dorg.gradle.java.home=/usr/lib/jvm/java-11-openjdk-amd64 -Pmaven_home=/home/jenkins/tools/maven/apache-maven-3.5.4 :sdks:java:testing:jpms-tests:dataflowRunnerIntegrationTest
To honour the JVM settings for this build a single-use Daemon process will be forked. See https://docs.gradle.org/7.5.1/userguide/gradle_daemon.html#sec:disabling_the_daemon.
Daemon will be stopped at the end of the build
Configuration on demand is an incubating feature.
Gradle Enterprise plugins resolution: https://plugins.gradle.org/m2
Applying com.gradle.CommonCustomUserDataGradlePlugin via init script
> Task :buildSrc:compileJava NO-SOURCE
> Task :buildSrc:compileGroovy FROM-CACHE
> Task :buildSrc:pluginDescriptors
> Task :buildSrc:processResources
> Task :buildSrc:classes
> Task :buildSrc:jar
> Task :buildSrc:assemble
> Task :buildSrc:spotlessGroovy FROM-CACHE
> Task :buildSrc:spotlessGroovyCheck UP-TO-DATE
> Task :buildSrc:spotlessGroovyGradle FROM-CACHE
> Task :buildSrc:spotlessGroovyGradleCheck UP-TO-DATE
> Task :buildSrc:spotlessCheck UP-TO-DATE
> Task :buildSrc:pluginUnderTestMetadata
> Task :buildSrc:compileTestJava NO-SOURCE
> Task :buildSrc:compileTestGroovy NO-SOURCE
> Task :buildSrc:processTestResources NO-SOURCE
> Task :buildSrc:testClasses UP-TO-DATE
> Task :buildSrc:test NO-SOURCE
> Task :buildSrc:validatePlugins FROM-CACHE
> Task :buildSrc:check UP-TO-DATE
> Task :buildSrc:build
> Configure project :sdks:java:container:java8
docker-pull-licenses set, creating go-licenses
> Configure project :sdks:java:container:java11
docker-pull-licenses set, creating go-licenses
> Task :model:pipeline:createCheckerFrameworkManifest
> Task :model:job-management:createCheckerFrameworkManifest
> Task :runners:core-java:createCheckerFrameworkManifest
> Task :sdks:java:fn-execution:createCheckerFrameworkManifest
> Task :sdks:java:core:createCheckerFrameworkManifest
> Task :model:fn-execution:createCheckerFrameworkManifest
> Task :runners:core-construction-java:createCheckerFrameworkManifest
> Task :sdks:java:extensions:avro:createCheckerFrameworkManifest
> Task :sdks:java:core:generateAvroProtocol NO-SOURCE
> Task :sdks:java:extensions:avro:generateAvroProtocol NO-SOURCE
> Task :sdks:java:core:generateAvroJava NO-SOURCE
> Task :sdks:java:fn-execution:processResources NO-SOURCE
> Task :runners:core-construction-java:processResources NO-SOURCE
> Task :runners:core-java:processResources NO-SOURCE
> Task :model:fn-execution:extractProto
> Task :model:job-management:extractProto
> Task :sdks:java:extensions:avro:generateAvroJava NO-SOURCE
> Task :sdks:java:extensions:google-cloud-platform-core:createCheckerFrameworkManifest
> Task :sdks:java:extensions:avro:processResources NO-SOURCE
> Task :sdks:java:testing:jpms-tests:createCheckerFrameworkManifest
> Task :runners:google-cloud-dataflow-java:createCheckerFrameworkManifest
> Task :sdks:java:extensions:google-cloud-platform-core:processResources NO-SOURCE
> Task :sdks:java:testing:jpms-tests:processResources NO-SOURCE
> Task :sdks:java:testing:jpms-tests:processTestResources NO-SOURCE
> Task :runners:java-fn-execution:createCheckerFrameworkManifest
> Task :runners:java-fn-execution:processResources NO-SOURCE
> Task :sdks:java:expansion-service:createCheckerFrameworkManifest
> Task :model:fn-execution:processResources
> Task :sdks:java:expansion-service:processResources NO-SOURCE
> Task :sdks:java:harness:createCheckerFrameworkManifest
> Task :model:job-management:processResources
> Task :sdks:java:harness:processResources NO-SOURCE
> Task :sdks:java:io:google-cloud-platform:createCheckerFrameworkManifest
> Task :sdks:java:core:generateGrammarSource FROM-CACHE
> Task :sdks:java:extensions:arrow:createCheckerFrameworkManifest
> Task :sdks:java:io:google-cloud-platform:processResources NO-SOURCE
> Task :sdks:java:extensions:arrow:processResources NO-SOURCE
> Task :sdks:java:io:kafka:createCheckerFrameworkManifest
> Task :sdks:java:extensions:protobuf:createCheckerFrameworkManifest
> Task :sdks:java:io:kafka:processResources NO-SOURCE
> Task :sdks:java:extensions:protobuf:extractProto
> Task :sdks:java:extensions:protobuf:processResources NO-SOURCE
> Task :sdks:java:core:processResources
> Task :runners:google-cloud-dataflow-java:processResources
> Task :model:pipeline:extractIncludeProto
> Task :model:pipeline:extractProto
> Task :model:pipeline:generateProto FROM-CACHE
> Task :model:pipeline:compileJava FROM-CACHE
> Task :model:pipeline:processResources
> Task :model:pipeline:classes
> Task :model:pipeline:jar
> Task :model:pipeline:shadowJar FROM-CACHE
> Task :model:fn-execution:extractIncludeProto
> Task :model:job-management:extractIncludeProto
> Task :model:job-management:generateProto FROM-CACHE
> Task :model:fn-execution:generateProto FROM-CACHE
> Task :model:job-management:compileJava FROM-CACHE
> Task :model:job-management:classes
> Task :model:fn-execution:compileJava FROM-CACHE
> Task :model:fn-execution:classes
> Task :model:job-management:shadowJar FROM-CACHE
> Task :model:fn-execution:shadowJar FROM-CACHE
> Task :sdks:java:core:compileJava FROM-CACHE
> Task :sdks:java:core:classes
> Task :sdks:java:core:shadowJar FROM-CACHE
> Task :sdks:java:extensions:arrow:compileJava FROM-CACHE
> Task :sdks:java:extensions:arrow:classes UP-TO-DATE
> Task :sdks:java:extensions:arrow:jar
> Task :sdks:java:extensions:avro:compileJava FROM-CACHE
> Task :sdks:java:extensions:avro:classes UP-TO-DATE
> Task :sdks:java:fn-execution:compileJava FROM-CACHE
> Task :sdks:java:fn-execution:classes UP-TO-DATE
> Task :sdks:java:extensions:avro:jar
> Task :sdks:java:fn-execution:jar
> Task :sdks:java:extensions:protobuf:extractIncludeProto
> Task :sdks:java:extensions:protobuf:generateProto NO-SOURCE
> Task :sdks:java:extensions:protobuf:compileJava FROM-CACHE
> Task :sdks:java:extensions:protobuf:classes UP-TO-DATE
> Task :sdks:java:extensions:protobuf:jar
> Task :runners:core-construction-java:compileJava FROM-CACHE
> Task :runners:core-construction-java:classes UP-TO-DATE
> Task :runners:core-construction-java:jar
> Task :runners:core-java:compileJava FROM-CACHE
> Task :runners:core-java:classes UP-TO-DATE
> Task :runners:core-java:jar
> Task :sdks:java:harness:compileJava FROM-CACHE
> Task :sdks:java:harness:classes UP-TO-DATE
> Task :sdks:java:extensions:google-cloud-platform-core:compileJava FROM-CACHE
> Task :sdks:java:extensions:google-cloud-platform-core:classes UP-TO-DATE
> Task :sdks:java:extensions:google-cloud-platform-core:jar
> Task :sdks:java:harness:jar
> Task :sdks:java:testing:jpms-tests:compileJava FROM-CACHE
> Task :sdks:java:testing:jpms-tests:classes UP-TO-DATE
> Task :sdks:java:testing:jpms-tests:jar
> Task :sdks:java:testing:jpms-tests:compileTestJava FROM-CACHE
> Task :sdks:java:testing:jpms-tests:testClasses UP-TO-DATE
> Task :sdks:java:testing:jpms-tests:testJar
> Task :runners:java-fn-execution:compileJava FROM-CACHE
> Task :runners:java-fn-execution:classes UP-TO-DATE
> Task :runners:java-fn-execution:jar
> Task :sdks:java:expansion-service:compileJava FROM-CACHE
> Task :sdks:java:expansion-service:classes UP-TO-DATE
> Task :sdks:java:expansion-service:jar
> Task :sdks:java:io:kafka:compileJava FROM-CACHE
> Task :sdks:java:io:kafka:classes UP-TO-DATE
> Task :sdks:java:io:kafka:jar
> Task :sdks:java:io:google-cloud-platform:compileJava FROM-CACHE
> Task :sdks:java:io:google-cloud-platform:classes UP-TO-DATE
> Task :sdks:java:io:google-cloud-platform:jar
> Task :runners:google-cloud-dataflow-java:compileJava FROM-CACHE
> Task :runners:google-cloud-dataflow-java:classes
> Task :runners:google-cloud-dataflow-java:jar
> Task :sdks:java:testing:jpms-tests:dataflowRunnerIntegrationTest
org.apache.beam.sdk.jpmstests.JpmsIT > testE2EJpms FAILED
java.lang.RuntimeException at JpmsIT.java:63
1 test completed, 1 failed
> Task :sdks:java:testing:jpms-tests:dataflowRunnerIntegrationTest FAILED
FAILURE: Build failed with an exception.
* What went wrong:
Execution failed for task ':sdks:java:testing:jpms-tests:dataflowRunnerIntegrationTest'.
> There were failing tests. See the report at: file://<https://ci-beam.apache.org/job/beam_PostCommit_Java_Jpms_Dataflow_Java11/ws/src/sdks/java/testing/jpms-tests/build/reports/tests/dataflowRunnerIntegrationTest/index.html>
* Try:
> Run with --stacktrace option to get the stack trace.
> Run with --info or --debug option to get more log output.
* Get more help at https://help.gradle.org
Deprecated Gradle features were used in this build, making it incompatible with Gradle 8.0.
You can use '--warning-mode all' to show the individual deprecation warnings and determine if they come from your own scripts or plugins.
See https://docs.gradle.org/7.5.1/userguide/command_line_interface.html#sec:command_line_warnings
BUILD FAILED in 3h 12m 54s
85 actionable tasks: 52 executed, 31 from cache, 2 up-to-date
Build scan background action failed.
java.lang.IllegalArgumentException: com.gradle.enterprise.gradleplugin.internal.extension.a is not an interface
at java.lang.reflect.Proxy$ProxyBuilder.validateProxyInterfaces(Proxy.java:688)
at java.lang.reflect.Proxy$ProxyBuilder.<init>(Proxy.java:627)
at java.lang.reflect.Proxy.lambda$getProxyConstructor$1(Proxy.java:426)
at jdk.internal.loader.AbstractClassLoaderValue$Memoizer.get(AbstractClassLoaderValue.java:329)
at jdk.internal.loader.AbstractClassLoaderValue.computeIfAbsent(AbstractClassLoaderValue.java:205)
at java.lang.reflect.Proxy.getProxyConstructor(Proxy.java:424)
at java.lang.reflect.Proxy.newProxyInstance(Proxy.java:1006)
at com.gradle.ProxyFactory$ProxyingInvocationHandler.createLocalProxy(ProxyFactory.java:64)
at com.gradle.ProxyFactory$ProxyingInvocationHandler.lambda$adaptActionArg$1(ProxyFactory.java:59)
at com.gradle.enterprise.gradleplugin.internal.extension.b$3.run(SourceFile:100)
at java.util.concurrent.Executors$RunnableAdapter.call(Executors.java:515)
at java.util.concurrent.FutureTask.run(FutureTask.java:264)
at java.util.concurrent.ThreadPoolExecutor.runWorker(ThreadPoolExecutor.java:1128)
at java.util.concurrent.ThreadPoolExecutor$Worker.run(ThreadPoolExecutor.java:628)
at java.lang.Thread.run(Thread.java:829)
Publishing build scan...
https://gradle.com/s/afkwxrqnpd5im
Build step 'Invoke Gradle script' changed build result to FAILURE
Build step 'Invoke Gradle script' marked build as failure
---------------------------------------------------------------------
To unsubscribe, e-mail: builds-unsubscribe@beam.apache.org
For additional commands, e-mail: builds-help@beam.apache.org
beam_PostCommit_Java_Jpms_Dataflow_Java11 - Build # 3684 - Aborted!
Posted by Apache Jenkins Server <je...@builds.apache.org>.
beam_PostCommit_Java_Jpms_Dataflow_Java11 - Build # 3684 - Aborted:
Check console output at https://ci-beam.apache.org/job/beam_PostCommit_Java_Jpms_Dataflow_Java11/3684/ to view the results.
Build failed in Jenkins: beam_PostCommit_Java_Jpms_Dataflow_Java11 #3683
Posted by Apache Jenkins Server <je...@builds.apache.org>.
See <https://ci-beam.apache.org/job/beam_PostCommit_Java_Jpms_Dataflow_Java11/3683/display/redirect>
Changes:
------------------------------------------
Started by timer
Running as SYSTEM
[EnvInject] - Loading node environment variables.
Building remotely on apache-beam-jenkins-8 (beam) in workspace <https://ci-beam.apache.org/job/beam_PostCommit_Java_Jpms_Dataflow_Java11/ws/>
The recommended git tool is: NONE
No credentials specified
Wiping out workspace first.
Cloning the remote Git repository
Using shallow clone with depth 1
Avoid fetching tags
Cloning repository https://github.com/apache/beam.git
> git init <https://ci-beam.apache.org/job/beam_PostCommit_Java_Jpms_Dataflow_Java11/ws/src> # timeout=10
Fetching upstream changes from https://github.com/apache/beam.git
> git --version # timeout=10
> git --version # 'git version 2.25.1'
> git fetch --no-tags --force --progress --depth=1 -- https://github.com/apache/beam.git +refs/heads/*:refs/remotes/origin/* # timeout=10
> git config remote.origin.url https://github.com/apache/beam.git # timeout=10
> git config --add remote.origin.fetch +refs/heads/*:refs/remotes/origin/* # timeout=10
> git config remote.origin.url https://github.com/apache/beam.git # timeout=10
Using shallow fetch with depth 1
Fetching upstream changes from https://github.com/apache/beam.git
> git fetch --no-tags --force --progress --depth=1 -- https://github.com/apache/beam.git +refs/heads/*:refs/remotes/origin/* +refs/pull/${ghprbPullId}/*:refs/remotes/origin/pr/${ghprbPullId}/* # timeout=10
> git rev-parse origin/master^{commit} # timeout=10
Checking out Revision f549fd33abdc672143ccbe3f0f66104995d30fe6 (origin/master)
> git config core.sparsecheckout # timeout=10
> git checkout -f f549fd33abdc672143ccbe3f0f66104995d30fe6 # timeout=10
Commit message: "Merge pull request #26063: #21431 Pubsub dynamic topic destinations"
> git rev-list --no-walk f549fd33abdc672143ccbe3f0f66104995d30fe6 # timeout=10
No emails were triggered.
[EnvInject] - Executing scripts and injecting environment variables after the SCM step.
[EnvInject] - Injecting as environment variables the properties content
SETUPTOOLS_USE_DISTUTILS=stdlib
SPARK_LOCAL_IP=127.0.0.1
[EnvInject] - Variables injected successfully.
[Gradle] - Launching build.
[src] $ <https://ci-beam.apache.org/job/beam_PostCommit_Java_Jpms_Dataflow_Java11/ws/src/gradlew> --continue --max-workers=8 -Dorg.gradle.jvmargs=-Xms2g -Dorg.gradle.jvmargs=-Xmx6g -Dorg.gradle.vfs.watch=false -Pdocker-pull-licenses -Dorg.gradle.java.home=/usr/lib/jvm/java-11-openjdk-amd64 -Pmaven_home=/home/jenkins/tools/maven/apache-maven-3.5.4 :sdks:java:testing:jpms-tests:dataflowRunnerIntegrationTest
To honour the JVM settings for this build a single-use Daemon process will be forked. See https://docs.gradle.org/7.5.1/userguide/gradle_daemon.html#sec:disabling_the_daemon.
Daemon will be stopped at the end of the build
Configuration on demand is an incubating feature.
Gradle Enterprise plugins resolution: https://plugins.gradle.org/m2
Applying com.gradle.CommonCustomUserDataGradlePlugin via init script
> Task :buildSrc:compileJava NO-SOURCE
> Task :buildSrc:compileGroovy FROM-CACHE
> Task :buildSrc:pluginDescriptors
> Task :buildSrc:processResources
> Task :buildSrc:classes
> Task :buildSrc:jar
> Task :buildSrc:assemble
> Task :buildSrc:spotlessGroovy FROM-CACHE
> Task :buildSrc:spotlessGroovyCheck UP-TO-DATE
> Task :buildSrc:spotlessGroovyGradle FROM-CACHE
> Task :buildSrc:spotlessGroovyGradleCheck UP-TO-DATE
> Task :buildSrc:spotlessCheck UP-TO-DATE
> Task :buildSrc:pluginUnderTestMetadata
> Task :buildSrc:compileTestJava NO-SOURCE
> Task :buildSrc:compileTestGroovy NO-SOURCE
> Task :buildSrc:processTestResources NO-SOURCE
> Task :buildSrc:testClasses UP-TO-DATE
> Task :buildSrc:test NO-SOURCE
> Task :buildSrc:validatePlugins FROM-CACHE
> Task :buildSrc:check UP-TO-DATE
> Task :buildSrc:build
> Configure project :sdks:java:container:java8
docker-pull-licenses set, creating go-licenses
> Configure project :sdks:java:container:java11
docker-pull-licenses set, creating go-licenses
> Task :runners:core-java:createCheckerFrameworkManifest
> Task :model:job-management:createCheckerFrameworkManifest
> Task :sdks:java:extensions:avro:createCheckerFrameworkManifest
> Task :sdks:java:core:createCheckerFrameworkManifest
> Task :model:fn-execution:createCheckerFrameworkManifest
> Task :runners:core-construction-java:createCheckerFrameworkManifest
> Task :model:pipeline:createCheckerFrameworkManifest
> Task :sdks:java:fn-execution:createCheckerFrameworkManifest
> Task :sdks:java:extensions:avro:generateAvroProtocol NO-SOURCE
> Task :sdks:java:fn-execution:processResources NO-SOURCE
> Task :runners:core-construction-java:processResources NO-SOURCE
> Task :sdks:java:core:generateAvroProtocol NO-SOURCE
> Task :runners:core-java:processResources NO-SOURCE
> Task :sdks:java:extensions:avro:generateAvroJava NO-SOURCE
> Task :sdks:java:core:generateAvroJava NO-SOURCE
> Task :model:job-management:extractProto
> Task :sdks:java:extensions:avro:processResources NO-SOURCE
> Task :model:fn-execution:extractProto
> Task :sdks:java:extensions:google-cloud-platform-core:createCheckerFrameworkManifest
> Task :sdks:java:testing:jpms-tests:createCheckerFrameworkManifest
> Task :runners:google-cloud-dataflow-java:createCheckerFrameworkManifest
> Task :sdks:java:extensions:google-cloud-platform-core:processResources NO-SOURCE
> Task :sdks:java:testing:jpms-tests:processResources NO-SOURCE
> Task :sdks:java:testing:jpms-tests:processTestResources NO-SOURCE
> Task :runners:java-fn-execution:createCheckerFrameworkManifest
> Task :sdks:java:harness:createCheckerFrameworkManifest
> Task :runners:java-fn-execution:processResources NO-SOURCE
> Task :sdks:java:harness:processResources NO-SOURCE
> Task :sdks:java:core:generateGrammarSource FROM-CACHE
> Task :model:job-management:processResources
> Task :sdks:java:extensions:arrow:createCheckerFrameworkManifest
> Task :model:fn-execution:processResources
> Task :sdks:java:expansion-service:createCheckerFrameworkManifest
> Task :sdks:java:extensions:arrow:processResources NO-SOURCE
> Task :sdks:java:expansion-service:processResources NO-SOURCE
> Task :sdks:java:io:google-cloud-platform:createCheckerFrameworkManifest
> Task :sdks:java:extensions:protobuf:createCheckerFrameworkManifest
> Task :sdks:java:io:google-cloud-platform:processResources NO-SOURCE
> Task :sdks:java:io:kafka:createCheckerFrameworkManifest
> Task :sdks:java:io:kafka:processResources NO-SOURCE
> Task :sdks:java:extensions:protobuf:extractProto
> Task :sdks:java:extensions:protobuf:processResources NO-SOURCE
> Task :runners:google-cloud-dataflow-java:processResources
> Task :sdks:java:core:processResources
> Task :model:pipeline:extractIncludeProto
> Task :model:pipeline:extractProto
> Task :model:pipeline:generateProto FROM-CACHE
> Task :model:pipeline:compileJava FROM-CACHE
> Task :model:pipeline:processResources
> Task :model:pipeline:classes
> Task :model:pipeline:jar
> Task :model:pipeline:shadowJar FROM-CACHE
> Task :model:fn-execution:extractIncludeProto
> Task :model:job-management:extractIncludeProto
> Task :model:job-management:generateProto FROM-CACHE
> Task :model:fn-execution:generateProto FROM-CACHE
> Task :model:job-management:compileJava FROM-CACHE
> Task :model:job-management:classes
> Task :model:fn-execution:compileJava FROM-CACHE
> Task :model:fn-execution:classes
> Task :model:job-management:shadowJar FROM-CACHE
> Task :model:fn-execution:shadowJar FROM-CACHE
> Task :sdks:java:core:compileJava FROM-CACHE
> Task :sdks:java:core:classes
> Task :sdks:java:core:shadowJar FROM-CACHE
> Task :sdks:java:extensions:arrow:compileJava FROM-CACHE
> Task :sdks:java:extensions:arrow:classes UP-TO-DATE
> Task :sdks:java:extensions:protobuf:extractIncludeProto
> Task :sdks:java:extensions:protobuf:generateProto NO-SOURCE
> Task :sdks:java:fn-execution:compileJava FROM-CACHE
> Task :sdks:java:extensions:arrow:jar
> Task :sdks:java:fn-execution:classes UP-TO-DATE
> Task :sdks:java:extensions:avro:compileJava FROM-CACHE
> Task :sdks:java:extensions:avro:classes UP-TO-DATE
> Task :sdks:java:extensions:avro:jar
> Task :sdks:java:fn-execution:jar
> Task :sdks:java:extensions:protobuf:compileJava FROM-CACHE
> Task :sdks:java:extensions:protobuf:classes UP-TO-DATE
> Task :sdks:java:extensions:protobuf:jar
> Task :runners:core-construction-java:compileJava FROM-CACHE
> Task :runners:core-construction-java:classes UP-TO-DATE
> Task :runners:core-construction-java:jar
> Task :runners:core-java:compileJava FROM-CACHE
> Task :runners:core-java:classes UP-TO-DATE
> Task :runners:core-java:jar
> Task :sdks:java:extensions:google-cloud-platform-core:compileJava FROM-CACHE
> Task :sdks:java:extensions:google-cloud-platform-core:classes UP-TO-DATE
> Task :sdks:java:extensions:google-cloud-platform-core:jar
> Task :sdks:java:harness:compileJava FROM-CACHE
> Task :sdks:java:harness:classes UP-TO-DATE
> Task :sdks:java:testing:jpms-tests:compileJava FROM-CACHE
> Task :sdks:java:testing:jpms-tests:classes UP-TO-DATE
> Task :sdks:java:testing:jpms-tests:jar
> Task :sdks:java:harness:jar
> Task :sdks:java:testing:jpms-tests:compileTestJava FROM-CACHE
> Task :sdks:java:testing:jpms-tests:testClasses UP-TO-DATE
> Task :sdks:java:testing:jpms-tests:testJar
> Task :runners:java-fn-execution:compileJava FROM-CACHE
> Task :runners:java-fn-execution:classes UP-TO-DATE
> Task :runners:java-fn-execution:jar
> Task :sdks:java:expansion-service:compileJava FROM-CACHE
> Task :sdks:java:expansion-service:classes UP-TO-DATE
> Task :sdks:java:expansion-service:jar
> Task :sdks:java:io:kafka:compileJava FROM-CACHE
> Task :sdks:java:io:kafka:classes UP-TO-DATE
> Task :sdks:java:io:kafka:jar
> Task :sdks:java:io:google-cloud-platform:compileJava FROM-CACHE
> Task :sdks:java:io:google-cloud-platform:classes UP-TO-DATE
> Task :sdks:java:io:google-cloud-platform:jar
> Task :runners:google-cloud-dataflow-java:compileJava FROM-CACHE
> Task :runners:google-cloud-dataflow-java:classes
> Task :runners:google-cloud-dataflow-java:jar
> Task :sdks:java:testing:jpms-tests:dataflowRunnerIntegrationTest
org.apache.beam.sdk.jpmstests.JpmsIT > testE2EJpms FAILED
java.lang.RuntimeException at JpmsIT.java:63
1 test completed, 1 failed
> Task :sdks:java:testing:jpms-tests:dataflowRunnerIntegrationTest FAILED
FAILURE: Build failed with an exception.
* What went wrong:
Execution failed for task ':sdks:java:testing:jpms-tests:dataflowRunnerIntegrationTest'.
> There were failing tests. See the report at: file://<https://ci-beam.apache.org/job/beam_PostCommit_Java_Jpms_Dataflow_Java11/ws/src/sdks/java/testing/jpms-tests/build/reports/tests/dataflowRunnerIntegrationTest/index.html>
* Try:
> Run with --stacktrace option to get the stack trace.
> Run with --info or --debug option to get more log output.
* Get more help at https://help.gradle.org
Deprecated Gradle features were used in this build, making it incompatible with Gradle 8.0.
You can use '--warning-mode all' to show the individual deprecation warnings and determine if they come from your own scripts or plugins.
See https://docs.gradle.org/7.5.1/userguide/command_line_interface.html#sec:command_line_warnings
BUILD FAILED in 3h 13m
85 actionable tasks: 52 executed, 31 from cache, 2 up-to-date
Build scan background action failed.
java.lang.IllegalArgumentException: com.gradle.enterprise.gradleplugin.internal.extension.a is not an interface
at java.lang.reflect.Proxy$ProxyBuilder.validateProxyInterfaces(Proxy.java:688)
at java.lang.reflect.Proxy$ProxyBuilder.<init>(Proxy.java:627)
at java.lang.reflect.Proxy.lambda$getProxyConstructor$1(Proxy.java:426)
at jdk.internal.loader.AbstractClassLoaderValue$Memoizer.get(AbstractClassLoaderValue.java:329)
at jdk.internal.loader.AbstractClassLoaderValue.computeIfAbsent(AbstractClassLoaderValue.java:205)
at java.lang.reflect.Proxy.getProxyConstructor(Proxy.java:424)
at java.lang.reflect.Proxy.newProxyInstance(Proxy.java:1006)
at com.gradle.ProxyFactory$ProxyingInvocationHandler.createLocalProxy(ProxyFactory.java:64)
at com.gradle.ProxyFactory$ProxyingInvocationHandler.lambda$adaptActionArg$1(ProxyFactory.java:59)
at com.gradle.enterprise.gradleplugin.internal.extension.b$3.run(SourceFile:100)
at java.util.concurrent.Executors$RunnableAdapter.call(Executors.java:515)
at java.util.concurrent.FutureTask.run(FutureTask.java:264)
at java.util.concurrent.ThreadPoolExecutor.runWorker(ThreadPoolExecutor.java:1128)
at java.util.concurrent.ThreadPoolExecutor$Worker.run(ThreadPoolExecutor.java:628)
at java.lang.Thread.run(Thread.java:829)
Publishing build scan...
https://gradle.com/s/ndz5iwxwqin7w
Build step 'Invoke Gradle script' changed build result to FAILURE
Build step 'Invoke Gradle script' marked build as failure
---------------------------------------------------------------------
To unsubscribe, e-mail: builds-unsubscribe@beam.apache.org
For additional commands, e-mail: builds-help@beam.apache.org
beam_PostCommit_Java_Jpms_Dataflow_Java11 - Build # 3682 - Aborted!
Posted by Apache Jenkins Server <je...@builds.apache.org>.
beam_PostCommit_Java_Jpms_Dataflow_Java11 - Build # 3682 - Aborted:
Check console output at https://ci-beam.apache.org/job/beam_PostCommit_Java_Jpms_Dataflow_Java11/3682/ to view the results.
Build failed in Jenkins: beam_PostCommit_Java_Jpms_Dataflow_Java11 #3681
Posted by Apache Jenkins Server <je...@builds.apache.org>.
See <https://ci-beam.apache.org/job/beam_PostCommit_Java_Jpms_Dataflow_Java11/3681/display/redirect>
Changes:
------------------------------------------
Started by timer
Running as SYSTEM
[EnvInject] - Loading node environment variables.
Building remotely on apache-beam-jenkins-11 (beam) in workspace <https://ci-beam.apache.org/job/beam_PostCommit_Java_Jpms_Dataflow_Java11/ws/>
The recommended git tool is: NONE
No credentials specified
Wiping out workspace first.
Cloning the remote Git repository
Using shallow clone with depth 1
Avoid fetching tags
Cloning repository https://github.com/apache/beam.git
> git init <https://ci-beam.apache.org/job/beam_PostCommit_Java_Jpms_Dataflow_Java11/ws/src> # timeout=10
Fetching upstream changes from https://github.com/apache/beam.git
> git --version # timeout=10
> git --version # 'git version 2.25.1'
> git fetch --no-tags --force --progress --depth=1 -- https://github.com/apache/beam.git +refs/heads/*:refs/remotes/origin/* # timeout=10
> git config remote.origin.url https://github.com/apache/beam.git # timeout=10
> git config --add remote.origin.fetch +refs/heads/*:refs/remotes/origin/* # timeout=10
> git config remote.origin.url https://github.com/apache/beam.git # timeout=10
Using shallow fetch with depth 1
Fetching upstream changes from https://github.com/apache/beam.git
> git fetch --no-tags --force --progress --depth=1 -- https://github.com/apache/beam.git +refs/heads/*:refs/remotes/origin/* +refs/pull/${ghprbPullId}/*:refs/remotes/origin/pr/${ghprbPullId}/* # timeout=10
> git rev-parse origin/master^{commit} # timeout=10
Checking out Revision f549fd33abdc672143ccbe3f0f66104995d30fe6 (origin/master)
> git config core.sparsecheckout # timeout=10
> git checkout -f f549fd33abdc672143ccbe3f0f66104995d30fe6 # timeout=10
Commit message: "Merge pull request #26063: #21431 Pubsub dynamic topic destinations"
> git rev-list --no-walk f549fd33abdc672143ccbe3f0f66104995d30fe6 # timeout=10
No emails were triggered.
[EnvInject] - Executing scripts and injecting environment variables after the SCM step.
[EnvInject] - Injecting as environment variables the properties content
SETUPTOOLS_USE_DISTUTILS=stdlib
SPARK_LOCAL_IP=127.0.0.1
[EnvInject] - Variables injected successfully.
[Gradle] - Launching build.
[src] $ <https://ci-beam.apache.org/job/beam_PostCommit_Java_Jpms_Dataflow_Java11/ws/src/gradlew> --continue --max-workers=8 -Dorg.gradle.jvmargs=-Xms2g -Dorg.gradle.jvmargs=-Xmx6g -Dorg.gradle.vfs.watch=false -Pdocker-pull-licenses -Dorg.gradle.java.home=/usr/lib/jvm/java-11-openjdk-amd64 -Pmaven_home=/home/jenkins/tools/maven/apache-maven-3.5.4 :sdks:java:testing:jpms-tests:dataflowRunnerIntegrationTest
To honour the JVM settings for this build a single-use Daemon process will be forked. See https://docs.gradle.org/7.5.1/userguide/gradle_daemon.html#sec:disabling_the_daemon.
Daemon will be stopped at the end of the build
Configuration on demand is an incubating feature.
Gradle Enterprise plugins resolution: https://plugins.gradle.org/m2
Applying com.gradle.CommonCustomUserDataGradlePlugin via init script
> Task :buildSrc:compileJava NO-SOURCE
> Task :buildSrc:compileGroovy FROM-CACHE
> Task :buildSrc:pluginDescriptors
> Task :buildSrc:processResources
> Task :buildSrc:classes
> Task :buildSrc:jar
> Task :buildSrc:assemble
> Task :buildSrc:spotlessGroovy FROM-CACHE
> Task :buildSrc:spotlessGroovyCheck UP-TO-DATE
> Task :buildSrc:spotlessGroovyGradle FROM-CACHE
> Task :buildSrc:spotlessGroovyGradleCheck UP-TO-DATE
> Task :buildSrc:spotlessCheck UP-TO-DATE
> Task :buildSrc:pluginUnderTestMetadata
> Task :buildSrc:compileTestJava NO-SOURCE
> Task :buildSrc:compileTestGroovy NO-SOURCE
> Task :buildSrc:processTestResources NO-SOURCE
> Task :buildSrc:testClasses UP-TO-DATE
> Task :buildSrc:test NO-SOURCE
> Task :buildSrc:validatePlugins FROM-CACHE
> Task :buildSrc:check UP-TO-DATE
> Task :buildSrc:build
> Configure project :sdks:java:container:java8
docker-pull-licenses set, creating go-licenses
> Configure project :sdks:java:container:java11
docker-pull-licenses set, creating go-licenses
> Task :sdks:java:extensions:avro:createCheckerFrameworkManifest
> Task :sdks:java:core:createCheckerFrameworkManifest
> Task :model:fn-execution:createCheckerFrameworkManifest
> Task :model:job-management:createCheckerFrameworkManifest
> Task :model:pipeline:createCheckerFrameworkManifest
> Task :sdks:java:core:generateAvroProtocol NO-SOURCE
> Task :sdks:java:extensions:avro:generateAvroProtocol NO-SOURCE
> Task :runners:core-construction-java:createCheckerFrameworkManifest
> Task :model:fn-execution:extractProto
> Task :sdks:java:extensions:avro:generateAvroJava NO-SOURCE
> Task :runners:core-java:createCheckerFrameworkManifest
> Task :sdks:java:fn-execution:createCheckerFrameworkManifest
> Task :model:job-management:extractProto
> Task :sdks:java:core:generateAvroJava NO-SOURCE
> Task :runners:core-java:processResources NO-SOURCE
> Task :runners:core-construction-java:processResources NO-SOURCE
> Task :sdks:java:fn-execution:processResources NO-SOURCE
> Task :sdks:java:extensions:google-cloud-platform-core:createCheckerFrameworkManifest
> Task :sdks:java:extensions:avro:processResources NO-SOURCE
> Task :sdks:java:extensions:google-cloud-platform-core:processResources NO-SOURCE
> Task :runners:google-cloud-dataflow-java:createCheckerFrameworkManifest
> Task :runners:java-fn-execution:createCheckerFrameworkManifest
> Task :sdks:java:testing:jpms-tests:createCheckerFrameworkManifest
> Task :sdks:java:harness:createCheckerFrameworkManifest
> Task :sdks:java:harness:processResources NO-SOURCE
> Task :runners:java-fn-execution:processResources NO-SOURCE
> Task :sdks:java:core:generateGrammarSource FROM-CACHE
> Task :sdks:java:testing:jpms-tests:processResources NO-SOURCE
> Task :sdks:java:expansion-service:createCheckerFrameworkManifest
> Task :model:job-management:processResources
> Task :sdks:java:extensions:arrow:createCheckerFrameworkManifest
> Task :model:fn-execution:processResources
> Task :sdks:java:testing:jpms-tests:processTestResources NO-SOURCE
> Task :sdks:java:expansion-service:processResources NO-SOURCE
> Task :sdks:java:extensions:arrow:processResources NO-SOURCE
> Task :sdks:java:io:google-cloud-platform:createCheckerFrameworkManifest
> Task :sdks:java:extensions:protobuf:createCheckerFrameworkManifest
> Task :sdks:java:io:google-cloud-platform:processResources NO-SOURCE
> Task :sdks:java:extensions:protobuf:extractProto
> Task :sdks:java:extensions:protobuf:processResources NO-SOURCE
> Task :sdks:java:io:kafka:createCheckerFrameworkManifest
> Task :sdks:java:io:kafka:processResources NO-SOURCE
> Task :runners:google-cloud-dataflow-java:processResources
> Task :sdks:java:core:processResources
> Task :model:pipeline:extractIncludeProto
> Task :model:pipeline:extractProto
> Task :model:pipeline:generateProto FROM-CACHE
> Task :model:pipeline:compileJava FROM-CACHE
> Task :model:pipeline:processResources
> Task :model:pipeline:classes
> Task :model:pipeline:jar
> Task :model:pipeline:shadowJar FROM-CACHE
> Task :model:job-management:extractIncludeProto
> Task :model:fn-execution:extractIncludeProto
> Task :model:job-management:generateProto FROM-CACHE
> Task :model:fn-execution:generateProto FROM-CACHE
> Task :model:job-management:compileJava FROM-CACHE
> Task :model:job-management:classes
> Task :model:fn-execution:compileJava FROM-CACHE
> Task :model:fn-execution:classes
> Task :model:job-management:shadowJar FROM-CACHE
> Task :model:fn-execution:shadowJar FROM-CACHE
> Task :sdks:java:core:compileJava FROM-CACHE
> Task :sdks:java:core:classes
> Task :sdks:java:core:shadowJar FROM-CACHE
> Task :sdks:java:extensions:arrow:compileJava FROM-CACHE
> Task :sdks:java:extensions:arrow:classes UP-TO-DATE
> Task :sdks:java:extensions:arrow:jar
> Task :sdks:java:extensions:avro:compileJava FROM-CACHE
> Task :sdks:java:extensions:avro:classes UP-TO-DATE
> Task :sdks:java:fn-execution:compileJava FROM-CACHE
> Task :sdks:java:fn-execution:classes UP-TO-DATE
> Task :sdks:java:extensions:avro:jar
> Task :sdks:java:fn-execution:jar
> Task :sdks:java:extensions:protobuf:extractIncludeProto
> Task :sdks:java:extensions:protobuf:generateProto NO-SOURCE
> Task :runners:core-construction-java:compileJava FROM-CACHE
> Task :runners:core-construction-java:classes UP-TO-DATE
> Task :sdks:java:extensions:protobuf:compileJava FROM-CACHE
> Task :sdks:java:extensions:protobuf:classes UP-TO-DATE
> Task :sdks:java:extensions:protobuf:jar
> Task :runners:core-construction-java:jar
> Task :runners:core-java:compileJava FROM-CACHE
> Task :runners:core-java:classes UP-TO-DATE
> Task :runners:core-java:jar
> Task :sdks:java:extensions:google-cloud-platform-core:compileJava FROM-CACHE
> Task :sdks:java:extensions:google-cloud-platform-core:classes UP-TO-DATE
> Task :sdks:java:harness:compileJava FROM-CACHE
> Task :sdks:java:harness:classes UP-TO-DATE
> Task :sdks:java:extensions:google-cloud-platform-core:jar
> Task :sdks:java:testing:jpms-tests:compileJava FROM-CACHE
> Task :sdks:java:testing:jpms-tests:classes UP-TO-DATE
> Task :sdks:java:testing:jpms-tests:jar
> Task :sdks:java:testing:jpms-tests:compileTestJava FROM-CACHE
> Task :sdks:java:testing:jpms-tests:testClasses UP-TO-DATE
> Task :sdks:java:harness:jar
> Task :sdks:java:testing:jpms-tests:testJar
> Task :runners:java-fn-execution:compileJava FROM-CACHE
> Task :runners:java-fn-execution:classes UP-TO-DATE
> Task :runners:java-fn-execution:jar
> Task :sdks:java:expansion-service:compileJava FROM-CACHE
> Task :sdks:java:expansion-service:classes UP-TO-DATE
> Task :sdks:java:expansion-service:jar
> Task :sdks:java:io:kafka:compileJava FROM-CACHE
> Task :sdks:java:io:kafka:classes UP-TO-DATE
> Task :sdks:java:io:kafka:jar
> Task :sdks:java:io:google-cloud-platform:compileJava FROM-CACHE
> Task :sdks:java:io:google-cloud-platform:classes UP-TO-DATE
> Task :sdks:java:io:google-cloud-platform:jar
> Task :runners:google-cloud-dataflow-java:compileJava FROM-CACHE
> Task :runners:google-cloud-dataflow-java:classes
> Task :runners:google-cloud-dataflow-java:jar
> Task :sdks:java:testing:jpms-tests:dataflowRunnerIntegrationTest
org.apache.beam.sdk.jpmstests.JpmsIT > testE2EJpms FAILED
java.lang.RuntimeException at JpmsIT.java:63
1 test completed, 1 failed
> Task :sdks:java:testing:jpms-tests:dataflowRunnerIntegrationTest FAILED
FAILURE: Build failed with an exception.
* What went wrong:
Execution failed for task ':sdks:java:testing:jpms-tests:dataflowRunnerIntegrationTest'.
> There were failing tests. See the report at: file://<https://ci-beam.apache.org/job/beam_PostCommit_Java_Jpms_Dataflow_Java11/ws/src/sdks/java/testing/jpms-tests/build/reports/tests/dataflowRunnerIntegrationTest/index.html>
* Try:
> Run with --stacktrace option to get the stack trace.
> Run with --info or --debug option to get more log output.
* Get more help at https://help.gradle.org
Deprecated Gradle features were used in this build, making it incompatible with Gradle 8.0.
You can use '--warning-mode all' to show the individual deprecation warnings and determine if they come from your own scripts or plugins.
See https://docs.gradle.org/7.5.1/userguide/command_line_interface.html#sec:command_line_warnings
BUILD FAILED in 3h 13m 13s
85 actionable tasks: 52 executed, 31 from cache, 2 up-to-date
Build scan background action failed.
java.lang.IllegalArgumentException: com.gradle.enterprise.gradleplugin.internal.extension.a is not an interface
at java.lang.reflect.Proxy$ProxyBuilder.validateProxyInterfaces(Proxy.java:688)
at java.lang.reflect.Proxy$ProxyBuilder.<init>(Proxy.java:627)
at java.lang.reflect.Proxy.lambda$getProxyConstructor$1(Proxy.java:426)
at jdk.internal.loader.AbstractClassLoaderValue$Memoizer.get(AbstractClassLoaderValue.java:329)
at jdk.internal.loader.AbstractClassLoaderValue.computeIfAbsent(AbstractClassLoaderValue.java:205)
at java.lang.reflect.Proxy.getProxyConstructor(Proxy.java:424)
at java.lang.reflect.Proxy.newProxyInstance(Proxy.java:1006)
at com.gradle.ProxyFactory$ProxyingInvocationHandler.createLocalProxy(ProxyFactory.java:64)
at com.gradle.ProxyFactory$ProxyingInvocationHandler.lambda$adaptActionArg$1(ProxyFactory.java:59)
at com.gradle.enterprise.gradleplugin.internal.extension.b$3.run(SourceFile:100)
at java.util.concurrent.Executors$RunnableAdapter.call(Executors.java:515)
at java.util.concurrent.FutureTask.run(FutureTask.java:264)
at java.util.concurrent.ThreadPoolExecutor.runWorker(ThreadPoolExecutor.java:1128)
at java.util.concurrent.ThreadPoolExecutor$Worker.run(ThreadPoolExecutor.java:628)
at java.lang.Thread.run(Thread.java:829)
Publishing build scan...
https://gradle.com/s/tz3h5x6ujkrgq
Build step 'Invoke Gradle script' changed build result to FAILURE
Build step 'Invoke Gradle script' marked build as failure
---------------------------------------------------------------------
To unsubscribe, e-mail: builds-unsubscribe@beam.apache.org
For additional commands, e-mail: builds-help@beam.apache.org
beam_PostCommit_Java_Jpms_Dataflow_Java11 - Build # 3680 - Aborted!
Posted by Apache Jenkins Server <je...@builds.apache.org>.
beam_PostCommit_Java_Jpms_Dataflow_Java11 - Build # 3680 - Aborted:
Check console output at https://ci-beam.apache.org/job/beam_PostCommit_Java_Jpms_Dataflow_Java11/3680/ to view the results.
Build failed in Jenkins: beam_PostCommit_Java_Jpms_Dataflow_Java11 #3679
Posted by Apache Jenkins Server <je...@builds.apache.org>.
See <https://ci-beam.apache.org/job/beam_PostCommit_Java_Jpms_Dataflow_Java11/3679/display/redirect>
Changes:
------------------------------------------
Started by timer
Running as SYSTEM
[EnvInject] - Loading node environment variables.
Building remotely on apache-beam-jenkins-8 (beam) in workspace <https://ci-beam.apache.org/job/beam_PostCommit_Java_Jpms_Dataflow_Java11/ws/>
The recommended git tool is: NONE
No credentials specified
Wiping out workspace first.
Cloning the remote Git repository
Using shallow clone with depth 1
Avoid fetching tags
Cloning repository https://github.com/apache/beam.git
> git init <https://ci-beam.apache.org/job/beam_PostCommit_Java_Jpms_Dataflow_Java11/ws/src> # timeout=10
Fetching upstream changes from https://github.com/apache/beam.git
> git --version # timeout=10
> git --version # 'git version 2.25.1'
> git fetch --no-tags --force --progress --depth=1 -- https://github.com/apache/beam.git +refs/heads/*:refs/remotes/origin/* # timeout=10
> git config remote.origin.url https://github.com/apache/beam.git # timeout=10
> git config --add remote.origin.fetch +refs/heads/*:refs/remotes/origin/* # timeout=10
> git config remote.origin.url https://github.com/apache/beam.git # timeout=10
Using shallow fetch with depth 1
Fetching upstream changes from https://github.com/apache/beam.git
> git fetch --no-tags --force --progress --depth=1 -- https://github.com/apache/beam.git +refs/heads/*:refs/remotes/origin/* +refs/pull/${ghprbPullId}/*:refs/remotes/origin/pr/${ghprbPullId}/* # timeout=10
> git rev-parse origin/master^{commit} # timeout=10
Checking out Revision f549fd33abdc672143ccbe3f0f66104995d30fe6 (origin/master)
> git config core.sparsecheckout # timeout=10
> git checkout -f f549fd33abdc672143ccbe3f0f66104995d30fe6 # timeout=10
Commit message: "Merge pull request #26063: #21431 Pubsub dynamic topic destinations"
> git rev-list --no-walk f549fd33abdc672143ccbe3f0f66104995d30fe6 # timeout=10
No emails were triggered.
[EnvInject] - Executing scripts and injecting environment variables after the SCM step.
[EnvInject] - Injecting as environment variables the properties content
SETUPTOOLS_USE_DISTUTILS=stdlib
SPARK_LOCAL_IP=127.0.0.1
[EnvInject] - Variables injected successfully.
[Gradle] - Launching build.
[src] $ <https://ci-beam.apache.org/job/beam_PostCommit_Java_Jpms_Dataflow_Java11/ws/src/gradlew> --continue --max-workers=8 -Dorg.gradle.jvmargs=-Xms2g -Dorg.gradle.jvmargs=-Xmx6g -Dorg.gradle.vfs.watch=false -Pdocker-pull-licenses -Dorg.gradle.java.home=/usr/lib/jvm/java-11-openjdk-amd64 -Pmaven_home=/home/jenkins/tools/maven/apache-maven-3.5.4 :sdks:java:testing:jpms-tests:dataflowRunnerIntegrationTest
To honour the JVM settings for this build a single-use Daemon process will be forked. See https://docs.gradle.org/7.5.1/userguide/gradle_daemon.html#sec:disabling_the_daemon.
Daemon will be stopped at the end of the build
Configuration on demand is an incubating feature.
Gradle Enterprise plugins resolution: https://plugins.gradle.org/m2
Applying com.gradle.CommonCustomUserDataGradlePlugin via init script
> Task :buildSrc:compileJava NO-SOURCE
> Task :buildSrc:compileGroovy FROM-CACHE
> Task :buildSrc:pluginDescriptors
> Task :buildSrc:processResources
> Task :buildSrc:classes
> Task :buildSrc:jar
> Task :buildSrc:assemble
> Task :buildSrc:spotlessGroovy FROM-CACHE
> Task :buildSrc:spotlessGroovyCheck UP-TO-DATE
> Task :buildSrc:spotlessGroovyGradle FROM-CACHE
> Task :buildSrc:spotlessGroovyGradleCheck UP-TO-DATE
> Task :buildSrc:spotlessCheck UP-TO-DATE
> Task :buildSrc:pluginUnderTestMetadata
> Task :buildSrc:compileTestJava NO-SOURCE
> Task :buildSrc:compileTestGroovy NO-SOURCE
> Task :buildSrc:processTestResources NO-SOURCE
> Task :buildSrc:testClasses UP-TO-DATE
> Task :buildSrc:test NO-SOURCE
> Task :buildSrc:validatePlugins FROM-CACHE
> Task :buildSrc:check UP-TO-DATE
> Task :buildSrc:build
> Configure project :sdks:java:container:java8
docker-pull-licenses set, creating go-licenses
> Configure project :sdks:java:container:java11
docker-pull-licenses set, creating go-licenses
> Task :sdks:java:fn-execution:createCheckerFrameworkManifest
> Task :model:fn-execution:createCheckerFrameworkManifest
> Task :runners:core-construction-java:createCheckerFrameworkManifest
> Task :sdks:java:extensions:avro:createCheckerFrameworkManifest
> Task :runners:core-java:createCheckerFrameworkManifest
> Task :sdks:java:core:createCheckerFrameworkManifest
> Task :model:job-management:createCheckerFrameworkManifest
> Task :model:pipeline:createCheckerFrameworkManifest
> Task :sdks:java:extensions:avro:generateAvroProtocol NO-SOURCE
> Task :sdks:java:core:generateAvroProtocol NO-SOURCE
> Task :runners:core-java:processResources NO-SOURCE
> Task :sdks:java:fn-execution:processResources NO-SOURCE
> Task :runners:core-construction-java:processResources NO-SOURCE
> Task :sdks:java:extensions:avro:generateAvroJava NO-SOURCE
> Task :sdks:java:core:generateAvroJava NO-SOURCE
> Task :sdks:java:extensions:avro:processResources NO-SOURCE
> Task :model:fn-execution:extractProto
> Task :model:job-management:extractProto
> Task :sdks:java:testing:jpms-tests:createCheckerFrameworkManifest
> Task :runners:google-cloud-dataflow-java:createCheckerFrameworkManifest
> Task :sdks:java:extensions:google-cloud-platform-core:createCheckerFrameworkManifest
> Task :sdks:java:extensions:google-cloud-platform-core:processResources NO-SOURCE
> Task :sdks:java:testing:jpms-tests:processResources NO-SOURCE
> Task :runners:java-fn-execution:createCheckerFrameworkManifest
> Task :sdks:java:testing:jpms-tests:processTestResources NO-SOURCE
> Task :runners:java-fn-execution:processResources NO-SOURCE
> Task :sdks:java:harness:createCheckerFrameworkManifest
> Task :sdks:java:expansion-service:createCheckerFrameworkManifest
> Task :sdks:java:harness:processResources NO-SOURCE
> Task :sdks:java:expansion-service:processResources NO-SOURCE
> Task :model:job-management:processResources
> Task :sdks:java:core:generateGrammarSource FROM-CACHE
> Task :model:fn-execution:processResources
> Task :sdks:java:io:google-cloud-platform:createCheckerFrameworkManifest
> Task :sdks:java:extensions:arrow:createCheckerFrameworkManifest
> Task :sdks:java:io:kafka:createCheckerFrameworkManifest
> Task :sdks:java:io:google-cloud-platform:processResources NO-SOURCE
> Task :sdks:java:extensions:arrow:processResources NO-SOURCE
> Task :sdks:java:io:kafka:processResources NO-SOURCE
> Task :sdks:java:extensions:protobuf:createCheckerFrameworkManifest
> Task :sdks:java:extensions:protobuf:extractProto
> Task :sdks:java:extensions:protobuf:processResources NO-SOURCE
> Task :runners:google-cloud-dataflow-java:processResources
> Task :sdks:java:core:processResources
> Task :model:pipeline:extractIncludeProto
> Task :model:pipeline:extractProto
> Task :model:pipeline:generateProto FROM-CACHE
> Task :model:pipeline:compileJava FROM-CACHE
> Task :model:pipeline:processResources
> Task :model:pipeline:classes
> Task :model:pipeline:jar
> Task :model:pipeline:shadowJar FROM-CACHE
> Task :model:job-management:extractIncludeProto
> Task :model:fn-execution:extractIncludeProto
> Task :model:job-management:generateProto FROM-CACHE
> Task :model:fn-execution:generateProto FROM-CACHE
> Task :model:job-management:compileJava FROM-CACHE
> Task :model:job-management:classes
> Task :model:fn-execution:compileJava FROM-CACHE
> Task :model:fn-execution:classes
> Task :model:fn-execution:shadowJar FROM-CACHE
> Task :model:job-management:shadowJar FROM-CACHE
> Task :sdks:java:core:compileJava FROM-CACHE
> Task :sdks:java:core:classes
> Task :sdks:java:core:shadowJar FROM-CACHE
> Task :sdks:java:extensions:arrow:compileJava FROM-CACHE
> Task :sdks:java:extensions:arrow:classes UP-TO-DATE
> Task :sdks:java:extensions:arrow:jar
> Task :sdks:java:extensions:avro:compileJava FROM-CACHE
> Task :sdks:java:extensions:avro:classes UP-TO-DATE
> Task :sdks:java:extensions:avro:jar
> Task :sdks:java:extensions:protobuf:extractIncludeProto
> Task :sdks:java:extensions:protobuf:generateProto NO-SOURCE
> Task :sdks:java:fn-execution:compileJava FROM-CACHE
> Task :sdks:java:fn-execution:classes UP-TO-DATE
> Task :sdks:java:fn-execution:jar
> Task :sdks:java:extensions:protobuf:compileJava FROM-CACHE
> Task :sdks:java:extensions:protobuf:classes UP-TO-DATE
> Task :sdks:java:extensions:protobuf:jar
> Task :runners:core-construction-java:compileJava FROM-CACHE
> Task :runners:core-construction-java:classes UP-TO-DATE
> Task :runners:core-construction-java:jar
> Task :runners:core-java:compileJava FROM-CACHE
> Task :runners:core-java:classes UP-TO-DATE
> Task :runners:core-java:jar
> Task :sdks:java:harness:compileJava FROM-CACHE
> Task :sdks:java:harness:classes UP-TO-DATE
> Task :sdks:java:extensions:google-cloud-platform-core:compileJava FROM-CACHE
> Task :sdks:java:extensions:google-cloud-platform-core:classes UP-TO-DATE
> Task :sdks:java:harness:jar
> Task :sdks:java:extensions:google-cloud-platform-core:jar
> Task :sdks:java:testing:jpms-tests:compileJava FROM-CACHE
> Task :sdks:java:testing:jpms-tests:classes UP-TO-DATE
> Task :sdks:java:testing:jpms-tests:jar
> Task :runners:java-fn-execution:compileJava FROM-CACHE
> Task :runners:java-fn-execution:classes UP-TO-DATE
> Task :sdks:java:testing:jpms-tests:compileTestJava FROM-CACHE
> Task :sdks:java:testing:jpms-tests:testClasses UP-TO-DATE
> Task :sdks:java:testing:jpms-tests:testJar
> Task :runners:java-fn-execution:jar
> Task :sdks:java:expansion-service:compileJava FROM-CACHE
> Task :sdks:java:expansion-service:classes UP-TO-DATE
> Task :sdks:java:expansion-service:jar
> Task :sdks:java:io:kafka:compileJava FROM-CACHE
> Task :sdks:java:io:kafka:classes UP-TO-DATE
> Task :sdks:java:io:kafka:jar
> Task :sdks:java:io:google-cloud-platform:compileJava FROM-CACHE
> Task :sdks:java:io:google-cloud-platform:classes UP-TO-DATE
> Task :sdks:java:io:google-cloud-platform:jar
> Task :runners:google-cloud-dataflow-java:compileJava FROM-CACHE
> Task :runners:google-cloud-dataflow-java:classes
> Task :runners:google-cloud-dataflow-java:jar
> Task :sdks:java:testing:jpms-tests:dataflowRunnerIntegrationTest
org.apache.beam.sdk.jpmstests.JpmsIT > testE2EJpms FAILED
java.lang.RuntimeException at JpmsIT.java:63
1 test completed, 1 failed
> Task :sdks:java:testing:jpms-tests:dataflowRunnerIntegrationTest FAILED
FAILURE: Build failed with an exception.
* What went wrong:
Execution failed for task ':sdks:java:testing:jpms-tests:dataflowRunnerIntegrationTest'.
> There were failing tests. See the report at: file://<https://ci-beam.apache.org/job/beam_PostCommit_Java_Jpms_Dataflow_Java11/ws/src/sdks/java/testing/jpms-tests/build/reports/tests/dataflowRunnerIntegrationTest/index.html>
* Try:
> Run with --stacktrace option to get the stack trace.
> Run with --info or --debug option to get more log output.
* Get more help at https://help.gradle.org
Deprecated Gradle features were used in this build, making it incompatible with Gradle 8.0.
You can use '--warning-mode all' to show the individual deprecation warnings and determine if they come from your own scripts or plugins.
See https://docs.gradle.org/7.5.1/userguide/command_line_interface.html#sec:command_line_warnings
BUILD FAILED in 3h 13m 1s
85 actionable tasks: 52 executed, 31 from cache, 2 up-to-date
Build scan background action failed.
java.lang.IllegalArgumentException: com.gradle.enterprise.gradleplugin.internal.extension.a is not an interface
at java.lang.reflect.Proxy$ProxyBuilder.validateProxyInterfaces(Proxy.java:688)
at java.lang.reflect.Proxy$ProxyBuilder.<init>(Proxy.java:627)
at java.lang.reflect.Proxy.lambda$getProxyConstructor$1(Proxy.java:426)
at jdk.internal.loader.AbstractClassLoaderValue$Memoizer.get(AbstractClassLoaderValue.java:329)
at jdk.internal.loader.AbstractClassLoaderValue.computeIfAbsent(AbstractClassLoaderValue.java:205)
at java.lang.reflect.Proxy.getProxyConstructor(Proxy.java:424)
at java.lang.reflect.Proxy.newProxyInstance(Proxy.java:1006)
at com.gradle.ProxyFactory$ProxyingInvocationHandler.createLocalProxy(ProxyFactory.java:64)
at com.gradle.ProxyFactory$ProxyingInvocationHandler.lambda$adaptActionArg$1(ProxyFactory.java:59)
at com.gradle.enterprise.gradleplugin.internal.extension.b$3.run(SourceFile:100)
at java.util.concurrent.Executors$RunnableAdapter.call(Executors.java:515)
at java.util.concurrent.FutureTask.run(FutureTask.java:264)
at java.util.concurrent.ThreadPoolExecutor.runWorker(ThreadPoolExecutor.java:1128)
at java.util.concurrent.ThreadPoolExecutor$Worker.run(ThreadPoolExecutor.java:628)
at java.lang.Thread.run(Thread.java:829)
Publishing build scan...
https://gradle.com/s/pdbkdcmkhwies
Build step 'Invoke Gradle script' changed build result to FAILURE
Build step 'Invoke Gradle script' marked build as failure
---------------------------------------------------------------------
To unsubscribe, e-mail: builds-unsubscribe@beam.apache.org
For additional commands, e-mail: builds-help@beam.apache.org
beam_PostCommit_Java_Jpms_Dataflow_Java11 - Build # 3678 - Aborted!
Posted by Apache Jenkins Server <je...@builds.apache.org>.
beam_PostCommit_Java_Jpms_Dataflow_Java11 - Build # 3678 - Aborted:
Check console output at https://ci-beam.apache.org/job/beam_PostCommit_Java_Jpms_Dataflow_Java11/3678/ to view the results.
Build failed in Jenkins: beam_PostCommit_Java_Jpms_Dataflow_Java11 #3677
Posted by Apache Jenkins Server <je...@builds.apache.org>.
See <https://ci-beam.apache.org/job/beam_PostCommit_Java_Jpms_Dataflow_Java11/3677/display/redirect>
Changes:
------------------------------------------
[...truncated 2.31 KB...]
[EnvInject] - Variables injected successfully.
[Gradle] - Launching build.
[src] $ <https://ci-beam.apache.org/job/beam_PostCommit_Java_Jpms_Dataflow_Java11/ws/src/gradlew> --continue --max-workers=8 -Dorg.gradle.jvmargs=-Xms2g -Dorg.gradle.jvmargs=-Xmx6g -Dorg.gradle.vfs.watch=false -Pdocker-pull-licenses -Dorg.gradle.java.home=/usr/lib/jvm/java-11-openjdk-amd64 -Pmaven_home=/home/jenkins/tools/maven/apache-maven-3.5.4 :sdks:java:testing:jpms-tests:dataflowRunnerIntegrationTest
To honour the JVM settings for this build a single-use Daemon process will be forked. See https://docs.gradle.org/7.5.1/userguide/gradle_daemon.html#sec:disabling_the_daemon.
Daemon will be stopped at the end of the build
Configuration on demand is an incubating feature.
Gradle Enterprise plugins resolution: https://plugins.gradle.org/m2
Applying com.gradle.CommonCustomUserDataGradlePlugin via init script
> Task :buildSrc:compileJava NO-SOURCE
> Task :buildSrc:compileGroovy FROM-CACHE
> Task :buildSrc:pluginDescriptors
> Task :buildSrc:processResources
> Task :buildSrc:classes
> Task :buildSrc:jar
> Task :buildSrc:assemble
> Task :buildSrc:spotlessGroovy FROM-CACHE
> Task :buildSrc:spotlessGroovyCheck UP-TO-DATE
> Task :buildSrc:spotlessGroovyGradle FROM-CACHE
> Task :buildSrc:spotlessGroovyGradleCheck UP-TO-DATE
> Task :buildSrc:spotlessCheck UP-TO-DATE
> Task :buildSrc:pluginUnderTestMetadata
> Task :buildSrc:compileTestJava NO-SOURCE
> Task :buildSrc:compileTestGroovy NO-SOURCE
> Task :buildSrc:processTestResources NO-SOURCE
> Task :buildSrc:testClasses UP-TO-DATE
> Task :buildSrc:test NO-SOURCE
> Task :buildSrc:validatePlugins FROM-CACHE
> Task :buildSrc:check UP-TO-DATE
> Task :buildSrc:build
> Configure project :sdks:java:container:java8
docker-pull-licenses set, creating go-licenses
> Configure project :sdks:java:container:java11
docker-pull-licenses set, creating go-licenses
> Task :sdks:java:fn-execution:createCheckerFrameworkManifest
> Task :sdks:java:core:createCheckerFrameworkManifest
> Task :model:job-management:createCheckerFrameworkManifest
> Task :sdks:java:extensions:avro:createCheckerFrameworkManifest
> Task :runners:core-construction-java:createCheckerFrameworkManifest
> Task :runners:core-java:createCheckerFrameworkManifest
> Task :model:pipeline:createCheckerFrameworkManifest
> Task :model:fn-execution:createCheckerFrameworkManifest
> Task :sdks:java:extensions:avro:generateAvroProtocol NO-SOURCE
> Task :sdks:java:fn-execution:processResources NO-SOURCE
> Task :sdks:java:core:generateAvroProtocol NO-SOURCE
> Task :runners:core-java:processResources NO-SOURCE
> Task :runners:core-construction-java:processResources NO-SOURCE
> Task :sdks:java:extensions:avro:generateAvroJava NO-SOURCE
> Task :sdks:java:core:generateAvroJava NO-SOURCE
> Task :sdks:java:extensions:avro:processResources NO-SOURCE
> Task :model:fn-execution:extractProto
> Task :model:job-management:extractProto
> Task :sdks:java:extensions:google-cloud-platform-core:createCheckerFrameworkManifest
> Task :sdks:java:extensions:google-cloud-platform-core:processResources NO-SOURCE
> Task :runners:google-cloud-dataflow-java:createCheckerFrameworkManifest
> Task :runners:java-fn-execution:createCheckerFrameworkManifest
> Task :sdks:java:testing:jpms-tests:createCheckerFrameworkManifest
> Task :sdks:java:testing:jpms-tests:processResources NO-SOURCE
> Task :runners:java-fn-execution:processResources NO-SOURCE
> Task :sdks:java:harness:createCheckerFrameworkManifest
> Task :model:job-management:processResources
> Task :sdks:java:core:generateGrammarSource FROM-CACHE
> Task :sdks:java:expansion-service:createCheckerFrameworkManifest
> Task :sdks:java:testing:jpms-tests:processTestResources NO-SOURCE
> Task :model:fn-execution:processResources
> Task :sdks:java:harness:processResources NO-SOURCE
> Task :sdks:java:extensions:arrow:createCheckerFrameworkManifest
> Task :sdks:java:expansion-service:processResources NO-SOURCE
> Task :sdks:java:io:kafka:createCheckerFrameworkManifest
> Task :sdks:java:extensions:protobuf:createCheckerFrameworkManifest
> Task :sdks:java:io:kafka:processResources NO-SOURCE
> Task :sdks:java:extensions:arrow:processResources NO-SOURCE
> Task :sdks:java:io:google-cloud-platform:createCheckerFrameworkManifest
> Task :sdks:java:extensions:protobuf:extractProto
> Task :sdks:java:io:google-cloud-platform:processResources NO-SOURCE
> Task :sdks:java:extensions:protobuf:processResources NO-SOURCE
> Task :runners:google-cloud-dataflow-java:processResources
> Task :sdks:java:core:processResources
> Task :model:pipeline:extractIncludeProto
> Task :model:pipeline:extractProto
> Task :model:pipeline:generateProto FROM-CACHE
> Task :model:pipeline:compileJava FROM-CACHE
> Task :model:pipeline:processResources
> Task :model:pipeline:classes
> Task :model:pipeline:jar
> Task :model:pipeline:shadowJar FROM-CACHE
> Task :model:job-management:extractIncludeProto
> Task :model:fn-execution:extractIncludeProto
> Task :model:job-management:generateProto FROM-CACHE
> Task :model:fn-execution:generateProto FROM-CACHE
> Task :model:job-management:compileJava FROM-CACHE
> Task :model:job-management:classes
> Task :model:fn-execution:compileJava FROM-CACHE
> Task :model:fn-execution:classes
> Task :model:job-management:shadowJar FROM-CACHE
> Task :model:fn-execution:shadowJar FROM-CACHE
> Task :sdks:java:core:compileJava FROM-CACHE
> Task :sdks:java:core:classes
> Task :sdks:java:core:shadowJar FROM-CACHE
> Task :sdks:java:extensions:avro:compileJava FROM-CACHE
> Task :sdks:java:extensions:avro:classes UP-TO-DATE
> Task :sdks:java:extensions:avro:jar
> Task :sdks:java:fn-execution:compileJava FROM-CACHE
> Task :sdks:java:fn-execution:classes UP-TO-DATE
> Task :sdks:java:fn-execution:jar
> Task :sdks:java:extensions:protobuf:extractIncludeProto
> Task :sdks:java:extensions:protobuf:generateProto NO-SOURCE
> Task :sdks:java:extensions:arrow:compileJava
> Task :sdks:java:extensions:arrow:classes
> Task :sdks:java:extensions:arrow:jar
> Task :sdks:java:extensions:protobuf:compileJava
Note: Some input files use or override a deprecated API.
Note: Recompile with -Xlint:deprecation for details.
Note: Some input files use unchecked or unsafe operations.
Note: Recompile with -Xlint:unchecked for details.
> Task :sdks:java:extensions:protobuf:classes
> Task :sdks:java:extensions:protobuf:jar
> Task :runners:core-construction-java:compileJava
Note: Some input files use or override a deprecated API.
Note: Recompile with -Xlint:deprecation for details.
Note: Some input files use unchecked or unsafe operations.
Note: Recompile with -Xlint:unchecked for details.
> Task :runners:core-construction-java:classes
> Task :runners:core-construction-java:jar
> Task :runners:core-java:compileJava
Note: Some input files use or override a deprecated API.
Note: Recompile with -Xlint:deprecation for details.
Note: Some input files use unchecked or unsafe operations.
Note: Recompile with -Xlint:unchecked for details.
> Task :runners:core-java:classes
> Task :runners:core-java:jar
> Task :sdks:java:extensions:google-cloud-platform-core:compileJava FROM-CACHE
> Task :sdks:java:extensions:google-cloud-platform-core:classes UP-TO-DATE
> Task :sdks:java:extensions:google-cloud-platform-core:jar
> Task :sdks:java:testing:jpms-tests:compileJava FROM-CACHE
> Task :sdks:java:testing:jpms-tests:classes UP-TO-DATE
> Task :sdks:java:testing:jpms-tests:jar
> Task :sdks:java:testing:jpms-tests:compileTestJava FROM-CACHE
> Task :sdks:java:testing:jpms-tests:testClasses UP-TO-DATE
> Task :sdks:java:testing:jpms-tests:testJar
> Task :sdks:java:harness:compileJava
Note: Some input files use or override a deprecated API.
Note: Recompile with -Xlint:deprecation for details.
Note: Some input files use unchecked or unsafe operations.
Note: Recompile with -Xlint:unchecked for details.
> Task :sdks:java:harness:classes
> Task :sdks:java:harness:jar
> Task :runners:java-fn-execution:compileJava
Note: <https://ci-beam.apache.org/job/beam_PostCommit_Java_Jpms_Dataflow_Java11/ws/src/runners/java-fn-execution/src/main/java/org/apache/beam/runners/fnexecution/wire/ByteStringCoder.java> uses or overrides a deprecated API.
Note: Recompile with -Xlint:deprecation for details.
Note: Some input files use unchecked or unsafe operations.
Note: Recompile with -Xlint:unchecked for details.
> Task :runners:java-fn-execution:classes
> Task :runners:java-fn-execution:jar
> Task :sdks:java:expansion-service:compileJava
Note: Some input files use unchecked or unsafe operations.
Note: Recompile with -Xlint:unchecked for details.
> Task :sdks:java:expansion-service:classes
> Task :sdks:java:expansion-service:jar
> Task :sdks:java:io:kafka:compileJava
Note: Some input files use or override a deprecated API.
Note: Recompile with -Xlint:deprecation for details.
Note: Some input files use unchecked or unsafe operations.
Note: Recompile with -Xlint:unchecked for details.
> Task :sdks:java:io:kafka:classes
> Task :sdks:java:io:kafka:jar
> Task :sdks:java:io:google-cloud-platform:compileJava
Note: Some input files use or override a deprecated API.
Note: Recompile with -Xlint:deprecation for details.
Note: Some input files use unchecked or unsafe operations.
Note: Recompile with -Xlint:unchecked for details.
> Task :sdks:java:io:google-cloud-platform:classes
> Task :sdks:java:io:google-cloud-platform:jar
> Task :runners:google-cloud-dataflow-java:compileJava
Note: Some input files use or override a deprecated API.
Note: Recompile with -Xlint:deprecation for details.
Note: Some input files use unchecked or unsafe operations.
Note: Recompile with -Xlint:unchecked for details.
> Task :runners:google-cloud-dataflow-java:classes
> Task :runners:google-cloud-dataflow-java:jar
> Task :sdks:java:testing:jpms-tests:dataflowRunnerIntegrationTest
org.apache.beam.sdk.jpmstests.JpmsIT > testE2EJpms FAILED
java.lang.RuntimeException at JpmsIT.java:63
1 test completed, 1 failed
> Task :sdks:java:testing:jpms-tests:dataflowRunnerIntegrationTest FAILED
FAILURE: Build failed with an exception.
* What went wrong:
Execution failed for task ':sdks:java:testing:jpms-tests:dataflowRunnerIntegrationTest'.
> There were failing tests. See the report at: file://<https://ci-beam.apache.org/job/beam_PostCommit_Java_Jpms_Dataflow_Java11/ws/src/sdks/java/testing/jpms-tests/build/reports/tests/dataflowRunnerIntegrationTest/index.html>
* Try:
> Run with --stacktrace option to get the stack trace.
> Run with --info or --debug option to get more log output.
* Get more help at https://help.gradle.org
Deprecated Gradle features were used in this build, making it incompatible with Gradle 8.0.
You can use '--warning-mode all' to show the individual deprecation warnings and determine if they come from your own scripts or plugins.
See https://docs.gradle.org/7.5.1/userguide/command_line_interface.html#sec:command_line_warnings
BUILD FAILED in 3h 12m 59s
85 actionable tasks: 62 executed, 21 from cache, 2 up-to-date
Build scan background action failed.
java.lang.IllegalArgumentException: com.gradle.enterprise.gradleplugin.internal.extension.a is not an interface
at java.lang.reflect.Proxy$ProxyBuilder.validateProxyInterfaces(Proxy.java:688)
at java.lang.reflect.Proxy$ProxyBuilder.<init>(Proxy.java:627)
at java.lang.reflect.Proxy.lambda$getProxyConstructor$1(Proxy.java:426)
at jdk.internal.loader.AbstractClassLoaderValue$Memoizer.get(AbstractClassLoaderValue.java:329)
at jdk.internal.loader.AbstractClassLoaderValue.computeIfAbsent(AbstractClassLoaderValue.java:205)
at java.lang.reflect.Proxy.getProxyConstructor(Proxy.java:424)
at java.lang.reflect.Proxy.newProxyInstance(Proxy.java:1006)
at com.gradle.ProxyFactory$ProxyingInvocationHandler.createLocalProxy(ProxyFactory.java:64)
at com.gradle.ProxyFactory$ProxyingInvocationHandler.lambda$adaptActionArg$1(ProxyFactory.java:59)
at com.gradle.enterprise.gradleplugin.internal.extension.b$3.run(SourceFile:100)
at java.util.concurrent.Executors$RunnableAdapter.call(Executors.java:515)
at java.util.concurrent.FutureTask.run(FutureTask.java:264)
at java.util.concurrent.ThreadPoolExecutor.runWorker(ThreadPoolExecutor.java:1128)
at java.util.concurrent.ThreadPoolExecutor$Worker.run(ThreadPoolExecutor.java:628)
at java.lang.Thread.run(Thread.java:829)
Publishing build scan...
https://gradle.com/s/sbxmepwevjcau
Build step 'Invoke Gradle script' changed build result to FAILURE
Build step 'Invoke Gradle script' marked build as failure
---------------------------------------------------------------------
To unsubscribe, e-mail: builds-unsubscribe@beam.apache.org
For additional commands, e-mail: builds-help@beam.apache.org
beam_PostCommit_Java_Jpms_Dataflow_Java11 - Build # 3676 - Aborted!
Posted by Apache Jenkins Server <je...@builds.apache.org>.
beam_PostCommit_Java_Jpms_Dataflow_Java11 - Build # 3676 - Aborted:
Check console output at https://ci-beam.apache.org/job/beam_PostCommit_Java_Jpms_Dataflow_Java11/3676/ to view the results.