You are viewing a plain text version of this content. The canonical link for it is here.
Posted to builds@solr.apache.org by Policeman Jenkins Server <je...@thetaphi.de> on 2022/02/10 23:54:22 UTC

[JENKINS-EA] Solr-main-Linux (64bit/jdk-18-ea+29) - Build # 2891 - Unstable!

Build: https://jenkins.thetaphi.de/job/Solr-main-Linux/2891/
Java: 64bit/jdk-18-ea+29 -XX:+UseCompressedOops -XX:+UseParallelGC

2 tests failed.
FAILED:  org.apache.solr.schema.TestBulkSchemaConcurrent.classMethod

Error Message:
com.carrotsearch.randomizedtesting.ThreadLeakError: 2 threads leaked from SUITE scope at org.apache.solr.schema.TestBulkSchemaConcurrent: 
   1) Thread[id=15289, name=ZKEventListenerThread, state=TIMED_WAITING, group=TGRP-TestBulkSchemaConcurrent]
        at java.base@18-ea/java.lang.Thread.sleep(Native Method)
        at app//org.apache.solr.common.cloud.ZkCmdExecutor.retryDelay(ZkCmdExecutor.java:156)
        at app//org.apache.solr.common.cloud.ZkCmdExecutor.retryOperation(ZkCmdExecutor.java:89)
        at app//org.apache.solr.common.cloud.SolrZkClient.exists(SolrZkClient.java:294)
        at app//org.apache.solr.cloud.ZkController.setConfWatcher(ZkController.java:2513)
        at app//org.apache.solr.cloud.ZkController.getConfDirListeners(ZkController.java:2437)
        at app//org.apache.solr.cloud.ZkController.registerConfListenerForCore(ZkController.java:2418)
        at app//org.apache.solr.core.SolrCore.registerConfListener(SolrCore.java:3088)
        at app//org.apache.solr.core.SolrCore.<init>(SolrCore.java:1087)
        at app//org.apache.solr.core.SolrCore.reload(SolrCore.java:744)
        at app//org.apache.solr.core.CoreContainer.reload(CoreContainer.java:1705)
        at app//org.apache.solr.core.SolrCore.lambda$getConfListener$21(SolrCore.java:3134)
        at app//org.apache.solr.core.SolrCore$$Lambda$1052/0x00000008014608a0.run(Unknown Source)
        at app//org.apache.solr.cloud.ZkController.lambda$fireEventListeners$18(ZkController.java:2499)
        at app//org.apache.solr.cloud.ZkController$$Lambda$1569/0x000000080173fa38.run(Unknown Source)
        at java.base@18-ea/java.lang.Thread.run(Thread.java:833)
   2) Thread[id=15353, name=searcherExecutor-10162-thread-1-processing-127.0.0.1:35789_oel%2Fw, state=WAITING, group=TGRP-TestBulkSchemaConcurrent]
        at java.base@18-ea/jdk.internal.misc.Unsafe.park(Native Method)
        at java.base@18-ea/java.util.concurrent.locks.LockSupport.park(LockSupport.java:211)
        at java.base@18-ea/java.util.concurrent.locks.AbstractQueuedSynchronizer.acquire(AbstractQueuedSynchronizer.java:715)
        at java.base@18-ea/java.util.concurrent.locks.AbstractQueuedSynchronizer.acquireSharedInterruptibly(AbstractQueuedSynchronizer.java:1047)
        at java.base@18-ea/java.util.concurrent.CountDownLatch.await(CountDownLatch.java:230)
        at app//org.apache.solr.core.SolrCore.lambda$new$2(SolrCore.java:1048)
        at app//org.apache.solr.core.SolrCore$$Lambda$439/0x0000000801168d00.call(Unknown Source)
        at java.base@18-ea/java.util.concurrent.FutureTask.run(FutureTask.java:264)
        at app//org.apache.solr.common.util.ExecutorUtil$MDCAwareThreadPoolExecutor.lambda$execute$0(ExecutorUtil.java:235)
        at app//org.apache.solr.common.util.ExecutorUtil$MDCAwareThreadPoolExecutor$$Lambda$298/0x000000080100e260.run(Unknown Source)
        at java.base@18-ea/java.util.concurrent.ThreadPoolExecutor.runWorker(ThreadPoolExecutor.java:1136)
        at java.base@18-ea/java.util.concurrent.ThreadPoolExecutor$Worker.run(ThreadPoolExecutor.java:635)
        at java.base@18-ea/java.lang.Thread.run(Thread.java:833)

Stack Trace:
com.carrotsearch.randomizedtesting.ThreadLeakError: 2 threads leaked from SUITE scope at org.apache.solr.schema.TestBulkSchemaConcurrent: 
   1) Thread[id=15289, name=ZKEventListenerThread, state=TIMED_WAITING, group=TGRP-TestBulkSchemaConcurrent]
        at java.base@18-ea/java.lang.Thread.sleep(Native Method)
        at app//org.apache.solr.common.cloud.ZkCmdExecutor.retryDelay(ZkCmdExecutor.java:156)
        at app//org.apache.solr.common.cloud.ZkCmdExecutor.retryOperation(ZkCmdExecutor.java:89)
        at app//org.apache.solr.common.cloud.SolrZkClient.exists(SolrZkClient.java:294)
        at app//org.apache.solr.cloud.ZkController.setConfWatcher(ZkController.java:2513)
        at app//org.apache.solr.cloud.ZkController.getConfDirListeners(ZkController.java:2437)
        at app//org.apache.solr.cloud.ZkController.registerConfListenerForCore(ZkController.java:2418)
        at app//org.apache.solr.core.SolrCore.registerConfListener(SolrCore.java:3088)
        at app//org.apache.solr.core.SolrCore.<init>(SolrCore.java:1087)
        at app//org.apache.solr.core.SolrCore.reload(SolrCore.java:744)
        at app//org.apache.solr.core.CoreContainer.reload(CoreContainer.java:1705)
        at app//org.apache.solr.core.SolrCore.lambda$getConfListener$21(SolrCore.java:3134)
        at app//org.apache.solr.core.SolrCore$$Lambda$1052/0x00000008014608a0.run(Unknown Source)
        at app//org.apache.solr.cloud.ZkController.lambda$fireEventListeners$18(ZkController.java:2499)
        at app//org.apache.solr.cloud.ZkController$$Lambda$1569/0x000000080173fa38.run(Unknown Source)
        at java.base@18-ea/java.lang.Thread.run(Thread.java:833)
   2) Thread[id=15353, name=searcherExecutor-10162-thread-1-processing-127.0.0.1:35789_oel%2Fw, state=WAITING, group=TGRP-TestBulkSchemaConcurrent]
        at java.base@18-ea/jdk.internal.misc.Unsafe.park(Native Method)
        at java.base@18-ea/java.util.concurrent.locks.LockSupport.park(LockSupport.java:211)
        at java.base@18-ea/java.util.concurrent.locks.AbstractQueuedSynchronizer.acquire(AbstractQueuedSynchronizer.java:715)
        at java.base@18-ea/java.util.concurrent.locks.AbstractQueuedSynchronizer.acquireSharedInterruptibly(AbstractQueuedSynchronizer.java:1047)
        at java.base@18-ea/java.util.concurrent.CountDownLatch.await(CountDownLatch.java:230)
        at app//org.apache.solr.core.SolrCore.lambda$new$2(SolrCore.java:1048)
        at app//org.apache.solr.core.SolrCore$$Lambda$439/0x0000000801168d00.call(Unknown Source)
        at java.base@18-ea/java.util.concurrent.FutureTask.run(FutureTask.java:264)
        at app//org.apache.solr.common.util.ExecutorUtil$MDCAwareThreadPoolExecutor.lambda$execute$0(ExecutorUtil.java:235)
        at app//org.apache.solr.common.util.ExecutorUtil$MDCAwareThreadPoolExecutor$$Lambda$298/0x000000080100e260.run(Unknown Source)
        at java.base@18-ea/java.util.concurrent.ThreadPoolExecutor.runWorker(ThreadPoolExecutor.java:1136)
        at java.base@18-ea/java.util.concurrent.ThreadPoolExecutor$Worker.run(ThreadPoolExecutor.java:635)
        at java.base@18-ea/java.lang.Thread.run(Thread.java:833)
	at __randomizedtesting.SeedInfo.seed([BCFED5BDA9560431]:0)


FAILED:  org.apache.solr.search.facet.TestCloudJSONFacetSKGEquiv.testRandom

Error Message:
java.lang.AssertionError: rows=0&q=(field_11_multi_sdsS:31+OR+field_7_multi_sds:28+OR+field_1_multi_sds:39)&fore=(field_8_multi_sdsS:24+OR+field_0_multi_ss:28+OR+field_4_multi_sds:28)&back=(field_4_multi_sds:39+OR+field_0_multi_ss:11+OR+field_6_multi_ss:11+OR+field_11_multi_sdsS:23+OR+field_2_multi_sdsS:39+OR+field_14_multi_sdsS:44+OR+field_12_multi_ss:23+OR+field_1_multi_sds:7)&json.facet={"facet_1":{"method":"${method_val:smart}","limit":-1,"overrequest":1,"perSeg":false,"sort":"index+asc","refine":false,"type":"terms","field":"field_4_multi_ids","facet":{"skg":{"type":"func","func":"relatedness($fore,$back)","${sweep_key:xxx}":"${sweep_val:yyy}"},"facet_2":{"method":"${method_val:smart}","overrequest":0,"allBuckets":false,"refine":false,"type":"terms","field":"field_3_solo_i","facet":{"skg":{"type":"func","func":"relatedness($fore,$back)","${sweep_key:xxx}":"${sweep_val:yyy}"},"skg0":{"min_popularity":"0.001","type":"func","func":"relatedness($fore,$back)","${sweep_key:xxx}":"${sweep_val:yyy}"},"skg1":{"type":"func","func":"relatedness($fore,$back)","${sweep_key:xxx}":"${sweep_val:yyy}"}}}}},"facet_3":{"method":"${method_val:smart}","limit":1,"overrequest":0,"perSeg":true,"sort":"index+asc","allBuckets":true,"refine":true,"type":"terms","field":"field_7_multi_sds","facet":{"skg":{"type":"func","func":"relatedness($fore,$back)","${sweep_key:xxx}":"${sweep_val:yyy}"}}}} ===> Mismatch: .facet_1.buckets.length:47!=0 using method_val=enum&sweep_key=sweep_collection&sweep_val=true

Stack Trace:
java.lang.AssertionError: rows=0&q=(field_11_multi_sdsS:31+OR+field_7_multi_sds:28+OR+field_1_multi_sds:39)&fore=(field_8_multi_sdsS:24+OR+field_0_multi_ss:28+OR+field_4_multi_sds:28)&back=(field_4_multi_sds:39+OR+field_0_multi_ss:11+OR+field_6_multi_ss:11+OR+field_11_multi_sdsS:23+OR+field_2_multi_sdsS:39+OR+field_14_multi_sdsS:44+OR+field_12_multi_ss:23+OR+field_1_multi_sds:7)&json.facet={"facet_1":{"method":"${method_val:smart}","limit":-1,"overrequest":1,"perSeg":false,"sort":"index+asc","refine":false,"type":"terms","field":"field_4_multi_ids","facet":{"skg":{"type":"func","func":"relatedness($fore,$back)","${sweep_key:xxx}":"${sweep_val:yyy}"},"facet_2":{"method":"${method_val:smart}","overrequest":0,"allBuckets":false,"refine":false,"type":"terms","field":"field_3_solo_i","facet":{"skg":{"type":"func","func":"relatedness($fore,$back)","${sweep_key:xxx}":"${sweep_val:yyy}"},"skg0":{"min_popularity":"0.001","type":"func","func":"relatedness($fore,$back)","${sweep_key:xxx}":"${sweep_val:yyy}"},"skg1":{"type":"func","func":"relatedness($fore,$back)","${sweep_key:xxx}":"${sweep_val:yyy}"}}}}},"facet_3":{"method":"${method_val:smart}","limit":1,"overrequest":0,"perSeg":true,"sort":"index+asc","allBuckets":true,"refine":true,"type":"terms","field":"field_7_multi_sds","facet":{"skg":{"type":"func","func":"relatedness($fore,$back)","${sweep_key:xxx}":"${sweep_val:yyy}"}}}} ===> Mismatch: .facet_1.buckets.length:47!=0 using method_val=enum&sweep_key=sweep_collection&sweep_val=true
	at __randomizedtesting.SeedInfo.seed([BCFED5BDA9560431:CEB2F0B21836B242]:0)
	at org.apache.solr.search.facet.TestCloudJSONFacetSKGEquiv.assertFacetSKGsAreConsistent(TestCloudJSONFacetSKGEquiv.java:757)
	at org.apache.solr.search.facet.TestCloudJSONFacetSKGEquiv.testRandom(TestCloudJSONFacetSKGEquiv.java:673)
	at java.base/jdk.internal.reflect.DirectMethodHandleAccessor.invoke(DirectMethodHandleAccessor.java:104)
	at java.base/java.lang.reflect.Method.invoke(Method.java:577)
	at com.carrotsearch.randomizedtesting.RandomizedRunner.invoke(RandomizedRunner.java:1754)
	at com.carrotsearch.randomizedtesting.RandomizedRunner$8.evaluate(RandomizedRunner.java:942)
	at com.carrotsearch.randomizedtesting.RandomizedRunner$9.evaluate(RandomizedRunner.java:978)
	at com.carrotsearch.randomizedtesting.RandomizedRunner$10.evaluate(RandomizedRunner.java:992)
	at com.carrotsearch.randomizedtesting.rules.SystemPropertiesRestoreRule$1.evaluate(SystemPropertiesRestoreRule.java:57)
	at org.junit.rules.RunRules.evaluate(RunRules.java:20)
	at org.apache.lucene.util.TestRuleSetupTeardownChained$1.evaluate(TestRuleSetupTeardownChained.java:44)
	at org.apache.lucene.util.AbstractBeforeAfterRule$1.evaluate(AbstractBeforeAfterRule.java:43)
	at org.apache.lucene.util.TestRuleThreadAndTestName$1.evaluate(TestRuleThreadAndTestName.java:45)
	at org.apache.lucene.util.TestRuleIgnoreAfterMaxFailures$1.evaluate(TestRuleIgnoreAfterMaxFailures.java:60)
	at org.apache.lucene.util.TestRuleMarkFailure$1.evaluate(TestRuleMarkFailure.java:44)
	at org.junit.rules.RunRules.evaluate(RunRules.java:20)
	at com.carrotsearch.randomizedtesting.rules.StatementAdapter.evaluate(StatementAdapter.java:36)
	at com.carrotsearch.randomizedtesting.ThreadLeakControl$StatementRunner.run(ThreadLeakControl.java:370)
	at com.carrotsearch.randomizedtesting.ThreadLeakControl.forkTimeoutingTask(ThreadLeakControl.java:819)
	at com.carrotsearch.randomizedtesting.ThreadLeakControl$3.evaluate(ThreadLeakControl.java:470)
	at com.carrotsearch.randomizedtesting.RandomizedRunner.runSingleTest(RandomizedRunner.java:951)
	at com.carrotsearch.randomizedtesting.RandomizedRunner$5.evaluate(RandomizedRunner.java:836)
	at com.carrotsearch.randomizedtesting.RandomizedRunner$6.evaluate(RandomizedRunner.java:887)
	at com.carrotsearch.randomizedtesting.RandomizedRunner$7.evaluate(RandomizedRunner.java:898)
	at com.carrotsearch.randomizedtesting.rules.StatementAdapter.evaluate(StatementAdapter.java:36)
	at org.apache.lucene.util.AbstractBeforeAfterRule$1.evaluate(AbstractBeforeAfterRule.java:43)
	at org.apache.lucene.util.AbstractBeforeAfterRule$1.evaluate(AbstractBeforeAfterRule.java:43)
	at com.carrotsearch.randomizedtesting.rules.SystemPropertiesRestoreRule$1.evaluate(SystemPropertiesRestoreRule.java:57)
	at org.junit.rules.RunRules.evaluate(RunRules.java:20)
	at org.apache.lucene.util.AbstractBeforeAfterRule$1.evaluate(AbstractBeforeAfterRule.java:43)
	at com.carrotsearch.randomizedtesting.rules.StatementAdapter.evaluate(StatementAdapter.java:36)
	at org.apache.lucene.util.TestRuleStoreClassName$1.evaluate(TestRuleStoreClassName.java:38)
	at com.carrotsearch.randomizedtesting.rules.NoShadowingOrOverridesOnMethodsRule$1.evaluate(NoShadowingOrOverridesOnMethodsRule.java:40)
	at com.carrotsearch.randomizedtesting.rules.NoShadowingOrOverridesOnMethodsRule$1.evaluate(NoShadowingOrOverridesOnMethodsRule.java:40)
	at com.carrotsearch.randomizedtesting.rules.StatementAdapter.evaluate(StatementAdapter.java:36)
	at com.carrotsearch.randomizedtesting.rules.StatementAdapter.evaluate(StatementAdapter.java:36)
	at org.apache.lucene.util.TestRuleAssertionsRequired$1.evaluate(TestRuleAssertionsRequired.java:53)
	at org.apache.lucene.util.AbstractBeforeAfterRule$1.evaluate(AbstractBeforeAfterRule.java:43)
	at org.apache.lucene.util.TestRuleMarkFailure$1.evaluate(TestRuleMarkFailure.java:44)
	at org.apache.lucene.util.TestRuleIgnoreAfterMaxFailures$1.evaluate(TestRuleIgnoreAfterMaxFailures.java:60)
	at org.apache.lucene.util.TestRuleIgnoreTestSuites$1.evaluate(TestRuleIgnoreTestSuites.java:47)
	at org.junit.rules.RunRules.evaluate(RunRules.java:20)
	at com.carrotsearch.randomizedtesting.rules.StatementAdapter.evaluate(StatementAdapter.java:36)
	at com.carrotsearch.randomizedtesting.ThreadLeakControl$StatementRunner.run(ThreadLeakControl.java:370)
	at com.carrotsearch.randomizedtesting.ThreadLeakControl.lambda$forkTimeoutingTask$0(ThreadLeakControl.java:826)
	at java.base/java.lang.Thread.run(Thread.java:833)
Caused by: java.lang.AssertionError: Mismatch: .facet_1.buckets.length:47!=0 using method_val=enum&sweep_key=sweep_collection&sweep_val=true
	at org.junit.Assert.fail(Assert.java:89)
	at org.apache.solr.search.facet.TestCloudJSONFacetSKGEquiv.assertFacetSKGsAreConsistent(TestCloudJSONFacetSKGEquiv.java:752)
	... 45 more