You are viewing a plain text version of this content. The canonical link for it is here.
Posted to dev@lucene.apache.org by Apache Jenkins Server <je...@builds.apache.org> on 2019/06/16 16:54:48 UTC

[JENKINS-MAVEN] Lucene-Solr-Maven-8.x #128: POMs out of sync

Build: https://builds.apache.org/job/Lucene-Solr-Maven-8.x/128/

No tests ran.

Build Log:
[...truncated 33497 lines...]
      [mvn] [INFO] -------------------------------------------------------------
      [mvn] [INFO] -------------------------------------------------------------
      [mvn] [ERROR] COMPILATION ERROR : 
      [mvn] [INFO] -------------------------------------------------------------

[...truncated 877 lines...]
BUILD FAILED
/x1/jenkins/jenkins-slave/workspace/Lucene-Solr-Maven-8.x/build.xml:680: The following error occurred while executing this line:
: Java returned: 1

Total time: 18 minutes 38 seconds
Build step 'Invoke Ant' marked build as failure
Email was triggered for: Failure - Any
Sending email for trigger: Failure - Any

[JENKINS-MAVEN] Lucene-Solr-Maven-8.x #129: POMs out of sync

Posted by Apache Jenkins Server <je...@builds.apache.org>.
Build: https://builds.apache.org/job/Lucene-Solr-Maven-8.x/129/

No tests ran.

Build Log:
[...truncated 33497 lines...]
      [mvn] [INFO] -------------------------------------------------------------
      [mvn] [INFO] -------------------------------------------------------------
      [mvn] [ERROR] COMPILATION ERROR : 
      [mvn] [INFO] -------------------------------------------------------------

[...truncated 877 lines...]
BUILD FAILED
/x1/jenkins/jenkins-slave/workspace/Lucene-Solr-Maven-8.x/build.xml:680: The following error occurred while executing this line:
: Java returned: 1

Total time: 18 minutes 25 seconds
Build step 'Invoke Ant' marked build as failure
Email was triggered for: Failure - Any
Sending email for trigger: Failure - Any