You are viewing a plain text version of this content. The canonical link for it is here.
Posted to builds@beam.apache.org by Apache Jenkins Server <je...@builds.apache.org> on 2022/08/10 17:32:31 UTC
Build failed in Jenkins: beam_PostCommit_XVR_PythonUsingJava_Dataflow #775
See <https://ci-beam.apache.org/job/beam_PostCommit_XVR_PythonUsingJava_Dataflow/775/display/redirect?page=changes>
Changes:
[bulat.safiullin] [Website] update contribution content collapse
[noreply] Improve exception when requested error tag does not exist (#22401)
[noreply] Reimplement Pub/Sub Lite's I/O using UnboundedSource. (#22612)
[noreply] Clean up checkstyle suppressions.xml (#22649)
------------------------------------------
[...truncated 978.33 KB...]
packaging==21.3
pandas==1.4.3
parameterized==0.8.1
pbr==5.9.0
pip==22.2.2
pluggy==1.0.0
proto-plus==1.20.6
protobuf==3.19.4
psycopg2-binary==2.9.3
py==1.11.0
pyarrow==7.0.0
pyasn1==0.4.8
pyasn1-modules==0.2.8
pycparser==2.21
pydot==1.4.2
PyHamcrest==1.10.1
pymongo==3.12.3
PyMySQL==1.0.2
pyparsing==3.0.9
pytest==7.1.2
pytest-forked==1.4.0
pytest-timeout==2.1.0
pytest-xdist==2.5.0
python-dateutil==2.8.2
python-snappy==0.6.1
pytz==2022.1
PyYAML==6.0
regex==2022.7.25
requests==2.28.1
requests-mock==1.9.3
requests-oauthlib==1.3.1
rsa==4.9
scikit-learn==1.1.1
scipy==1.9.0
setuptools==63.4.2
six==1.16.0
soupsieve==2.3.2.post1
SQLAlchemy==1.4.39
tenacity==5.1.5
tensorboard==2.9.1
tensorboard-data-server==0.6.1
tensorboard-plugin-wit==1.8.1
tensorflow==2.9.1
tensorflow-estimator==2.9.0
tensorflow-io-gcs-filesystem==0.26.0
termcolor==1.1.0
testcontainers==3.6.0
threadpoolctl==3.1.0
tomli==2.0.1
tqdm==4.64.0
typing-utils==0.1.0
typing_extensions==4.3.0
uritemplate==4.1.1
urllib3==1.26.11
websocket-client==1.3.3
Werkzeug==2.2.1
wheel==0.37.1
wrapt==1.14.1
zipp==3.8.1
zstandard==0.18.0
Removing intermediate container 39d6ad7d2ed1
---> 5d1ced90beee
Step 17/32 : COPY target/LICENSE /opt/apache/beam/
---> 912d862c83c8
Step 18/32 : COPY target/LICENSE.python /opt/apache/beam/
---> 1fa7ac2f4775
Step 19/32 : COPY target/NOTICE /opt/apache/beam/
---> 8156bba2fbf9
Step 20/32 : COPY target/launcher/linux_amd64/boot /opt/apache/beam/
---> e1cc43628157
Step 21/32 : ENTRYPOINT ["/opt/apache/beam/boot"]
---> Running in d80839e79489
Removing intermediate container d80839e79489
---> 02311d0ae3e4
Step 22/32 : FROM beam as third_party_licenses
---> 02311d0ae3e4
Step 23/32 : ARG pull_licenses
---> Running in f3180902be5f
Removing intermediate container f3180902be5f
---> 909a0d90c729
Step 24/32 : COPY target/license_scripts /tmp/license_scripts/
---> 5a91f9360122
Step 25/32 : COPY target/LICENSE target/go-licenses/* /opt/apache/beam/third_party_licenses/golang/
---> 6e6cbc55c066
Step 26/32 : RUN rm /opt/apache/beam/third_party_licenses/golang/LICENSE
---> Running in d2c7c8ce6e8a
Removing intermediate container d2c7c8ce6e8a
---> b76f1b3705e9
Step 27/32 : COPY target/license_scripts /tmp/license_scripts/
---> 69d74f5fdbc2
Step 28/32 : RUN if [ "$pull_licenses" = "true" ] ; then pip install 'pip-licenses<4.0.0' pyyaml tenacity && python /tmp/license_scripts/pull_licenses_py.py ; fi
---> Running in 0b402333d3f8
Collecting pip-licenses<4.0.0
Downloading pip_licenses-3.5.4-py3-none-any.whl (17 kB)
Requirement already satisfied: pyyaml in /usr/local/lib/python3.9/site-packages (6.0)
Requirement already satisfied: tenacity in /usr/local/lib/python3.9/site-packages (5.1.5)
Collecting PTable
Downloading PTable-0.9.2.tar.gz (31 kB)
Preparing metadata (setup.py): started
Preparing metadata (setup.py): finished with status 'done'
Requirement already satisfied: six>=1.9.0 in /usr/local/lib/python3.9/site-packages (from tenacity) (1.16.0)
Building wheels for collected packages: PTable
Building wheel for PTable (setup.py): started
Building wheel for PTable (setup.py): finished with status 'done'
Created wheel for PTable: filename=PTable-0.9.2-py3-none-any.whl size=22908 sha256=9fda7c427041f4749611ecc5c438e55767c6370c875978e09a837746f1a84e84
Stored in directory: /root/.cache/pip/wheels/b8/d5/8b/e0c9765594e0dc8093aae5f67eacc08b9b533da598c710b54a
Successfully built PTable
Installing collected packages: PTable, pip-licenses
Successfully installed PTable-0.9.2 pip-licenses-3.5.4
[91mWARNING: Running pip as the 'root' user can result in broken permissions and conflicting behaviour with the system package manager. It is recommended to use a virtual environment instead: https://pip.pypa.io/warnings/venv
[0m[91mINFO:root:Successfully pulled licenses for 135 dependencies
[0mSkip pulling license for bs4
Removing intermediate container 0b402333d3f8
---> 387475607583
Step 29/32 : FROM beam
---> 02311d0ae3e4
Step 30/32 : ARG pull_licenses
---> Running in f9e2b25e6235
Removing intermediate container f9e2b25e6235
---> a508a6016afa
Step 31/32 : COPY --from=third_party_licenses /opt/apache/beam/third_party_licenses /opt/apache/beam/third_party_licenses
---> ca37ebc82884
Step 32/32 : RUN if [ "$pull_licenses" != "true" ] ; then rm -rf /opt/apache/beam/third_party_licenses ; fi
---> Running in 445e1ab72158
Removing intermediate container 445e1ab72158
---> d2f044e2aa91
Successfully built d2f044e2aa91
Successfully tagged apache/beam_python3.9_sdk:2.42.0.dev
> Task :runners:google-cloud-dataflow-java:buildAndPushDockerPythonContainer
WARNING: `gcloud docker` will not be supported for Docker client versions above 18.03.
As an alternative, use `gcloud auth configure-docker` to configure `docker` to
use `gcloud` as a credential helper, then use `docker` as you would for non-GCR
registries, e.g. `docker pull gcr.io/project-id/my-image`. Add
`--verbosity=error` to silence this warning: `gcloud docker
--verbosity=error -- pull gcr.io/project-id/my-image`.
See: https://cloud.google.com/container-registry/docs/support/deprecation-notices#gcloud-docker
The push refers to repository [us.gcr.io/apache-beam-testing/java-postcommit-it/python]
e921bc7f1ec5: Preparing
3ede03a4db93: Preparing
7726988d2102: Preparing
905e25798a87: Preparing
53c6584c65ce: Preparing
5422546d082b: Preparing
f9febbff1479: Preparing
409dccd525e8: Preparing
a2c0db15222d: Preparing
2172085da26a: Preparing
681325f8a141: Preparing
7fc52b30086c: Preparing
08ecd3bf4bb4: Preparing
e0e6abfabc4b: Preparing
c6ca1fda7aff: Preparing
e3e1e8ae0ad9: Preparing
be73944855a3: Preparing
2143381c9922: Preparing
12228ba7a3b1: Preparing
9b55156abf26: Preparing
293d5db30c9f: Preparing
03127cdb479b: Preparing
9c742cd6c7a5: Preparing
08ecd3bf4bb4: Waiting
a2c0db15222d: Waiting
2172085da26a: Waiting
12228ba7a3b1: Waiting
681325f8a141: Waiting
e0e6abfabc4b: Waiting
9b55156abf26: Waiting
e3e1e8ae0ad9: Waiting
be73944855a3: Waiting
293d5db30c9f: Waiting
7fc52b30086c: Waiting
03127cdb479b: Waiting
5422546d082b: Waiting
2143381c9922: Waiting
c6ca1fda7aff: Waiting
f9febbff1479: Waiting
409dccd525e8: Waiting
7726988d2102: Pushed
53c6584c65ce: Pushed
e921bc7f1ec5: Pushed
905e25798a87: Pushed
3ede03a4db93: Pushed
409dccd525e8: Pushed
a2c0db15222d: Pushed
f9febbff1479: Pushed
08ecd3bf4bb4: Pushed
e0e6abfabc4b: Pushed
c6ca1fda7aff: Layer already exists
e3e1e8ae0ad9: Layer already exists
be73944855a3: Layer already exists
2143381c9922: Layer already exists
681325f8a141: Pushed
12228ba7a3b1: Layer already exists
9b55156abf26: Layer already exists
293d5db30c9f: Layer already exists
9c742cd6c7a5: Layer already exists
03127cdb479b: Layer already exists
5422546d082b: Pushed
2172085da26a: Pushed
7fc52b30086c: Pushed
name unknown: Failed to get blob sizes.
> Task :runners:google-cloud-dataflow-java:buildAndPushDockerPythonContainer FAILED
> Task :runners:google-cloud-dataflow-java:validatesCrossLanguageRunnerSetup
Launching Java expansion service @ 42023
Launching Python expansion service @ 40543
> Task :runners:google-cloud-dataflow-java:validatesCrossLanguageRunnerCleanup
Stopping expansion service pid: 2829701.
Stopping expansion service pid: 2829702.
FAILURE: Build failed with an exception.
* Where:
Build file '<https://ci-beam.apache.org/job/beam_PostCommit_XVR_PythonUsingJava_Dataflow/ws/src/runners/google-cloud-dataflow-java/build.gradle'> line: 324
* What went wrong:
Execution failed for task ':runners:google-cloud-dataflow-java:buildAndPushDockerPythonContainer'.
> Process 'command 'gcloud'' finished with non-zero exit value 1
* Try:
> Run with --stacktrace option to get the stack trace.
> Run with --info or --debug option to get more log output.
> Run with --scan to get full insights.
* Get more help at https://help.gradle.org
Deprecated Gradle features were used in this build, making it incompatible with Gradle 8.0.
You can use '--warning-mode all' to show the individual deprecation warnings and determine if they come from your own scripts or plugins.
See https://docs.gradle.org/7.4/userguide/command_line_interface.html#sec:command_line_warnings
Execution optimizations have been disabled for 1 invalid unit(s) of work during this build to ensure correctness.
Please consult deprecation warnings for more details.
BUILD FAILED in 10m 1s
126 actionable tasks: 22 executed, 104 up-to-date
Publishing build scan...
https://gradle.com/s/lxtejv25brtz4
Build step 'Invoke Gradle script' changed build result to FAILURE
Build step 'Invoke Gradle script' marked build as failure
---------------------------------------------------------------------
To unsubscribe, e-mail: builds-unsubscribe@beam.apache.org
For additional commands, e-mail: builds-help@beam.apache.org
Jenkins build is back to normal : beam_PostCommit_XVR_PythonUsingJava_Dataflow #776
Posted by Apache Jenkins Server <je...@builds.apache.org>.
See <https://ci-beam.apache.org/job/beam_PostCommit_XVR_PythonUsingJava_Dataflow/776/display/redirect?page=changes>
---------------------------------------------------------------------
To unsubscribe, e-mail: builds-unsubscribe@beam.apache.org
For additional commands, e-mail: builds-help@beam.apache.org