You are viewing a plain text version of this content. The canonical link for it is here.
Posted to yarn-dev@hadoop.apache.org by Apache Jenkins Server <je...@builds.apache.org> on 2015/05/26 18:36:36 UTC

Failed: YARN-3518 PreCommit Build #8086

Jira: https://issues.apache.org/jira/browse/YARN-3518
Build: https://builds.apache.org/job/PreCommit-YARN-Build/8086/

###################################################################################
########################## LAST 60 LINES OF THE CONSOLE ###########################
[...truncated 292 lines...]
|  +1  |            install  |  1m 32s    | mvn install still works. 
|  +1  |    eclipse:eclipse  |  0m 32s    | The patch built with 
|      |                     |            | eclipse:eclipse.
|  +1  |           findbugs  |  3m 49s    | The patch does not introduce any 
|      |                     |            | new Findbugs (version 3.0.0)
|      |                     |            | warnings.
|  +1  |         yarn tests  |  0m 25s    | Tests passed in hadoop-yarn-api. 
|  +1  |         yarn tests  |  1m 57s    | Tests passed in hadoop-yarn-common. 
|  +1  |         yarn tests  |  6m 18s    | Tests passed in 
|      |                     |            | hadoop-yarn-server-nodemanager.
|      |                     |  48m 54s   | 


|| Subsystem || Report/Notes ||
============================================================================
| Patch URL | http://issues.apache.org/jira/secure/attachment/12735339/YARN-3518.003.patch |
| Optional Tests | javadoc javac unit findbugs checkstyle |
| git revision | trunk / 022f49d |
| javac | /home/jenkins/jenkins-slave/workspace/PreCommit-YARN-Build/patchprocess/diffJavacWarnings.txt |
| checkstyle |  /home/jenkins/jenkins-slave/workspace/PreCommit-YARN-Build/patchprocess/diffcheckstylehadoop-yarn-api.txt |
| hadoop-yarn-api test log | /home/jenkins/jenkins-slave/workspace/PreCommit-YARN-Build/patchprocess/testrun_hadoop-yarn-api.txt |
| hadoop-yarn-common test log | /home/jenkins/jenkins-slave/workspace/PreCommit-YARN-Build/patchprocess/testrun_hadoop-yarn-common.txt |
| hadoop-yarn-server-nodemanager test log | /home/jenkins/jenkins-slave/workspace/PreCommit-YARN-Build/patchprocess/testrun_hadoop-yarn-server-nodemanager.txt |
| Test Results | https://builds.apache.org/job/PreCommit-YARN-Build/8086/testReport/ |
| Java | 1.7.0_55 |
| uname | Linux asf906.gq1.ygridcore.net 3.13.0-36-lowlatency #63-Ubuntu SMP PREEMPT Wed Sep 3 21:56:12 UTC 2014 x86_64 x86_64 x86_64 GNU/Linux |


============================================================================
============================================================================
                          Adding comment to JIRA
============================================================================
============================================================================


Comment added.
e99457daed9044c71336540cc94e7e2b9848048e logged out


============================================================================
============================================================================
                              Finished build.
============================================================================
============================================================================


Build step 'Execute shell' marked build as failure
Archiving artifacts
Sending artifact delta relative to PreCommit-YARN-Build #8083
Archived 44 artifacts
Archive block size is 32768
Received 595 blocks and 10339975 bytes
Compression is 65.3%
Took 3.2 sec
Description set: MAPREDUCE-6364
Recording test results
Publish JUnit test result report is waiting for a checkpoint on PreCommit-YARN-Build #8085
Email was triggered for: Failure
Sending email for trigger: Failure



###################################################################################
############################## FAILED TESTS (if any) ##############################
All tests passed

Success: YARN-1012 PreCommit Build #8088

Posted by Apache Jenkins Server <je...@builds.apache.org>.
Jira: https://issues.apache.org/jira/browse/YARN-1012
Build: https://builds.apache.org/job/PreCommit-YARN-Build/8088/

###################################################################################
########################## LAST 60 LINES OF THE CONSOLE ###########################
[...truncated 324 lines...]
|  +1  |         checkstyle  |  2m 5s     | There were no new checkstyle 
|      |                     |            | issues.
|  +1  |         whitespace  |  0m 1s     | The patch has no lines that end in 
|      |                     |            | whitespace.
|  +1  |            install  |  1m 34s    | mvn install still works. 
|  +1  |    eclipse:eclipse  |  0m 33s    | The patch built with 
|      |                     |            | eclipse:eclipse.
|  +1  |           findbugs  |  3m 48s    | The patch does not introduce any 
|      |                     |            | new Findbugs (version 3.0.0)
|      |                     |            | warnings.
|  +1  |         yarn tests  |  0m 22s    | Tests passed in hadoop-yarn-api. 
|  +1  |         yarn tests  |  1m 58s    | Tests passed in hadoop-yarn-common. 
|  +1  |         yarn tests  |  6m 17s    | Tests passed in 
|      |                     |            | hadoop-yarn-server-nodemanager.
|      |                     |  49m 10s   | 


|| Subsystem || Report/Notes ||
============================================================================
| Patch URL | http://issues.apache.org/jira/secure/attachment/12735357/YARN-1012-7.patch |
| Optional Tests | javadoc javac unit findbugs checkstyle |
| git revision | trunk / 022f49d |
| hadoop-yarn-api test log | /home/jenkins/jenkins-slave/workspace/PreCommit-YARN-Build/patchprocess/testrun_hadoop-yarn-api.txt |
| hadoop-yarn-common test log | /home/jenkins/jenkins-slave/workspace/PreCommit-YARN-Build/patchprocess/testrun_hadoop-yarn-common.txt |
| hadoop-yarn-server-nodemanager test log | /home/jenkins/jenkins-slave/workspace/PreCommit-YARN-Build/patchprocess/testrun_hadoop-yarn-server-nodemanager.txt |
| Test Results | https://builds.apache.org/job/PreCommit-YARN-Build/8088/testReport/ |
| Java | 1.7.0_55 |
| uname | Linux asf903.gq1.ygridcore.net 3.13.0-36-lowlatency #63-Ubuntu SMP PREEMPT Wed Sep 3 21:56:12 UTC 2014 x86_64 x86_64 x86_64 GNU/Linux |


============================================================================
============================================================================
                          Adding comment to JIRA
============================================================================
============================================================================


Comment added.
b18d6883deea501d770c462a0cf3f9527a65a1b8 logged out


============================================================================
============================================================================
                              Finished build.
============================================================================
============================================================================


Archiving artifacts
Sending artifact delta relative to PreCommit-YARN-Build #8083
Archived 42 artifacts
Archive block size is 32768
Received 518 blocks and 12942468 bytes
Compression is 56.7%
Took 10 sec
Description set: YARN-1012
Recording test results
Email was triggered for: Success
Sending email for trigger: Success



###################################################################################
############################## FAILED TESTS (if any) ##############################
All tests passed

Failed: YARN-1012 PreCommit Build #8087

Posted by Apache Jenkins Server <je...@builds.apache.org>.
Jira: https://issues.apache.org/jira/browse/YARN-1012
Build: https://builds.apache.org/job/PreCommit-YARN-Build/8087/

###################################################################################
########################## LAST 60 LINES OF THE CONSOLE ###########################
[...truncated 325 lines...]
|  +1  |    eclipse:eclipse  |  0m 34s    | The patch built with 
|      |                     |            | eclipse:eclipse.
|  +1  |           findbugs  |  3m 47s    | The patch does not introduce any 
|      |                     |            | new Findbugs (version 3.0.0)
|      |                     |            | warnings.
|  +1  |         yarn tests  |  0m 25s    | Tests passed in hadoop-yarn-api. 
|  -1  |         yarn tests  |  1m 55s    | Tests failed in hadoop-yarn-common. 
|  +1  |         yarn tests  |  6m 18s    | Tests passed in 
|      |                     |            | hadoop-yarn-server-nodemanager.
|      |                     |  49m 6s    | 


             Reason | Tests
 Failed unit tests  |  hadoop.yarn.api.TestPBImplRecords 


|| Subsystem || Report/Notes ||
============================================================================
| Patch URL | http://issues.apache.org/jira/secure/attachment/12735350/YARN-1012-6.patch |
| Optional Tests | javadoc javac unit findbugs checkstyle |
| git revision | trunk / 022f49d |
| hadoop-yarn-api test log | /home/jenkins/jenkins-slave/workspace/PreCommit-YARN-Build/patchprocess/testrun_hadoop-yarn-api.txt |
| hadoop-yarn-common test log | /home/jenkins/jenkins-slave/workspace/PreCommit-YARN-Build/patchprocess/testrun_hadoop-yarn-common.txt |
| hadoop-yarn-server-nodemanager test log | /home/jenkins/jenkins-slave/workspace/PreCommit-YARN-Build/patchprocess/testrun_hadoop-yarn-server-nodemanager.txt |
| Test Results | https://builds.apache.org/job/PreCommit-YARN-Build/8087/testReport/ |
| Java | 1.7.0_55 |
| uname | Linux asf902.gq1.ygridcore.net 3.13.0-36-lowlatency #63-Ubuntu SMP PREEMPT Wed Sep 3 21:56:12 UTC 2014 x86_64 x86_64 x86_64 GNU/Linux |


============================================================================
============================================================================
                          Adding comment to JIRA
============================================================================
============================================================================


Comment added.
c9a4e8d63215b5e9e810ab809596adbaa6c21b74 logged out


============================================================================
============================================================================
                              Finished build.
============================================================================
============================================================================


Build step 'Execute shell' marked build as failure
Archiving artifacts
Sending artifact delta relative to PreCommit-YARN-Build #8083
Archived 42 artifacts
Archive block size is 32768
Received 502 blocks and 13458593 bytes
Compression is 55.0%
Took 5.3 sec
Description set: MAPREDUCE-6364
Recording test results
Email was triggered for: Failure
Sending email for trigger: Failure



###################################################################################
############################## FAILED TESTS (if any) ##############################
1 tests failed.
REGRESSION:  org.apache.hadoop.yarn.api.TestPBImplRecords.testContainerStatusPBImpl

Error Message:
type class org.apache.hadoop.yarn.api.records.ResourceUtilization is not supported

Stack Trace:
java.lang.IllegalArgumentException: type class org.apache.hadoop.yarn.api.records.ResourceUtilization is not supported
	at org.apache.hadoop.yarn.api.TestPBImplRecords.genTypeValue(TestPBImplRecords.java:396)
	at org.apache.hadoop.yarn.api.TestPBImplRecords.getGetSetPairs(TestPBImplRecords.java:573)
	at org.apache.hadoop.yarn.api.TestPBImplRecords.validatePBImplRecord(TestPBImplRecords.java:588)
	at org.apache.hadoop.yarn.api.TestPBImplRecords.testContainerStatusPBImpl(TestPBImplRecords.java:977)