You are viewing a plain text version of this content. The canonical link for it is here.
Posted to builds@solr.apache.org by Policeman Jenkins Server <je...@thetaphi.de> on 2023/03/24 09:49:28 UTC

[JENKINS-EA] Solr-main-Linux (64bit/hotspot/jdk-21-ea+9) - Build # 10961 - Unstable!

Build: https://jenkins.thetaphi.de/job/Solr-main-Linux/10961/
Java: 64bit/hotspot/jdk-21-ea+9 -XX:-UseCompressedOops -XX:+UseSerialGC

2 tests failed.
FAILED:  org.apache.solr.common.cloud.TestDocCollectionWatcher.testWaitForStateWatcherIsRetainedOnPredicateFailure

Error Message:
java.lang.Exception: Test abandoned because suite timeout was reached.

Stack Trace:
java.lang.Exception: Test abandoned because suite timeout was reached.
	at __randomizedtesting.SeedInfo.seed([AC836EBD90F60D2A]:0)


FAILED:  org.apache.solr.common.cloud.TestDocCollectionWatcher.classMethod

Error Message:
java.lang.Exception: Suite timeout exceeded (>= 7200000 msec).

Stack Trace:
java.lang.Exception: Suite timeout exceeded (>= 7200000 msec).
	at __randomizedtesting.SeedInfo.seed([AC836EBD90F60D2A]:0)