You are viewing a plain text version of this content. The canonical link for it is here.
Posted to commits@flex.apache.org by fl...@gmail.com on 2015/02/06 07:56:16 UTC

Build failed in Jenkins: flex-tlf #331

See <http://apacheflexbuild.cloudapp.net:8080/job/flex-tlf/331/>

------------------------------------------
Started by timer
Building remotely on flex_sdk_slave2 in workspace <http://apacheflexbuild.cloudapp.net:8080/job/flex-tlf/ws/>
 > C:\Program Files (x86)\Git\cmd\git.exe rev-parse --is-inside-work-tree # timeout=10
Fetching changes from the remote Git repository
 > C:\Program Files (x86)\Git\cmd\git.exe config remote.origin.url https://git-wip-us.apache.org/repos/asf/flex-tlf.git # timeout=10
Fetching upstream changes from https://git-wip-us.apache.org/repos/asf/flex-tlf.git
 > C:\Program Files (x86)\Git\cmd\git.exe --version # timeout=10
 > C:\Program Files (x86)\Git\cmd\git.exe fetch --tags --progress https://git-wip-us.apache.org/repos/asf/flex-tlf.git +refs/heads/*:refs/remotes/origin/*
 > C:\Program Files (x86)\Git\cmd\git.exe rev-parse "origin/develop^{commit}" # timeout=10
Checking out Revision 316a70f6538dd325303e639d146ed634004d1faa (origin/develop)
 > C:\Program Files (x86)\Git\cmd\git.exe config core.sparsecheckout # timeout=10
 > C:\Program Files (x86)\Git\cmd\git.exe checkout -f 316a70f6538dd325303e639d146ed634004d1faa
 > C:\Program Files (x86)\Git\cmd\git.exe rev-list 316a70f6538dd325303e639d146ed634004d1faa # timeout=10
[flex-tlf] $ cmd.exe /C '"c:\Jenkins\tools\hudson.tasks.Ant_AntInstallation\c_apache-ant-1.9.3\bin\ant.bat -file build.xml all && exit %%ERRORLEVEL%%"'
Buildfile: <http://apacheflexbuild.cloudapp.net:8080/job/flex-tlf/ws/build.xml>
     [echo] FLEX_HOME is <http://apacheflexbuild.cloudapp.net:8080/job/flex-tlf/ws/../flex-sdk>
     [echo] Minimal test is set false

clean:
   [delete] Deleting directory <http://apacheflexbuild.cloudapp.net:8080/job/flex-tlf/ws/bin>
   [delete] Deleting: <http://apacheflexbuild.cloudapp.net:8080/job/flex-tlf/ws/bundles.properties>

textLayout:
    [compc] Loading configuration file C:\Jenkins\workspace\flex-sdk\frameworks\flex-config.xml
    [compc] C:\Jenkins\workspace\flex-tlf\bin\textLayout.swc (548675 bytes)
    [compc] Picked up JAVA_TOOL_OPTIONS: -Dfile.encoding=UTF8

main:

asTestApps:
     [echo] FLEX_HOME is <http://apacheflexbuild.cloudapp.net:8080/job/flex-tlf/ws/../flex-sdk>
     [echo] Minimal test is set false

asTestApp:
    [mxmlc] Loading configuration file C:\Jenkins\workspace\flex-sdk\frameworks\flex-config.xml
    [mxmlc] C:\Jenkins\workspace\flex-tlf\bin\apps\asTestApps\bin\ExplicitFormField.swf (519804 bytes)
    [mxmlc] Picked up JAVA_TOOL_OPTIONS: -Dfile.encoding=UTF8
     [echo] FLEX_HOME is <http://apacheflexbuild.cloudapp.net:8080/job/flex-tlf/ws/../flex-sdk>
     [echo] Minimal test is set false

asTestApp:
    [mxmlc] Loading configuration file C:\Jenkins\workspace\flex-sdk\frameworks\flex-config.xml
    [mxmlc] C:\Jenkins\workspace\flex-tlf\bin\apps\asTestApps\bin\TCMTestFocus2.swf (527000 bytes)
    [mxmlc] Picked up JAVA_TOOL_OPTIONS: -Dfile.encoding=UTF8
     [echo] FLEX_HOME is <http://apacheflexbuild.cloudapp.net:8080/job/flex-tlf/ws/../flex-sdk>
     [echo] Minimal test is set false

asTestApp:
    [mxmlc] Loading configuration file C:\Jenkins\workspace\flex-sdk\frameworks\flex-config.xml
    [mxmlc] Picked up JAVA_TOOL_OPTIONS: -Dfile.encoding=UTF8
    [mxmlc] C:\Jenkins\workspace\flex-tlf\bin\apps\asTestApps\bin\AliceScroll.swf (588509 bytes)
     [echo] FLEX_HOME is <http://apacheflexbuild.cloudapp.net:8080/job/flex-tlf/ws/../flex-sdk>
     [echo] Minimal test is set false

asTestApp:
    [mxmlc] Loading configuration file C:\Jenkins\workspace\flex-sdk\frameworks\flex-config.xml
    [mxmlc] Picked up JAVA_TOOL_OPTIONS: -Dfile.encoding=UTF8
    [mxmlc] C:\Jenkins\workspace\flex-tlf\bin\apps\asTestApps\bin\KeyLogger.swf (2166 bytes)
     [echo] FLEX_HOME is <http://apacheflexbuild.cloudapp.net:8080/job/flex-tlf/ws/../flex-sdk>
     [echo] Minimal test is set false

asTestApp:
    [mxmlc] Loading configuration file C:\Jenkins\workspace\flex-sdk\frameworks\flex-config.xml
    [mxmlc] C:\Jenkins\workspace\flex-tlf\bin\apps\asTestApps\bin\OpHammer.swf (530204 bytes)
    [mxmlc] Picked up JAVA_TOOL_OPTIONS: -Dfile.encoding=UTF8

textLayout_editBar:
    [compc] Loading configuration file C:\Jenkins\workspace\flex-sdk\frameworks\flex-config.xml
    [compc] C:\Jenkins\workspace\flex-tlf\bin\apps\testApps\bin\textLayout_editBar.swc (23170 bytes)
    [compc] Picked up JAVA_TOOL_OPTIONS: -Dfile.encoding=UTF8

textLayout_ui:
    [compc] Loading configuration file C:\Jenkins\workspace\flex-sdk\frameworks\flex-config.xml
    [compc] C:\Jenkins\workspace\flex-tlf\bin\apps\testApps\bin\textLayout_ui.swc (112800 bytes)
    [compc] Picked up JAVA_TOOL_OPTIONS: -Dfile.encoding=UTF8

testApps:
    [mxmlc] Loading configuration file C:\Jenkins\workspace\flex-sdk\frameworks\flex-config.xml
    [mxmlc] C:\Jenkins\workspace\flex-tlf\bin\apps\automation_apps\bin\Flow.swf (2185119 bytes)
    [mxmlc] Picked up JAVA_TOOL_OPTIONS: -Dfile.encoding=UTF8

automation_core:
    [compc] Loading configuration file C:\Jenkins\workspace\flex-sdk\frameworks\flex-config.xml
    [compc] Picked up JAVA_TOOL_OPTIONS: -Dfile.encoding=UTF8
    [compc] C:\Jenkins\workspace\flex-tlf\bin\apps\automation_apps\bin\automation_core.swc (34041 bytes)

automation_tests:
    [compc] Loading configuration file C:\Jenkins\workspace\flex-sdk\frameworks\flex-config.xml
    [compc] C:\Jenkins\workspace\flex-tlf\bin\apps\automation_apps\bin\automation_tests.swc (224184 bytes)
    [compc] Picked up JAVA_TOOL_OPTIONS: -Dfile.encoding=UTF8

automation_apps:
    [mxmlc] Loading configuration file C:\Jenkins\workspace\flex-sdk\frameworks\flex-config.xml
    [mxmlc] C:\Jenkins\workspace\flex-tlf\bin\apps\automation_apps\bin\VellumUnit.swf (2278651 bytes)
    [mxmlc] Picked up JAVA_TOOL_OPTIONS: -Dfile.encoding=UTF8
     [copy] Copying 152 files to <http://apacheflexbuild.cloudapp.net:8080/job/flex-tlf/ws/bin/apps/test>

flexunnit_tests:
 [flexunit] Validating task attributes ...
 [flexunit] Generating default values ...
 [flexunit] Using default working dir [<http://apacheflexbuild.cloudapp.net:8080/job/flex-tlf/ws/]>
 [flexunit] Using the following settings for the test run:
 [flexunit] 	FLEX_HOME: [<http://apacheflexbuild.cloudapp.net:8080/job/flex-tlf/ws/../flex-sdk]>
 [flexunit] 	haltonfailure: [true]
 [flexunit] 	headless: [false]
 [flexunit] 	display: [99]
 [flexunit] 	localTrusted: [true]
 [flexunit] 	player: [flash]
 [flexunit] 	port: [1024]
 [flexunit] 	swf: [<http://apacheflexbuild.cloudapp.net:8080/job/flex-tlf/ws/bin/apps/automation_apps/bin/VellumUnit.swf]>
 [flexunit] 	timeout: [60000ms]
 [flexunit] 	toDir: [<http://apacheflexbuild.cloudapp.net:8080/job/flex-tlf/ws/bin/apps/automation_apps]>
 [flexunit] Setting up server process ...
 [flexunit] Entry [<http://apacheflexbuild.cloudapp.net:8080/job/flex-tlf/ws/bin/apps/automation_apps/bin]> already available in local trust file at [C:\Users\apacheflexbuild\AppData\Roaming\Macromedia\Flash Player\#Security\FlashPlayerTrust\flexUnit.cfg].
 [flexunit] Executing 'rundll32' with arguments:
 [flexunit] 'url.dll,FileProtocolHandler'
 [flexunit] '<http://apacheflexbuild.cloudapp.net:8080/job/flex-tlf/ws/bin/apps/automation_apps/bin/VellumUnit.swf'>
 [flexunit] 
 [flexunit] The ' characters around the executable and arguments are
 [flexunit] not part of the command.
 [flexunit] 
 [flexunit] Starting server ...
 [flexunit] Opening server socket on port [1024].
 [flexunit] Waiting for client connection ...
 [flexunit] Client connected.
 [flexunit] Setting inbound buffer size to [262144] bytes.
 [flexunit] Receiving data ...
 [flexunit] Sending acknowledgement to player to start sending test data ...
 [flexunit] 
 [flexunit] FlexUnit test ShortTextMouseEventTBLTRTest in suite UnitTest.Tests.AllEventTest was ignored.
 [flexunit] FlexUnit test ShortTextMouseEventTBRTLTest in suite UnitTest.Tests.AllEventTest was ignored.
 [flexunit] FlexUnit test ShortTextMouseEventRLRTLTest in suite UnitTest.Tests.AllEventTest was ignored.
 [flexunit] FlexUnit test ShortTextMouseEventRLLTRTest in suite UnitTest.Tests.AllEventTest was ignored.
 [flexunit] FlexUnit test testAllEnumProps in suite UnitTest.Tests.AllParaAttributeTest was ignored.
 [flexunit] FlexUnit test contentWidthCheckLongFloat in suite UnitTest.Tests.FloatTest was ignored.
 [flexunit] FlexUnit test paddingBottomTest ([object Object]) in suite UnitTest.Tests.ContainerAttributeTest was ignored.
 [flexunit] FlexUnit test checkColumnGapOnWidthChangeTest ([object Object]) in suite UnitTest.Tests.ContainerAttributeTest was ignored.
 [flexunit] FlexUnit test checkColumnGapOnWidthChangeTest ([object Object]) in suite UnitTest.Tests.ContainerAttributeTest was ignored.
 [flexunit] FlexUnit test paddingBottomTest ([object Object]) in suite UnitTest.Tests.ContainerAttributeTest was ignored.
 [flexunit] FlexUnit test twoColumnsTest in suite UnitTest.Tests.ScrollingTest was ignored.
 [flexunit] FlexUnit test applyFormatToElementTest in suite UnitTest.Tests.OperationTest was ignored.
 [flexunit] FlexUnit test deletePreviousWordTest in suite UnitTest.Tests.OperationTest was ignored.
 [flexunit] FlexUnit test arabicDirection in suite UnitTest.Tests.WritingModeTest was ignored.
 [flexunit] FlexUnit test spanElementReplaceTextInvalidPos in suite UnitTest.Tests.ElementOperationTest was ignored.
 [flexunit] FlexUnit test arrowDown in suite UnitTest.Tests.GeneralFunctionsTest failed.
 [flexunit] FlexUnit test arrowUp in suite UnitTest.Tests.GeneralFunctionsTest failed.
 [flexunit] FlexUnit test noTabStop in suite UnitTest.Tests.TabTest was ignored.
 [flexunit] FlexUnit test endTabLongStringTest in suite UnitTest.Tests.TabTest was ignored.
 [flexunit] FlexUnit test draggingSelectioinMultiFlows in suite UnitTest.Tests.ContainerTypeTest was ignored.
 [flexunit] FlexUnit test deleteAtContainerStart (simple in suite UnitTest.Tests.CompositionTest was ignored.
 [flexunit] FlexUnit test partialCompositionTest (simple in suite UnitTest.Tests.CompositionTest was ignored.
 [flexunit] FlexUnit test deleteAtContainerStart (asknot in suite UnitTest.Tests.CompositionTest was ignored.
 [flexunit] FlexUnit test partialCompositionTest (asknot in suite UnitTest.Tests.CompositionTest was ignored.
 [flexunit] 
 [flexunit] Stopping server ...
 [flexunit] End of test data reached, sending acknowledgement to player ...
 [flexunit] Closing client connection ...
 [flexunit] Closing server on port [1024] ...
 [flexunit] Analyzing reports ...
 [flexunit] 
 [flexunit] Suite: UnitTest.Tests.OperationTest
 [flexunit] Tests run: 47, Failures: 0, Errors: 0, Skipped: 2, Time elapsed: 17.778 sec
 [flexunit] Suite: UnitTest.Tests.GeneralFunctionsTest
 [flexunit] Tests run: 36, Failures: 2, Errors: 0, Skipped: 0, Time elapsed: 9.293 sec
 [flexunit] Suite: UnitTest.Tests.CrossContainerTest
 [flexunit] Tests run: 1, Failures: 0, Errors: 0, Skipped: 0, Time elapsed: 0.111 sec
 [flexunit] Suite: UnitTest.Tests.AllParaAttributeTest
 [flexunit] Tests run: 6, Failures: 0, Errors: 0, Skipped: 1, Time elapsed: 8.211 sec
 [flexunit] Suite: UnitTest.Tests.TabTest
 [flexunit] Tests run: 19, Failures: 0, Errors: 0, Skipped: 2, Time elapsed: 1.954 sec
 [flexunit] Suite: UnitTest.Tests.EventOverrideTest
 [flexunit] Tests run: 12, Failures: 0, Errors: 0, Skipped: 0, Time elapsed: 1.301 sec
 [flexunit] Suite: UnitTest.Tests.AllContAttributeTest
 [flexunit] Tests run: 6, Failures: 0, Errors: 0, Skipped: 0, Time elapsed: 10.199 sec
 [flexunit] Suite: UnitTest.Tests.AccessibilityMethodsTest
 [flexunit] Tests run: 5, Failures: 0, Errors: 0, Skipped: 0, Time elapsed: 0.603 sec
 [flexunit] Suite: UnitTest.Tests.FactoryImportTest
 [flexunit] Tests run: 1, Failures: 0, Errors: 0, Skipped: 0, Time elapsed: 0.031 sec
 [flexunit] Suite: UnitTest.Tests.AllEventTest
 [flexunit] Tests run: 13, Failures: 0, Errors: 0, Skipped: 4, Time elapsed: 2.138 sec
 [flexunit] Suite: UnitTest.Tests.BoundsAndAlignmentTest
 [flexunit] Tests run: 6, Failures: 0, Errors: 0, Skipped: 0, Time elapsed: 4.361 sec
 [flexunit] Suite: UnitTest.Tests.TextFlowEditTest
 [flexunit] Tests run: 3, Failures: 0, Errors: 0, Skipped: 0, Time elapsed: 0.465 sec
 [flexunit] Suite: UnitTest.Tests.ContainerTypeTest
 [flexunit] Tests run: 22, Failures: 0, Errors: 0, Skipped: 1, Time elapsed: 0.830 sec
 [flexunit] Suite: UnitTest.Tests.FloatTest
 [flexunit] Tests run: 56, Failures: 0, Errors: 0, Skipped: 1, Time elapsed: 82.496 sec
 [flexunit] Suite: UnitTest.Tests.AttributeTest
 [flexunit] Tests run: 44, Failures: 0, Errors: 0, Skipped: 0, Time elapsed: 5.173 sec
 [flexunit] Suite: UnitTest.Tests.FlowModelTest
 [flexunit] Tests run: 23, Failures: 0, Errors: 0, Skipped: 0, Time elapsed: 3.913 sec
 [flexunit] Suite: UnitTest.Tests.ElementOperationTest
 [flexunit] Tests run: 25, Failures: 0, Errors: 0, Skipped: 1, Time elapsed: 5.878 sec
 [flexunit] Suite: UnitTest.Tests.WritingModeTest
 [flexunit] Tests run: 13, Failures: 0, Errors: 0, Skipped: 1, Time elapsed: 1.758 sec
 [flexunit] Suite: UnitTest.Tests.UndoRedoTest
 [flexunit] Tests run: 1, Failures: 0, Errors: 0, Skipped: 0, Time elapsed: 0.236 sec
 [flexunit] Suite: UnitTest.Tests.BoxTest
 [flexunit] Tests run: 13, Failures: 0, Errors: 0, Skipped: 0, Time elapsed: 4.962 sec
 [flexunit] Suite: UnitTest.Tests.ScrollingTest
 [flexunit] Tests run: 15, Failures: 0, Errors: 0, Skipped: 1, Time elapsed: 13.098 sec
 [flexunit] Suite: UnitTest.Tests.AllCharAttributeTest
 [flexunit] Tests run: 6, Failures: 0, Errors: 0, Skipped: 0, Time elapsed: 93.576 sec
 [flexunit] Suite: UnitTest.Tests.ContainerAttributeTest
 [flexunit] Tests run: 31, Failures: 0, Errors: 0, Skipped: 4, Time elapsed: 410.660 sec
 [flexunit] Suite: UnitTest.Tests.CompositionTest
 [flexunit] Tests run: 24, Failures: 0, Errors: 0, Skipped: 4, Time elapsed: 8.911 sec
 [flexunit] 
 [flexunit] Results :
 [flexunit] 
 [flexunit] Tests run: 428, Failures: 2, Errors: 0, Skipped: 22, Time elapsed: 687.936 sec
 [flexunit] 

BUILD FAILED
<http://apacheflexbuild.cloudapp.net:8080/job/flex-tlf/ws/build.xml>:312: FlexUnit tests failed during the test run.

Total time: 15 minutes 17 seconds
Picked up JAVA_TOOL_OPTIONS: -Dfile.encoding=UTF8
Build step 'Invoke Ant' marked build as failure
Archiving artifacts
Recording test results

Jenkins build is back to normal : flex-tlf #335

Posted by fl...@gmail.com.
See <http://apacheflexbuild.cloudapp.net:8080/job/flex-tlf/335/changes>


Build failed in Jenkins: flex-tlf #334

Posted by fl...@gmail.com.
See <http://apacheflexbuild.cloudapp.net:8080/job/flex-tlf/334/changes>

Changes:

[piotrz] Force ordering unit tests

------------------------------------------
Started by user Apache Flex Build
Building remotely on flex_sdk_slave2 in workspace <http://apacheflexbuild.cloudapp.net:8080/job/flex-tlf/ws/>
 > C:\Program Files (x86)\Git\cmd\git.exe rev-parse --is-inside-work-tree # timeout=10
Fetching changes from the remote Git repository
 > C:\Program Files (x86)\Git\cmd\git.exe config remote.origin.url https://git-wip-us.apache.org/repos/asf/flex-tlf.git # timeout=10
Fetching upstream changes from https://git-wip-us.apache.org/repos/asf/flex-tlf.git
 > C:\Program Files (x86)\Git\cmd\git.exe --version # timeout=10
 > C:\Program Files (x86)\Git\cmd\git.exe fetch --tags --progress https://git-wip-us.apache.org/repos/asf/flex-tlf.git +refs/heads/*:refs/remotes/origin/*
 > C:\Program Files (x86)\Git\cmd\git.exe rev-parse "origin/develop^{commit}" # timeout=10
Checking out Revision dc3b581d3d267b0622349f1a753e3d68c9596592 (origin/develop)
 > C:\Program Files (x86)\Git\cmd\git.exe config core.sparsecheckout # timeout=10
 > C:\Program Files (x86)\Git\cmd\git.exe checkout -f dc3b581d3d267b0622349f1a753e3d68c9596592
 > C:\Program Files (x86)\Git\cmd\git.exe rev-list 316a70f6538dd325303e639d146ed634004d1faa # timeout=10
[flex-tlf] $ cmd.exe /C '"c:\Jenkins\tools\hudson.tasks.Ant_AntInstallation\c_apache-ant-1.9.3\bin\ant.bat -file build.xml all && exit %%ERRORLEVEL%%"'
Buildfile: <http://apacheflexbuild.cloudapp.net:8080/job/flex-tlf/ws/build.xml>
     [echo] FLEX_HOME is <http://apacheflexbuild.cloudapp.net:8080/job/flex-tlf/ws/../flex-sdk>
     [echo] Minimal test is set false

clean:
   [delete] Deleting directory <http://apacheflexbuild.cloudapp.net:8080/job/flex-tlf/ws/bin>

textLayout:
    [compc] Loading configuration file C:\Jenkins\workspace\flex-sdk\frameworks\flex-config.xml
    [compc] Picked up JAVA_TOOL_OPTIONS: -Dfile.encoding=UTF8
    [compc] C:\Jenkins\workspace\flex-tlf\bin\textLayout.swc (548680 bytes)

main:

asTestApps:
     [echo] FLEX_HOME is <http://apacheflexbuild.cloudapp.net:8080/job/flex-tlf/ws/../flex-sdk>
     [echo] Minimal test is set false

asTestApp:
    [mxmlc] Loading configuration file C:\Jenkins\workspace\flex-sdk\frameworks\flex-config.xml
    [mxmlc] C:\Jenkins\workspace\flex-tlf\bin\apps\asTestApps\bin\ExplicitFormField.swf (519804 bytes)
    [mxmlc] Picked up JAVA_TOOL_OPTIONS: -Dfile.encoding=UTF8
     [echo] FLEX_HOME is <http://apacheflexbuild.cloudapp.net:8080/job/flex-tlf/ws/../flex-sdk>
     [echo] Minimal test is set false

asTestApp:
    [mxmlc] Loading configuration file C:\Jenkins\workspace\flex-sdk\frameworks\flex-config.xml
    [mxmlc] Picked up JAVA_TOOL_OPTIONS: -Dfile.encoding=UTF8
    [mxmlc] C:\Jenkins\workspace\flex-tlf\bin\apps\asTestApps\bin\TCMTestFocus2.swf (527000 bytes)
     [echo] FLEX_HOME is <http://apacheflexbuild.cloudapp.net:8080/job/flex-tlf/ws/../flex-sdk>
     [echo] Minimal test is set false

asTestApp:
    [mxmlc] Loading configuration file C:\Jenkins\workspace\flex-sdk\frameworks\flex-config.xml
    [mxmlc] C:\Jenkins\workspace\flex-tlf\bin\apps\asTestApps\bin\AliceScroll.swf (588506 bytes)
    [mxmlc] Picked up JAVA_TOOL_OPTIONS: -Dfile.encoding=UTF8
     [echo] FLEX_HOME is <http://apacheflexbuild.cloudapp.net:8080/job/flex-tlf/ws/../flex-sdk>
     [echo] Minimal test is set false

asTestApp:
    [mxmlc] Loading configuration file C:\Jenkins\workspace\flex-sdk\frameworks\flex-config.xml
    [mxmlc] Picked up JAVA_TOOL_OPTIONS: -Dfile.encoding=UTF8
    [mxmlc] C:\Jenkins\workspace\flex-tlf\bin\apps\asTestApps\bin\KeyLogger.swf (2164 bytes)
     [echo] FLEX_HOME is <http://apacheflexbuild.cloudapp.net:8080/job/flex-tlf/ws/../flex-sdk>
     [echo] Minimal test is set false

asTestApp:
    [mxmlc] Loading configuration file C:\Jenkins\workspace\flex-sdk\frameworks\flex-config.xml
    [mxmlc] C:\Jenkins\workspace\flex-tlf\bin\apps\asTestApps\bin\OpHammer.swf (530204 bytes)
    [mxmlc] Picked up JAVA_TOOL_OPTIONS: -Dfile.encoding=UTF8

textLayout_editBar:
    [compc] Loading configuration file C:\Jenkins\workspace\flex-sdk\frameworks\flex-config.xml
    [compc] C:\Jenkins\workspace\flex-tlf\bin\apps\testApps\bin\textLayout_editBar.swc (23172 bytes)
    [compc] Picked up JAVA_TOOL_OPTIONS: -Dfile.encoding=UTF8

textLayout_ui:
    [compc] Loading configuration file C:\Jenkins\workspace\flex-sdk\frameworks\flex-config.xml
    [compc] C:\Jenkins\workspace\flex-tlf\bin\apps\testApps\bin\textLayout_ui.swc (112806 bytes)
    [compc] Picked up JAVA_TOOL_OPTIONS: -Dfile.encoding=UTF8

testApps:
    [mxmlc] Loading configuration file C:\Jenkins\workspace\flex-sdk\frameworks\flex-config.xml
    [mxmlc] C:\Jenkins\workspace\flex-tlf\bin\apps\automation_apps\bin\Flow.swf (2185119 bytes)
    [mxmlc] Picked up JAVA_TOOL_OPTIONS: -Dfile.encoding=UTF8

automation_core:
    [compc] Loading configuration file C:\Jenkins\workspace\flex-sdk\frameworks\flex-config.xml
    [compc] C:\Jenkins\workspace\flex-tlf\bin\apps\automation_apps\bin\automation_core.swc (34039 bytes)
    [compc] Picked up JAVA_TOOL_OPTIONS: -Dfile.encoding=UTF8

automation_tests:
    [compc] Loading configuration file C:\Jenkins\workspace\flex-sdk\frameworks\flex-config.xml
    [compc] C:\Jenkins\workspace\flex-tlf\bin\apps\automation_apps\bin\automation_tests.swc (224370 bytes)
    [compc] Picked up JAVA_TOOL_OPTIONS: -Dfile.encoding=UTF8

automation_apps:
    [mxmlc] Loading configuration file C:\Jenkins\workspace\flex-sdk\frameworks\flex-config.xml
    [mxmlc] C:\Jenkins\workspace\flex-tlf\bin\apps\automation_apps\bin\VellumUnit.swf (2279287 bytes)
    [mxmlc] Picked up JAVA_TOOL_OPTIONS: -Dfile.encoding=UTF8
     [copy] Copying 152 files to <http://apacheflexbuild.cloudapp.net:8080/job/flex-tlf/ws/bin/apps/test>

flexunnit_tests:
 [flexunit] Validating task attributes ...
 [flexunit] Generating default values ...
 [flexunit] Using default working dir [<http://apacheflexbuild.cloudapp.net:8080/job/flex-tlf/ws/]>
 [flexunit] Using the following settings for the test run:
 [flexunit] 	FLEX_HOME: [<http://apacheflexbuild.cloudapp.net:8080/job/flex-tlf/ws/../flex-sdk]>
 [flexunit] 	haltonfailure: [true]
 [flexunit] 	headless: [false]
 [flexunit] 	display: [99]
 [flexunit] 	localTrusted: [true]
 [flexunit] 	player: [flash]
 [flexunit] 	port: [1024]
 [flexunit] 	swf: [<http://apacheflexbuild.cloudapp.net:8080/job/flex-tlf/ws/bin/apps/automation_apps/bin/VellumUnit.swf]>
 [flexunit] 	timeout: [60000ms]
 [flexunit] 	toDir: [<http://apacheflexbuild.cloudapp.net:8080/job/flex-tlf/ws/bin/apps/automation_apps]>
 [flexunit] Setting up server process ...
 [flexunit] Entry [<http://apacheflexbuild.cloudapp.net:8080/job/flex-tlf/ws/bin/apps/automation_apps/bin]> already available in local trust file at [C:\Users\apacheflexbuild\AppData\Roaming\Macromedia\Flash Player\#Security\FlashPlayerTrust\flexUnit.cfg].
 [flexunit] Executing 'rundll32' with arguments:
 [flexunit] 'url.dll,FileProtocolHandler'
 [flexunit] '<http://apacheflexbuild.cloudapp.net:8080/job/flex-tlf/ws/bin/apps/automation_apps/bin/VellumUnit.swf'>
 [flexunit] 
 [flexunit] The ' characters around the executable and arguments are
 [flexunit] not part of the command.
 [flexunit] 
 [flexunit] Starting server ...
 [flexunit] Opening server socket on port [1024].
 [flexunit] Waiting for client connection ...
 [flexunit] Client connected.
 [flexunit] Setting inbound buffer size to [262144] bytes.
 [flexunit] Receiving data ...
 [flexunit] Sending acknowledgement to player to start sending test data ...
 [flexunit] 
 [flexunit] FlexUnit test ShortTextMouseEventTBRTLTest in suite UnitTest.Tests.AllEventTest was ignored.
 [flexunit] FlexUnit test ShortTextMouseEventRLLTRTest in suite UnitTest.Tests.AllEventTest was ignored.
 [flexunit] FlexUnit test ShortTextMouseEventRLRTLTest in suite UnitTest.Tests.AllEventTest was ignored.
 [flexunit] FlexUnit test ShortTextMouseEventTBLTRTest in suite UnitTest.Tests.AllEventTest was ignored.
 [flexunit] FlexUnit test testAllEnumProps in suite UnitTest.Tests.AllParaAttributeTest was ignored.
 [flexunit] FlexUnit test partialCompositionTest (simple in suite UnitTest.Tests.CompositionTest was ignored.
 [flexunit] FlexUnit test deleteAtContainerStart (simple in suite UnitTest.Tests.CompositionTest was ignored.
 [flexunit] FlexUnit test partialCompositionTest (asknot in suite UnitTest.Tests.CompositionTest was ignored.
 [flexunit] FlexUnit test deleteAtContainerStart (asknot in suite UnitTest.Tests.CompositionTest was ignored.
 [flexunit] FlexUnit test draggingSelectioinMultiFlows in suite UnitTest.Tests.ContainerTypeTest was ignored.
 [flexunit] FlexUnit test contentWidthCheckLongFloat in suite UnitTest.Tests.FloatTest was ignored.
 [flexunit] FlexUnit test applyFormatToElementTest in suite UnitTest.Tests.OperationTest was ignored.
 [flexunit] FlexUnit test deletePreviousWordTest in suite UnitTest.Tests.OperationTest was ignored.
 [flexunit] FlexUnit test twoColumnsTest in suite UnitTest.Tests.ScrollingTest was ignored.
 [flexunit] FlexUnit test checkColumnGapOnWidthChangeTest ([object Object]) in suite UnitTest.Tests.ContainerAttributeTest was ignored.
 [flexunit] FlexUnit test paddingBottomTest ([object Object]) in suite UnitTest.Tests.ContainerAttributeTest was ignored.
 [flexunit] FlexUnit test paddingBottomTest ([object Object]) in suite UnitTest.Tests.ContainerAttributeTest was ignored.
 [flexunit] FlexUnit test checkColumnGapOnWidthChangeTest ([object Object]) in suite UnitTest.Tests.ContainerAttributeTest was ignored.
 [flexunit] FlexUnit test spanElementReplaceTextInvalidPos in suite UnitTest.Tests.ElementOperationTest was ignored.
 [flexunit] FlexUnit test keyDownDerivedTest in suite UnitTest.Tests.EventOverrideTest failed.
 [flexunit] FlexUnit test arabicDirection in suite UnitTest.Tests.WritingModeTest was ignored.
 [flexunit] FlexUnit test endTabLongStringTest in suite UnitTest.Tests.TabTest was ignored.
 [flexunit] FlexUnit test noTabStop in suite UnitTest.Tests.TabTest was ignored.
 [flexunit] 
 [flexunit] Stopping server ...
 [flexunit] End of test data reached, sending acknowledgement to player ...
 [flexunit] Closing client connection ...
 [flexunit] Closing server on port [1024] ...
 [flexunit] Analyzing reports ...
 [flexunit] 
 [flexunit] Suite: UnitTest.Tests.OperationTest
 [flexunit] Tests run: 47, Failures: 0, Errors: 0, Skipped: 2, Time elapsed: 17.853 sec
 [flexunit] Suite: UnitTest.Tests.GeneralFunctionsTest
 [flexunit] Tests run: 36, Failures: 0, Errors: 0, Skipped: 0, Time elapsed: 7.287 sec
 [flexunit] Suite: UnitTest.Tests.CrossContainerTest
 [flexunit] Tests run: 1, Failures: 0, Errors: 0, Skipped: 0, Time elapsed: 0.113 sec
 [flexunit] Suite: UnitTest.Tests.AllParaAttributeTest
 [flexunit] Tests run: 6, Failures: 0, Errors: 0, Skipped: 1, Time elapsed: 4.981 sec
 [flexunit] Suite: UnitTest.Tests.TabTest
 [flexunit] Tests run: 19, Failures: 0, Errors: 0, Skipped: 2, Time elapsed: 1.611 sec
 [flexunit] Suite: UnitTest.Tests.EventOverrideTest
 [flexunit] Tests run: 12, Failures: 1, Errors: 0, Skipped: 0, Time elapsed: 1.172 sec
 [flexunit] Suite: UnitTest.Tests.AllContAttributeTest
 [flexunit] Tests run: 6, Failures: 0, Errors: 0, Skipped: 0, Time elapsed: 9.532 sec
 [flexunit] Suite: UnitTest.Tests.AccessibilityMethodsTest
 [flexunit] Tests run: 5, Failures: 0, Errors: 0, Skipped: 0, Time elapsed: 0.490 sec
 [flexunit] Suite: UnitTest.Tests.FactoryImportTest
 [flexunit] Tests run: 1, Failures: 0, Errors: 0, Skipped: 0, Time elapsed: 0.041 sec
 [flexunit] Suite: UnitTest.Tests.AllEventTest
 [flexunit] Tests run: 13, Failures: 0, Errors: 0, Skipped: 4, Time elapsed: 1.946 sec
 [flexunit] Suite: UnitTest.Tests.BoundsAndAlignmentTest
 [flexunit] Tests run: 6, Failures: 0, Errors: 0, Skipped: 0, Time elapsed: 4.174 sec
 [flexunit] Suite: UnitTest.Tests.TextFlowEditTest
 [flexunit] Tests run: 3, Failures: 0, Errors: 0, Skipped: 0, Time elapsed: 0.397 sec
 [flexunit] Suite: UnitTest.Tests.AttributeTest
 [flexunit] Tests run: 44, Failures: 0, Errors: 0, Skipped: 0, Time elapsed: 4.457 sec
 [flexunit] Suite: UnitTest.Tests.ContainerTypeTest
 [flexunit] Tests run: 22, Failures: 0, Errors: 0, Skipped: 1, Time elapsed: 1.246 sec
 [flexunit] Suite: UnitTest.Tests.FloatTest
 [flexunit] Tests run: 56, Failures: 0, Errors: 0, Skipped: 1, Time elapsed: 84.067 sec
 [flexunit] Suite: UnitTest.Tests.WritingModeTest
 [flexunit] Tests run: 13, Failures: 0, Errors: 0, Skipped: 1, Time elapsed: 1.645 sec
 [flexunit] Suite: UnitTest.Tests.FlowModelTest
 [flexunit] Tests run: 23, Failures: 0, Errors: 0, Skipped: 0, Time elapsed: 3.605 sec
 [flexunit] Suite: UnitTest.Tests.ElementOperationTest
 [flexunit] Tests run: 25, Failures: 0, Errors: 0, Skipped: 1, Time elapsed: 4.433 sec
 [flexunit] Suite: UnitTest.Tests.UndoRedoTest
 [flexunit] Tests run: 1, Failures: 0, Errors: 0, Skipped: 0, Time elapsed: 0.111 sec
 [flexunit] Suite: UnitTest.Tests.ScrollingTest
 [flexunit] Tests run: 15, Failures: 0, Errors: 0, Skipped: 1, Time elapsed: 13.332 sec
 [flexunit] Suite: UnitTest.Tests.AllCharAttributeTest
 [flexunit] Tests run: 6, Failures: 0, Errors: 0, Skipped: 0, Time elapsed: 56.206 sec
 [flexunit] Suite: UnitTest.Tests.BoxTest
 [flexunit] Tests run: 13, Failures: 0, Errors: 0, Skipped: 0, Time elapsed: 3.708 sec
 [flexunit] Suite: UnitTest.Tests.ContainerAttributeTest
 [flexunit] Tests run: 31, Failures: 0, Errors: 0, Skipped: 4, Time elapsed: 480.069 sec
 [flexunit] Suite: UnitTest.Tests.CompositionTest
 [flexunit] Tests run: 24, Failures: 0, Errors: 0, Skipped: 4, Time elapsed: 8.725 sec
 [flexunit] 
 [flexunit] Results :
 [flexunit] 
 [flexunit] Tests run: 428, Failures: 1, Errors: 0, Skipped: 22, Time elapsed: 711.201 sec
 [flexunit] 

BUILD FAILED
<http://apacheflexbuild.cloudapp.net:8080/job/flex-tlf/ws/build.xml>:312: FlexUnit tests failed during the test run.

Total time: 15 minutes 34 seconds
Picked up JAVA_TOOL_OPTIONS: -Dfile.encoding=UTF8
Build step 'Invoke Ant' marked build as failure
Archiving artifacts
Recording test results

Build failed in Jenkins: flex-tlf #333

Posted by fl...@gmail.com.
See <http://apacheflexbuild.cloudapp.net:8080/job/flex-tlf/333/>

------------------------------------------
Started by timer
Building remotely on flex_sdk_slave2 in workspace <http://apacheflexbuild.cloudapp.net:8080/job/flex-tlf/ws/>
 > C:\Program Files (x86)\Git\cmd\git.exe rev-parse --is-inside-work-tree # timeout=10
Fetching changes from the remote Git repository
 > C:\Program Files (x86)\Git\cmd\git.exe config remote.origin.url https://git-wip-us.apache.org/repos/asf/flex-tlf.git # timeout=10
Fetching upstream changes from https://git-wip-us.apache.org/repos/asf/flex-tlf.git
 > C:\Program Files (x86)\Git\cmd\git.exe --version # timeout=10
 > C:\Program Files (x86)\Git\cmd\git.exe fetch --tags --progress https://git-wip-us.apache.org/repos/asf/flex-tlf.git +refs/heads/*:refs/remotes/origin/*
 > C:\Program Files (x86)\Git\cmd\git.exe rev-parse "origin/develop^{commit}" # timeout=10
Checking out Revision 316a70f6538dd325303e639d146ed634004d1faa (origin/develop)
 > C:\Program Files (x86)\Git\cmd\git.exe config core.sparsecheckout # timeout=10
 > C:\Program Files (x86)\Git\cmd\git.exe checkout -f 316a70f6538dd325303e639d146ed634004d1faa
 > C:\Program Files (x86)\Git\cmd\git.exe rev-list 316a70f6538dd325303e639d146ed634004d1faa # timeout=10
[flex-tlf] $ cmd.exe /C '"c:\Jenkins\tools\hudson.tasks.Ant_AntInstallation\c_apache-ant-1.9.3\bin\ant.bat -file build.xml all && exit %%ERRORLEVEL%%"'
Buildfile: <http://apacheflexbuild.cloudapp.net:8080/job/flex-tlf/ws/build.xml>
     [echo] FLEX_HOME is <http://apacheflexbuild.cloudapp.net:8080/job/flex-tlf/ws/../flex-sdk>
     [echo] Minimal test is set false

clean:
   [delete] Deleting directory <http://apacheflexbuild.cloudapp.net:8080/job/flex-tlf/ws/bin>
   [delete] Deleting: <http://apacheflexbuild.cloudapp.net:8080/job/flex-tlf/ws/bundles.properties>

textLayout:
    [compc] Loading configuration file C:\Jenkins\workspace\flex-sdk\frameworks\flex-config.xml
    [compc] C:\Jenkins\workspace\flex-tlf\bin\textLayout.swc (548687 bytes)
    [compc] Picked up JAVA_TOOL_OPTIONS: -Dfile.encoding=UTF8

main:

asTestApps:
     [echo] FLEX_HOME is <http://apacheflexbuild.cloudapp.net:8080/job/flex-tlf/ws/../flex-sdk>
     [echo] Minimal test is set false

asTestApp:
    [mxmlc] Loading configuration file C:\Jenkins\workspace\flex-sdk\frameworks\flex-config.xml
    [mxmlc] C:\Jenkins\workspace\flex-tlf\bin\apps\asTestApps\bin\ExplicitFormField.swf (519804 bytes)
    [mxmlc] Picked up JAVA_TOOL_OPTIONS: -Dfile.encoding=UTF8
     [echo] FLEX_HOME is <http://apacheflexbuild.cloudapp.net:8080/job/flex-tlf/ws/../flex-sdk>
     [echo] Minimal test is set false

asTestApp:
    [mxmlc] Loading configuration file C:\Jenkins\workspace\flex-sdk\frameworks\flex-config.xml
    [mxmlc] C:\Jenkins\workspace\flex-tlf\bin\apps\asTestApps\bin\TCMTestFocus2.swf (527000 bytes)
    [mxmlc] Picked up JAVA_TOOL_OPTIONS: -Dfile.encoding=UTF8
     [echo] FLEX_HOME is <http://apacheflexbuild.cloudapp.net:8080/job/flex-tlf/ws/../flex-sdk>
     [echo] Minimal test is set false

asTestApp:
    [mxmlc] Loading configuration file C:\Jenkins\workspace\flex-sdk\frameworks\flex-config.xml
    [mxmlc] C:\Jenkins\workspace\flex-tlf\bin\apps\asTestApps\bin\AliceScroll.swf (588507 bytes)
    [mxmlc] Picked up JAVA_TOOL_OPTIONS: -Dfile.encoding=UTF8
     [echo] FLEX_HOME is <http://apacheflexbuild.cloudapp.net:8080/job/flex-tlf/ws/../flex-sdk>
     [echo] Minimal test is set false

asTestApp:
    [mxmlc] Loading configuration file C:\Jenkins\workspace\flex-sdk\frameworks\flex-config.xml
    [mxmlc] Picked up JAVA_TOOL_OPTIONS: -Dfile.encoding=UTF8
    [mxmlc] C:\Jenkins\workspace\flex-tlf\bin\apps\asTestApps\bin\KeyLogger.swf (2166 bytes)
     [echo] FLEX_HOME is <http://apacheflexbuild.cloudapp.net:8080/job/flex-tlf/ws/../flex-sdk>
     [echo] Minimal test is set false

asTestApp:
    [mxmlc] Loading configuration file C:\Jenkins\workspace\flex-sdk\frameworks\flex-config.xml
    [mxmlc] C:\Jenkins\workspace\flex-tlf\bin\apps\asTestApps\bin\OpHammer.swf (530204 bytes)
    [mxmlc] Picked up JAVA_TOOL_OPTIONS: -Dfile.encoding=UTF8

textLayout_editBar:
    [compc] Loading configuration file C:\Jenkins\workspace\flex-sdk\frameworks\flex-config.xml
    [compc] C:\Jenkins\workspace\flex-tlf\bin\apps\testApps\bin\textLayout_editBar.swc (23173 bytes)
    [compc] Picked up JAVA_TOOL_OPTIONS: -Dfile.encoding=UTF8

textLayout_ui:
    [compc] Loading configuration file C:\Jenkins\workspace\flex-sdk\frameworks\flex-config.xml
    [compc] C:\Jenkins\workspace\flex-tlf\bin\apps\testApps\bin\textLayout_ui.swc (112805 bytes)
    [compc] Picked up JAVA_TOOL_OPTIONS: -Dfile.encoding=UTF8

testApps:
    [mxmlc] Loading configuration file C:\Jenkins\workspace\flex-sdk\frameworks\flex-config.xml
    [mxmlc] C:\Jenkins\workspace\flex-tlf\bin\apps\automation_apps\bin\Flow.swf (2184689 bytes)
    [mxmlc] Picked up JAVA_TOOL_OPTIONS: -Dfile.encoding=UTF8

automation_core:
    [compc] Loading configuration file C:\Jenkins\workspace\flex-sdk\frameworks\flex-config.xml
    [compc] Picked up JAVA_TOOL_OPTIONS: -Dfile.encoding=UTF8
    [compc] C:\Jenkins\workspace\flex-tlf\bin\apps\automation_apps\bin\automation_core.swc (34042 bytes)

automation_tests:
    [compc] Loading configuration file C:\Jenkins\workspace\flex-sdk\frameworks\flex-config.xml
    [compc] C:\Jenkins\workspace\flex-tlf\bin\apps\automation_apps\bin\automation_tests.swc (224188 bytes)
    [compc] Picked up JAVA_TOOL_OPTIONS: -Dfile.encoding=UTF8

automation_apps:
    [mxmlc] Loading configuration file C:\Jenkins\workspace\flex-sdk\frameworks\flex-config.xml
    [mxmlc] C:\Jenkins\workspace\flex-tlf\bin\apps\automation_apps\bin\VellumUnit.swf (2278651 bytes)
    [mxmlc] Picked up JAVA_TOOL_OPTIONS: -Dfile.encoding=UTF8
     [copy] Copying 152 files to <http://apacheflexbuild.cloudapp.net:8080/job/flex-tlf/ws/bin/apps/test>

flexunnit_tests:
 [flexunit] Validating task attributes ...
 [flexunit] Generating default values ...
 [flexunit] Using default working dir [<http://apacheflexbuild.cloudapp.net:8080/job/flex-tlf/ws/]>
 [flexunit] Using the following settings for the test run:
 [flexunit] 	FLEX_HOME: [<http://apacheflexbuild.cloudapp.net:8080/job/flex-tlf/ws/../flex-sdk]>
 [flexunit] 	haltonfailure: [true]
 [flexunit] 	headless: [false]
 [flexunit] 	display: [99]
 [flexunit] 	localTrusted: [true]
 [flexunit] 	player: [flash]
 [flexunit] 	port: [1024]
 [flexunit] 	swf: [<http://apacheflexbuild.cloudapp.net:8080/job/flex-tlf/ws/bin/apps/automation_apps/bin/VellumUnit.swf]>
 [flexunit] 	timeout: [60000ms]
 [flexunit] 	toDir: [<http://apacheflexbuild.cloudapp.net:8080/job/flex-tlf/ws/bin/apps/automation_apps]>
 [flexunit] Setting up server process ...
 [flexunit] Entry [<http://apacheflexbuild.cloudapp.net:8080/job/flex-tlf/ws/bin/apps/automation_apps/bin]> already available in local trust file at [C:\Users\apacheflexbuild\AppData\Roaming\Macromedia\Flash Player\#Security\FlashPlayerTrust\flexUnit.cfg].
 [flexunit] Executing 'rundll32' with arguments:
 [flexunit] 'url.dll,FileProtocolHandler'
 [flexunit] '<http://apacheflexbuild.cloudapp.net:8080/job/flex-tlf/ws/bin/apps/automation_apps/bin/VellumUnit.swf'>
 [flexunit] 
 [flexunit] The ' characters around the executable and arguments are
 [flexunit] not part of the command.
 [flexunit] 
 [flexunit] Starting server ...
 [flexunit] Opening server socket on port [1024].
 [flexunit] Waiting for client connection ...
 [flexunit] Client connected.
 [flexunit] Setting inbound buffer size to [262144] bytes.
 [flexunit] Receiving data ...
 [flexunit] Sending acknowledgement to player to start sending test data ...
 [flexunit] 
 [flexunit] FlexUnit test ShortTextMouseEventRLLTRTest in suite UnitTest.Tests.AllEventTest was ignored.
 [flexunit] FlexUnit test ShortTextMouseEventTBLTRTest in suite UnitTest.Tests.AllEventTest was ignored.
 [flexunit] FlexUnit test ShortTextMouseEventTBRTLTest in suite UnitTest.Tests.AllEventTest was ignored.
 [flexunit] FlexUnit test ShortTextMouseEventRLRTLTest in suite UnitTest.Tests.AllEventTest was ignored.
 [flexunit] FlexUnit test testAllEnumProps in suite UnitTest.Tests.AllParaAttributeTest was ignored.
 [flexunit] FlexUnit test contentWidthCheckLongFloat in suite UnitTest.Tests.FloatTest was ignored.
 [flexunit] FlexUnit test paddingBottomTest ([object Object]) in suite UnitTest.Tests.ContainerAttributeTest was ignored.
 [flexunit] FlexUnit test checkColumnGapOnWidthChangeTest ([object Object]) in suite UnitTest.Tests.ContainerAttributeTest was ignored.
 [flexunit] FlexUnit test checkColumnGapOnWidthChangeTest ([object Object]) in suite UnitTest.Tests.ContainerAttributeTest was ignored.
 [flexunit] FlexUnit test paddingBottomTest ([object Object]) in suite UnitTest.Tests.ContainerAttributeTest was ignored.
 [flexunit] FlexUnit test twoColumnsTest in suite UnitTest.Tests.ScrollingTest was ignored.
 [flexunit] FlexUnit test applyFormatToElementTest in suite UnitTest.Tests.OperationTest was ignored.
 [flexunit] FlexUnit test deletePreviousWordTest in suite UnitTest.Tests.OperationTest was ignored.
 [flexunit] FlexUnit test arabicDirection in suite UnitTest.Tests.WritingModeTest was ignored.
 [flexunit] FlexUnit test spanElementReplaceTextInvalidPos in suite UnitTest.Tests.ElementOperationTest was ignored.
 [flexunit] FlexUnit test arrowUp in suite UnitTest.Tests.GeneralFunctionsTest failed.
 [flexunit] FlexUnit test arrowDown in suite UnitTest.Tests.GeneralFunctionsTest failed.
 [flexunit] FlexUnit test noTabStop in suite UnitTest.Tests.TabTest was ignored.
 [flexunit] FlexUnit test endTabLongStringTest in suite UnitTest.Tests.TabTest was ignored.
 [flexunit] FlexUnit test draggingSelectioinMultiFlows in suite UnitTest.Tests.ContainerTypeTest was ignored.
 [flexunit] FlexUnit test deleteAtContainerStart (simple in suite UnitTest.Tests.CompositionTest was ignored.
 [flexunit] FlexUnit test partialCompositionTest (simple in suite UnitTest.Tests.CompositionTest was ignored.
 [flexunit] FlexUnit test deleteAtContainerStart (asknot in suite UnitTest.Tests.CompositionTest was ignored.
 [flexunit] FlexUnit test partialCompositionTest (asknot in suite UnitTest.Tests.CompositionTest was ignored.
 [flexunit] 
 [flexunit] Stopping server ...
 [flexunit] End of test data reached, sending acknowledgement to player ...
 [flexunit] Closing client connection ...
 [flexunit] Closing server on port [1024] ...
 [flexunit] Analyzing reports ...
 [flexunit] 
 [flexunit] Suite: UnitTest.Tests.OperationTest
 [flexunit] Tests run: 47, Failures: 0, Errors: 0, Skipped: 2, Time elapsed: 17.588 sec
 [flexunit] Suite: UnitTest.Tests.GeneralFunctionsTest
 [flexunit] Tests run: 36, Failures: 2, Errors: 0, Skipped: 0, Time elapsed: 9.481 sec
 [flexunit] Suite: UnitTest.Tests.CrossContainerTest
 [flexunit] Tests run: 1, Failures: 0, Errors: 0, Skipped: 0, Time elapsed: 0.112 sec
 [flexunit] Suite: UnitTest.Tests.AllParaAttributeTest
 [flexunit] Tests run: 6, Failures: 0, Errors: 0, Skipped: 1, Time elapsed: 4.717 sec
 [flexunit] Suite: UnitTest.Tests.TabTest
 [flexunit] Tests run: 19, Failures: 0, Errors: 0, Skipped: 2, Time elapsed: 1.881 sec
 [flexunit] Suite: UnitTest.Tests.EventOverrideTest
 [flexunit] Tests run: 12, Failures: 0, Errors: 0, Skipped: 0, Time elapsed: 1.301 sec
 [flexunit] Suite: UnitTest.Tests.AllContAttributeTest
 [flexunit] Tests run: 6, Failures: 0, Errors: 0, Skipped: 0, Time elapsed: 10.791 sec
 [flexunit] Suite: UnitTest.Tests.AccessibilityMethodsTest
 [flexunit] Tests run: 5, Failures: 0, Errors: 0, Skipped: 0, Time elapsed: 0.546 sec
 [flexunit] Suite: UnitTest.Tests.FactoryImportTest
 [flexunit] Tests run: 1, Failures: 0, Errors: 0, Skipped: 0, Time elapsed: 0.045 sec
 [flexunit] Suite: UnitTest.Tests.AllEventTest
 [flexunit] Tests run: 13, Failures: 0, Errors: 0, Skipped: 4, Time elapsed: 2.410 sec
 [flexunit] Suite: UnitTest.Tests.BoundsAndAlignmentTest
 [flexunit] Tests run: 6, Failures: 0, Errors: 0, Skipped: 0, Time elapsed: 4.122 sec
 [flexunit] Suite: UnitTest.Tests.TextFlowEditTest
 [flexunit] Tests run: 3, Failures: 0, Errors: 0, Skipped: 0, Time elapsed: 0.451 sec
 [flexunit] Suite: UnitTest.Tests.ContainerTypeTest
 [flexunit] Tests run: 22, Failures: 0, Errors: 0, Skipped: 1, Time elapsed: 0.868 sec
 [flexunit] Suite: UnitTest.Tests.FloatTest
 [flexunit] Tests run: 56, Failures: 0, Errors: 0, Skipped: 1, Time elapsed: 83.101 sec
 [flexunit] Suite: UnitTest.Tests.AttributeTest
 [flexunit] Tests run: 44, Failures: 0, Errors: 0, Skipped: 0, Time elapsed: 5.519 sec
 [flexunit] Suite: UnitTest.Tests.FlowModelTest
 [flexunit] Tests run: 23, Failures: 0, Errors: 0, Skipped: 0, Time elapsed: 3.964 sec
 [flexunit] Suite: UnitTest.Tests.ElementOperationTest
 [flexunit] Tests run: 25, Failures: 0, Errors: 0, Skipped: 1, Time elapsed: 5.534 sec
 [flexunit] Suite: UnitTest.Tests.WritingModeTest
 [flexunit] Tests run: 13, Failures: 0, Errors: 0, Skipped: 1, Time elapsed: 1.779 sec
 [flexunit] Suite: UnitTest.Tests.UndoRedoTest
 [flexunit] Tests run: 1, Failures: 0, Errors: 0, Skipped: 0, Time elapsed: 0.211 sec
 [flexunit] Suite: UnitTest.Tests.BoxTest
 [flexunit] Tests run: 13, Failures: 0, Errors: 0, Skipped: 0, Time elapsed: 4.771 sec
 [flexunit] Suite: UnitTest.Tests.ScrollingTest
 [flexunit] Tests run: 15, Failures: 0, Errors: 0, Skipped: 1, Time elapsed: 15.876 sec
 [flexunit] Suite: UnitTest.Tests.AllCharAttributeTest
 [flexunit] Tests run: 6, Failures: 0, Errors: 0, Skipped: 0, Time elapsed: 16.309 sec
 [flexunit] Suite: UnitTest.Tests.ContainerAttributeTest
 [flexunit] Tests run: 31, Failures: 0, Errors: 0, Skipped: 4, Time elapsed: 395.932 sec
 [flexunit] Suite: UnitTest.Tests.CompositionTest
 [flexunit] Tests run: 24, Failures: 0, Errors: 0, Skipped: 4, Time elapsed: 9.165 sec
 [flexunit] 
 [flexunit] Results :
 [flexunit] 
 [flexunit] Tests run: 428, Failures: 2, Errors: 0, Skipped: 22, Time elapsed: 596.474 sec
 [flexunit] 

BUILD FAILED
<http://apacheflexbuild.cloudapp.net:8080/job/flex-tlf/ws/build.xml>:312: FlexUnit tests failed during the test run.

Total time: 13 minutes 42 seconds
Picked up JAVA_TOOL_OPTIONS: -Dfile.encoding=UTF8
Build step 'Invoke Ant' marked build as failure
Archiving artifacts
Recording test results

Build failed in Jenkins: flex-tlf #332

Posted by fl...@gmail.com.
See <http://apacheflexbuild.cloudapp.net:8080/job/flex-tlf/332/>

------------------------------------------
Started by timer
Building remotely on flex_sdk_slave2 in workspace <http://apacheflexbuild.cloudapp.net:8080/job/flex-tlf/ws/>
 > C:\Program Files (x86)\Git\cmd\git.exe rev-parse --is-inside-work-tree # timeout=10
Fetching changes from the remote Git repository
 > C:\Program Files (x86)\Git\cmd\git.exe config remote.origin.url https://git-wip-us.apache.org/repos/asf/flex-tlf.git # timeout=10
Fetching upstream changes from https://git-wip-us.apache.org/repos/asf/flex-tlf.git
 > C:\Program Files (x86)\Git\cmd\git.exe --version # timeout=10
 > C:\Program Files (x86)\Git\cmd\git.exe fetch --tags --progress https://git-wip-us.apache.org/repos/asf/flex-tlf.git +refs/heads/*:refs/remotes/origin/*
 > C:\Program Files (x86)\Git\cmd\git.exe rev-parse "origin/develop^{commit}" # timeout=10
Checking out Revision 316a70f6538dd325303e639d146ed634004d1faa (origin/develop)
 > C:\Program Files (x86)\Git\cmd\git.exe config core.sparsecheckout # timeout=10
 > C:\Program Files (x86)\Git\cmd\git.exe checkout -f 316a70f6538dd325303e639d146ed634004d1faa
 > C:\Program Files (x86)\Git\cmd\git.exe rev-list 316a70f6538dd325303e639d146ed634004d1faa # timeout=10
[flex-tlf] $ cmd.exe /C '"c:\Jenkins\tools\hudson.tasks.Ant_AntInstallation\c_apache-ant-1.9.3\bin\ant.bat -file build.xml all && exit %%ERRORLEVEL%%"'
Buildfile: <http://apacheflexbuild.cloudapp.net:8080/job/flex-tlf/ws/build.xml>
     [echo] FLEX_HOME is <http://apacheflexbuild.cloudapp.net:8080/job/flex-tlf/ws/../flex-sdk>
     [echo] Minimal test is set false

clean:
   [delete] Deleting directory <http://apacheflexbuild.cloudapp.net:8080/job/flex-tlf/ws/bin>
   [delete] Deleting: <http://apacheflexbuild.cloudapp.net:8080/job/flex-tlf/ws/bundles.properties>

textLayout:
    [compc] Loading configuration file C:\Jenkins\workspace\flex-sdk\frameworks\flex-config.xml
    [compc] C:\Jenkins\workspace\flex-tlf\bin\textLayout.swc (548680 bytes)
    [compc] Picked up JAVA_TOOL_OPTIONS: -Dfile.encoding=UTF8

main:

asTestApps:
     [echo] FLEX_HOME is <http://apacheflexbuild.cloudapp.net:8080/job/flex-tlf/ws/../flex-sdk>
     [echo] Minimal test is set false

asTestApp:
    [mxmlc] Loading configuration file C:\Jenkins\workspace\flex-sdk\frameworks\flex-config.xml
    [mxmlc] C:\Jenkins\workspace\flex-tlf\bin\apps\asTestApps\bin\ExplicitFormField.swf (519804 bytes)
    [mxmlc] Picked up JAVA_TOOL_OPTIONS: -Dfile.encoding=UTF8
     [echo] FLEX_HOME is <http://apacheflexbuild.cloudapp.net:8080/job/flex-tlf/ws/../flex-sdk>
     [echo] Minimal test is set false

asTestApp:
    [mxmlc] Loading configuration file C:\Jenkins\workspace\flex-sdk\frameworks\flex-config.xml
    [mxmlc] C:\Jenkins\workspace\flex-tlf\bin\apps\asTestApps\bin\TCMTestFocus2.swf (527001 bytes)
    [mxmlc] Picked up JAVA_TOOL_OPTIONS: -Dfile.encoding=UTF8
     [echo] FLEX_HOME is <http://apacheflexbuild.cloudapp.net:8080/job/flex-tlf/ws/../flex-sdk>
     [echo] Minimal test is set false

asTestApp:
    [mxmlc] Loading configuration file C:\Jenkins\workspace\flex-sdk\frameworks\flex-config.xml
    [mxmlc] C:\Jenkins\workspace\flex-tlf\bin\apps\asTestApps\bin\AliceScroll.swf (588505 bytes)
    [mxmlc] Picked up JAVA_TOOL_OPTIONS: -Dfile.encoding=UTF8
     [echo] FLEX_HOME is <http://apacheflexbuild.cloudapp.net:8080/job/flex-tlf/ws/../flex-sdk>
     [echo] Minimal test is set false

asTestApp:
    [mxmlc] Loading configuration file C:\Jenkins\workspace\flex-sdk\frameworks\flex-config.xml
    [mxmlc] Picked up JAVA_TOOL_OPTIONS: -Dfile.encoding=UTF8
    [mxmlc] C:\Jenkins\workspace\flex-tlf\bin\apps\asTestApps\bin\KeyLogger.swf (2165 bytes)
     [echo] FLEX_HOME is <http://apacheflexbuild.cloudapp.net:8080/job/flex-tlf/ws/../flex-sdk>
     [echo] Minimal test is set false

asTestApp:
    [mxmlc] Loading configuration file C:\Jenkins\workspace\flex-sdk\frameworks\flex-config.xml
    [mxmlc] Picked up JAVA_TOOL_OPTIONS: -Dfile.encoding=UTF8
    [mxmlc] C:\Jenkins\workspace\flex-tlf\bin\apps\asTestApps\bin\OpHammer.swf (530204 bytes)

textLayout_editBar:
    [compc] Loading configuration file C:\Jenkins\workspace\flex-sdk\frameworks\flex-config.xml
    [compc] C:\Jenkins\workspace\flex-tlf\bin\apps\testApps\bin\textLayout_editBar.swc (23176 bytes)
    [compc] Picked up JAVA_TOOL_OPTIONS: -Dfile.encoding=UTF8

textLayout_ui:
    [compc] Loading configuration file C:\Jenkins\workspace\flex-sdk\frameworks\flex-config.xml
    [compc] C:\Jenkins\workspace\flex-tlf\bin\apps\testApps\bin\textLayout_ui.swc (112804 bytes)
    [compc] Picked up JAVA_TOOL_OPTIONS: -Dfile.encoding=UTF8

testApps:
    [mxmlc] Loading configuration file C:\Jenkins\workspace\flex-sdk\frameworks\flex-config.xml
    [mxmlc] C:\Jenkins\workspace\flex-tlf\bin\apps\automation_apps\bin\Flow.swf (2184692 bytes)
    [mxmlc] Picked up JAVA_TOOL_OPTIONS: -Dfile.encoding=UTF8

automation_core:
    [compc] Loading configuration file C:\Jenkins\workspace\flex-sdk\frameworks\flex-config.xml
    [compc] C:\Jenkins\workspace\flex-tlf\bin\apps\automation_apps\bin\automation_core.swc (34041 bytes)
    [compc] Picked up JAVA_TOOL_OPTIONS: -Dfile.encoding=UTF8

automation_tests:
    [compc] Loading configuration file C:\Jenkins\workspace\flex-sdk\frameworks\flex-config.xml
    [compc] C:\Jenkins\workspace\flex-tlf\bin\apps\automation_apps\bin\automation_tests.swc (224186 bytes)
    [compc] Picked up JAVA_TOOL_OPTIONS: -Dfile.encoding=UTF8

automation_apps:
    [mxmlc] Loading configuration file C:\Jenkins\workspace\flex-sdk\frameworks\flex-config.xml
    [mxmlc] C:\Jenkins\workspace\flex-tlf\bin\apps\automation_apps\bin\VellumUnit.swf (2278770 bytes)
    [mxmlc] Picked up JAVA_TOOL_OPTIONS: -Dfile.encoding=UTF8
     [copy] Copying 152 files to <http://apacheflexbuild.cloudapp.net:8080/job/flex-tlf/ws/bin/apps/test>

flexunnit_tests:
 [flexunit] Validating task attributes ...
 [flexunit] Generating default values ...
 [flexunit] Using default working dir [<http://apacheflexbuild.cloudapp.net:8080/job/flex-tlf/ws/]>
 [flexunit] Using the following settings for the test run:
 [flexunit] 	FLEX_HOME: [<http://apacheflexbuild.cloudapp.net:8080/job/flex-tlf/ws/../flex-sdk]>
 [flexunit] 	haltonfailure: [true]
 [flexunit] 	headless: [false]
 [flexunit] 	display: [99]
 [flexunit] 	localTrusted: [true]
 [flexunit] 	player: [flash]
 [flexunit] 	port: [1024]
 [flexunit] 	swf: [<http://apacheflexbuild.cloudapp.net:8080/job/flex-tlf/ws/bin/apps/automation_apps/bin/VellumUnit.swf]>
 [flexunit] 	timeout: [60000ms]
 [flexunit] 	toDir: [<http://apacheflexbuild.cloudapp.net:8080/job/flex-tlf/ws/bin/apps/automation_apps]>
 [flexunit] Setting up server process ...
 [flexunit] Entry [<http://apacheflexbuild.cloudapp.net:8080/job/flex-tlf/ws/bin/apps/automation_apps/bin]> already available in local trust file at [C:\Users\apacheflexbuild\AppData\Roaming\Macromedia\Flash Player\#Security\FlashPlayerTrust\flexUnit.cfg].
 [flexunit] Executing 'rundll32' with arguments:
 [flexunit] 'url.dll,FileProtocolHandler'
 [flexunit] '<http://apacheflexbuild.cloudapp.net:8080/job/flex-tlf/ws/bin/apps/automation_apps/bin/VellumUnit.swf'>
 [flexunit] 
 [flexunit] The ' characters around the executable and arguments are
 [flexunit] not part of the command.
 [flexunit] 
 [flexunit] Starting server ...
 [flexunit] Opening server socket on port [1024].
 [flexunit] Waiting for client connection ...
 [flexunit] Client connected.
 [flexunit] Setting inbound buffer size to [262144] bytes.
 [flexunit] Receiving data ...
 [flexunit] Sending acknowledgement to player to start sending test data ...
 [flexunit] 
 [flexunit] FlexUnit test ShortTextMouseEventTBLTRTest in suite UnitTest.Tests.AllEventTest was ignored.
 [flexunit] FlexUnit test ShortTextMouseEventTBRTLTest in suite UnitTest.Tests.AllEventTest was ignored.
 [flexunit] FlexUnit test ShortTextMouseEventRLLTRTest in suite UnitTest.Tests.AllEventTest was ignored.
 [flexunit] FlexUnit test ShortTextMouseEventRLRTLTest in suite UnitTest.Tests.AllEventTest was ignored.
 [flexunit] FlexUnit test testAllEnumProps in suite UnitTest.Tests.AllParaAttributeTest was ignored.
 [flexunit] FlexUnit test contentWidthCheckLongFloat in suite UnitTest.Tests.FloatTest was ignored.
 [flexunit] FlexUnit test paddingBottomTest ([object Object]) in suite UnitTest.Tests.ContainerAttributeTest was ignored.
 [flexunit] FlexUnit test checkColumnGapOnWidthChangeTest ([object Object]) in suite UnitTest.Tests.ContainerAttributeTest was ignored.
 [flexunit] FlexUnit test checkColumnGapOnWidthChangeTest ([object Object]) in suite UnitTest.Tests.ContainerAttributeTest was ignored.
 [flexunit] FlexUnit test paddingBottomTest ([object Object]) in suite UnitTest.Tests.ContainerAttributeTest was ignored.
 [flexunit] FlexUnit test twoColumnsTest in suite UnitTest.Tests.ScrollingTest was ignored.
 [flexunit] FlexUnit test applyFormatToElementTest in suite UnitTest.Tests.OperationTest was ignored.
 [flexunit] FlexUnit test deletePreviousWordTest in suite UnitTest.Tests.OperationTest was ignored.
 [flexunit] FlexUnit test arabicDirection in suite UnitTest.Tests.WritingModeTest was ignored.
 [flexunit] FlexUnit test spanElementReplaceTextInvalidPos in suite UnitTest.Tests.ElementOperationTest was ignored.
 [flexunit] FlexUnit test arrowDown in suite UnitTest.Tests.GeneralFunctionsTest failed.
 [flexunit] FlexUnit test arrowUp in suite UnitTest.Tests.GeneralFunctionsTest failed.
 [flexunit] FlexUnit test noTabStop in suite UnitTest.Tests.TabTest was ignored.
 [flexunit] FlexUnit test endTabLongStringTest in suite UnitTest.Tests.TabTest was ignored.
 [flexunit] FlexUnit test draggingSelectioinMultiFlows in suite UnitTest.Tests.ContainerTypeTest was ignored.
 [flexunit] FlexUnit test deleteAtContainerStart (simple in suite UnitTest.Tests.CompositionTest was ignored.
 [flexunit] FlexUnit test partialCompositionTest (simple in suite UnitTest.Tests.CompositionTest was ignored.
 [flexunit] FlexUnit test deleteAtContainerStart (asknot in suite UnitTest.Tests.CompositionTest was ignored.
 [flexunit] FlexUnit test partialCompositionTest (asknot in suite UnitTest.Tests.CompositionTest was ignored.
 [flexunit] 
 [flexunit] Stopping server ...
 [flexunit] End of test data reached, sending acknowledgement to player ...
 [flexunit] Closing client connection ...
 [flexunit] Closing server on port [1024] ...
 [flexunit] Analyzing reports ...
 [flexunit] 
 [flexunit] Suite: UnitTest.Tests.OperationTest
 [flexunit] Tests run: 47, Failures: 0, Errors: 0, Skipped: 2, Time elapsed: 17.336 sec
 [flexunit] Suite: UnitTest.Tests.GeneralFunctionsTest
 [flexunit] Tests run: 36, Failures: 2, Errors: 0, Skipped: 0, Time elapsed: 9.202 sec
 [flexunit] Suite: UnitTest.Tests.CrossContainerTest
 [flexunit] Tests run: 1, Failures: 0, Errors: 0, Skipped: 0, Time elapsed: 0.113 sec
 [flexunit] Suite: UnitTest.Tests.AllParaAttributeTest
 [flexunit] Tests run: 6, Failures: 0, Errors: 0, Skipped: 1, Time elapsed: 4.967 sec
 [flexunit] Suite: UnitTest.Tests.TabTest
 [flexunit] Tests run: 19, Failures: 0, Errors: 0, Skipped: 2, Time elapsed: 2.067 sec
 [flexunit] Suite: UnitTest.Tests.EventOverrideTest
 [flexunit] Tests run: 12, Failures: 0, Errors: 0, Skipped: 0, Time elapsed: 1.286 sec
 [flexunit] Suite: UnitTest.Tests.AllContAttributeTest
 [flexunit] Tests run: 6, Failures: 0, Errors: 0, Skipped: 0, Time elapsed: 12.266 sec
 [flexunit] Suite: UnitTest.Tests.AccessibilityMethodsTest
 [flexunit] Tests run: 5, Failures: 0, Errors: 0, Skipped: 0, Time elapsed: 0.574 sec
 [flexunit] Suite: UnitTest.Tests.FactoryImportTest
 [flexunit] Tests run: 1, Failures: 0, Errors: 0, Skipped: 0, Time elapsed: 0.041 sec
 [flexunit] Suite: UnitTest.Tests.AllEventTest
 [flexunit] Tests run: 13, Failures: 0, Errors: 0, Skipped: 4, Time elapsed: 2.128 sec
 [flexunit] Suite: UnitTest.Tests.BoundsAndAlignmentTest
 [flexunit] Tests run: 6, Failures: 0, Errors: 0, Skipped: 0, Time elapsed: 4.248 sec
 [flexunit] Suite: UnitTest.Tests.TextFlowEditTest
 [flexunit] Tests run: 3, Failures: 0, Errors: 0, Skipped: 0, Time elapsed: 0.460 sec
 [flexunit] Suite: UnitTest.Tests.ContainerTypeTest
 [flexunit] Tests run: 22, Failures: 0, Errors: 0, Skipped: 1, Time elapsed: 0.884 sec
 [flexunit] Suite: UnitTest.Tests.FloatTest
 [flexunit] Tests run: 56, Failures: 0, Errors: 0, Skipped: 1, Time elapsed: 82.146 sec
 [flexunit] Suite: UnitTest.Tests.AttributeTest
 [flexunit] Tests run: 44, Failures: 0, Errors: 0, Skipped: 0, Time elapsed: 5.175 sec
 [flexunit] Suite: UnitTest.Tests.FlowModelTest
 [flexunit] Tests run: 23, Failures: 0, Errors: 0, Skipped: 0, Time elapsed: 3.788 sec
 [flexunit] Suite: UnitTest.Tests.ElementOperationTest
 [flexunit] Tests run: 25, Failures: 0, Errors: 0, Skipped: 1, Time elapsed: 5.475 sec
 [flexunit] Suite: UnitTest.Tests.WritingModeTest
 [flexunit] Tests run: 13, Failures: 0, Errors: 0, Skipped: 1, Time elapsed: 1.735 sec
 [flexunit] Suite: UnitTest.Tests.UndoRedoTest
 [flexunit] Tests run: 1, Failures: 0, Errors: 0, Skipped: 0, Time elapsed: 0.212 sec
 [flexunit] Suite: UnitTest.Tests.BoxTest
 [flexunit] Tests run: 13, Failures: 0, Errors: 0, Skipped: 0, Time elapsed: 4.786 sec
 [flexunit] Suite: UnitTest.Tests.ScrollingTest
 [flexunit] Tests run: 15, Failures: 0, Errors: 0, Skipped: 1, Time elapsed: 13.367 sec
 [flexunit] Suite: UnitTest.Tests.AllCharAttributeTest
 [flexunit] Tests run: 6, Failures: 0, Errors: 0, Skipped: 0, Time elapsed: 89.234 sec
 [flexunit] Suite: UnitTest.Tests.ContainerAttributeTest
 [flexunit] Tests run: 31, Failures: 0, Errors: 0, Skipped: 4, Time elapsed: 406.483 sec
 [flexunit] Suite: UnitTest.Tests.CompositionTest
 [flexunit] Tests run: 24, Failures: 0, Errors: 0, Skipped: 4, Time elapsed: 8.637 sec
 [flexunit] 
 [flexunit] Results :
 [flexunit] 
 [flexunit] Tests run: 428, Failures: 2, Errors: 0, Skipped: 22, Time elapsed: 676.610 sec
 [flexunit] 

BUILD FAILED
<http://apacheflexbuild.cloudapp.net:8080/job/flex-tlf/ws/build.xml>:312: FlexUnit tests failed during the test run.

Total time: 15 minutes 6 seconds
Picked up JAVA_TOOL_OPTIONS: -Dfile.encoding=UTF8
Build step 'Invoke Ant' marked build as failure
Archiving artifacts
Recording test results