You are viewing a plain text version of this content. The canonical link for it is here.
Posted to dev@kafka.apache.org by Apache Jenkins Server <je...@builds.apache.org> on 2019/06/08 05:03:33 UTC

Build failed in Jenkins: kafka-2.3-jdk8 #46

See <https://builds.apache.org/job/kafka-2.3-jdk8/46/display/redirect?page=changes>

Changes:

[cmccabe] KAFKA-8499: ensure java is in PATH for ducker system tests (#6898)

[cshapi] MINOR: Lower producer throughput in flaky upgrade system test

[cshapi] MINOR: Fix race condition on shutdown of verifiable producer

------------------------------------------
[...truncated 2.88 MB...]
kafka.utils.LoggingTest > testLog4jControllerIsRegistered STARTED

kafka.utils.LoggingTest > testLog4jControllerIsRegistered PASSED

kafka.utils.LoggingTest > testLogName STARTED

kafka.utils.LoggingTest > testLogName PASSED

kafka.utils.LoggingTest > testLogNameOverride STARTED

kafka.utils.LoggingTest > testLogNameOverride PASSED

kafka.utils.ZkUtilsTest > testGetSequenceIdMethod STARTED

kafka.utils.ZkUtilsTest > testGetSequenceIdMethod PASSED

kafka.utils.ZkUtilsTest > testAbortedConditionalDeletePath STARTED

kafka.utils.ZkUtilsTest > testAbortedConditionalDeletePath PASSED

kafka.utils.ZkUtilsTest > testGetAllPartitionsTopicWithoutPartitions STARTED

kafka.utils.ZkUtilsTest > testGetAllPartitionsTopicWithoutPartitions PASSED

kafka.utils.ZkUtilsTest > testSuccessfulConditionalDeletePath STARTED

kafka.utils.ZkUtilsTest > testSuccessfulConditionalDeletePath PASSED

kafka.utils.ZkUtilsTest > testPersistentSequentialPath STARTED

kafka.utils.ZkUtilsTest > testPersistentSequentialPath PASSED

kafka.utils.ZkUtilsTest > testClusterIdentifierJsonParsing STARTED

kafka.utils.ZkUtilsTest > testClusterIdentifierJsonParsing PASSED

kafka.utils.ZkUtilsTest > testGetLeaderIsrAndEpochForPartition STARTED

kafka.utils.ZkUtilsTest > testGetLeaderIsrAndEpochForPartition PASSED

kafka.utils.CoreUtilsTest > testGenerateUuidAsBase64 STARTED

kafka.utils.CoreUtilsTest > testGenerateUuidAsBase64 PASSED

kafka.utils.CoreUtilsTest > testAbs STARTED

kafka.utils.CoreUtilsTest > testAbs PASSED

kafka.utils.CoreUtilsTest > testReplaceSuffix STARTED

kafka.utils.CoreUtilsTest > testReplaceSuffix PASSED

kafka.utils.CoreUtilsTest > testCircularIterator STARTED

kafka.utils.CoreUtilsTest > testCircularIterator PASSED

kafka.utils.CoreUtilsTest > testReadBytes STARTED

kafka.utils.CoreUtilsTest > testReadBytes PASSED

kafka.utils.CoreUtilsTest > testCsvList STARTED

kafka.utils.CoreUtilsTest > testCsvList PASSED

kafka.utils.CoreUtilsTest > testReadInt STARTED

kafka.utils.CoreUtilsTest > testReadInt PASSED

kafka.utils.CoreUtilsTest > testAtomicGetOrUpdate STARTED

kafka.utils.CoreUtilsTest > testAtomicGetOrUpdate PASSED

kafka.utils.CoreUtilsTest > testUrlSafeBase64EncodeUUID STARTED

kafka.utils.CoreUtilsTest > testUrlSafeBase64EncodeUUID PASSED

kafka.utils.CoreUtilsTest > testCsvMap STARTED

kafka.utils.CoreUtilsTest > testCsvMap PASSED

kafka.utils.CoreUtilsTest > testInLock STARTED

kafka.utils.CoreUtilsTest > testInLock PASSED

kafka.utils.CoreUtilsTest > testTryAll STARTED

kafka.utils.CoreUtilsTest > testTryAll PASSED

kafka.utils.CoreUtilsTest > testSwallow STARTED

kafka.utils.CoreUtilsTest > testSwallow PASSED

kafka.utils.json.JsonValueTest > testJsonObjectIterator STARTED

kafka.utils.json.JsonValueTest > testJsonObjectIterator PASSED

kafka.utils.json.JsonValueTest > testDecodeLong STARTED

kafka.utils.json.JsonValueTest > testDecodeLong PASSED

kafka.utils.json.JsonValueTest > testAsJsonObject STARTED

kafka.utils.json.JsonValueTest > testAsJsonObject PASSED

kafka.utils.json.JsonValueTest > testDecodeDouble STARTED

kafka.utils.json.JsonValueTest > testDecodeDouble PASSED

kafka.utils.json.JsonValueTest > testDecodeOption STARTED

kafka.utils.json.JsonValueTest > testDecodeOption PASSED

kafka.utils.json.JsonValueTest > testDecodeString STARTED

kafka.utils.json.JsonValueTest > testDecodeString PASSED

kafka.utils.json.JsonValueTest > testJsonValueToString STARTED

kafka.utils.json.JsonValueTest > testJsonValueToString PASSED

kafka.utils.json.JsonValueTest > testAsJsonObjectOption STARTED

kafka.utils.json.JsonValueTest > testAsJsonObjectOption PASSED

kafka.utils.json.JsonValueTest > testAsJsonArrayOption STARTED

kafka.utils.json.JsonValueTest > testAsJsonArrayOption PASSED

kafka.utils.json.JsonValueTest > testAsJsonArray STARTED

kafka.utils.json.JsonValueTest > testAsJsonArray PASSED

kafka.utils.json.JsonValueTest > testJsonValueHashCode STARTED

kafka.utils.json.JsonValueTest > testJsonValueHashCode PASSED

kafka.utils.json.JsonValueTest > testDecodeInt STARTED

kafka.utils.json.JsonValueTest > testDecodeInt PASSED

kafka.utils.json.JsonValueTest > testDecodeMap STARTED

kafka.utils.json.JsonValueTest > testDecodeMap PASSED

kafka.utils.json.JsonValueTest > testDecodeSeq STARTED

kafka.utils.json.JsonValueTest > testDecodeSeq PASSED

kafka.utils.json.JsonValueTest > testJsonObjectGet STARTED

kafka.utils.json.JsonValueTest > testJsonObjectGet PASSED

kafka.utils.json.JsonValueTest > testJsonValueEquals STARTED

kafka.utils.json.JsonValueTest > testJsonValueEquals PASSED

kafka.utils.json.JsonValueTest > testJsonArrayIterator STARTED

kafka.utils.json.JsonValueTest > testJsonArrayIterator PASSED

kafka.utils.json.JsonValueTest > testJsonObjectApply STARTED

kafka.utils.json.JsonValueTest > testJsonObjectApply PASSED

kafka.utils.json.JsonValueTest > testDecodeBoolean STARTED

kafka.utils.json.JsonValueTest > testDecodeBoolean PASSED

kafka.utils.TopicFilterTest > testWhitelists STARTED

kafka.utils.TopicFilterTest > testWhitelists PASSED

kafka.utils.PasswordEncoderTest > testEncoderConfigChange STARTED

kafka.utils.PasswordEncoderTest > testEncoderConfigChange PASSED

kafka.utils.PasswordEncoderTest > testEncodeDecodeAlgorithms STARTED

kafka.utils.PasswordEncoderTest > testEncodeDecodeAlgorithms PASSED

kafka.utils.PasswordEncoderTest > testEncodeDecode STARTED

kafka.utils.PasswordEncoderTest > testEncodeDecode PASSED

integration.kafka.api.ConsumerTopicCreationTest > testAutoTopicCreation[brokerTopicCreation=true, consumerTopicCreation=true] STARTED

integration.kafka.api.ConsumerTopicCreationTest > testAutoTopicCreation[brokerTopicCreation=true, consumerTopicCreation=true] PASSED

integration.kafka.api.ConsumerTopicCreationTest > testAutoTopicCreation[brokerTopicCreation=true, consumerTopicCreation=false] STARTED

integration.kafka.api.ConsumerTopicCreationTest > testAutoTopicCreation[brokerTopicCreation=true, consumerTopicCreation=false] PASSED

integration.kafka.api.ConsumerTopicCreationTest > testAutoTopicCreation[brokerTopicCreation=false, consumerTopicCreation=true] STARTED

integration.kafka.api.ConsumerTopicCreationTest > testAutoTopicCreation[brokerTopicCreation=false, consumerTopicCreation=true] PASSED

integration.kafka.api.ConsumerTopicCreationTest > testAutoTopicCreation[brokerTopicCreation=false, consumerTopicCreation=false] STARTED

integration.kafka.api.ConsumerTopicCreationTest > testAutoTopicCreation[brokerTopicCreation=false, consumerTopicCreation=false] PASSED

unit.kafka.utils.ThrottlerTest > testThrottleDesiredRate STARTED

unit.kafka.utils.ThrottlerTest > testThrottleDesiredRate PASSED

FAILURE: Build completed with 2 failures.

1: Task failed with an exception.
-----------
* What went wrong:
Execution failed for task ':connect:runtime:test'.
> There were failing tests. See the report at: file://<https://builds.apache.org/job/kafka-2.3-jdk8/ws/connect/runtime/build/reports/tests/test/index.html>

* Try:
Run with --stacktrace option to get the stack trace. Run with --info or --debug option to get more log output. Run with --scan to get full insights.
==============================================================================

2: Task failed with an exception.
-----------
* What went wrong:
Execution failed for task ':kafka-2.3-jdk8:core:test'.
> There were failing tests. See the report at: file://<https://builds.apache.org/job/kafka-2.3-jdk8/ws/core/build/reports/tests/test/index.html>

* Try:
Run with --stacktrace option to get the stack trace. Run with --info or --debug option to get more log output. Run with --scan to get full insights.
==============================================================================

* Get more help at https://help.gradle.org

Deprecated Gradle features were used in this build, making it incompatible with Gradle 6.0.
Use '--warning-mode all' to show the individual deprecation warnings.
See https://docs.gradle.org/5.4.1/userguide/command_line_interface.html#sec:command_line_warnings

BUILD FAILED in 4h 25m 1s
118 actionable tasks: 92 executed, 26 up-to-date
Build step 'Execute shell' marked build as failure
[FINDBUGS] Collecting findbugs analysis files...
Setting GRADLE_4_8_1_HOME=/home/jenkins/tools/gradle/4.8.1
[FINDBUGS] Searching for all files in <https://builds.apache.org/job/kafka-2.3-jdk8/ws/> that match the pattern **/build/reports/findbugs/*.xml
[FINDBUGS] No files found. Configuration error?
Setting GRADLE_4_8_1_HOME=/home/jenkins/tools/gradle/4.8.1
No credentials specified
Setting GRADLE_4_8_1_HOME=/home/jenkins/tools/gradle/4.8.1
<Git Blamer> Using GitBlamer to create author and commit information for all warnings.
<Git Blamer> GIT_COMMIT=66b0f27b1056f63dbcda1dd908c0a3516765306c, workspace=<https://builds.apache.org/job/kafka-2.3-jdk8/ws/>
[FINDBUGS] Computing warning deltas based on reference build #45
Recording test results
Setting GRADLE_4_8_1_HOME=/home/jenkins/tools/gradle/4.8.1
Setting GRADLE_4_8_1_HOME=/home/jenkins/tools/gradle/4.8.1
Not sending mail to unregistered user cshapi@gmail.com

Jenkins build is back to normal : kafka-2.3-jdk8 #48

Posted by Apache Jenkins Server <je...@builds.apache.org>.
See <https://builds.apache.org/job/kafka-2.3-jdk8/48/display/redirect?page=changes>


Build failed in Jenkins: kafka-2.3-jdk8 #47

Posted by Apache Jenkins Server <je...@builds.apache.org>.
See <https://builds.apache.org/job/kafka-2.3-jdk8/47/display/redirect?page=changes>

Changes:

[matthias] KAFKA-7315 DOCS update TOC internal links serdes all versions (#6875)

------------------------------------------
[...truncated 2.76 MB...]

kafka.utils.SchedulerTest > testMockSchedulerNonPeriodicTask PASSED

kafka.utils.SchedulerTest > testMockSchedulerPeriodicTask STARTED

kafka.utils.SchedulerTest > testMockSchedulerPeriodicTask PASSED

kafka.utils.SchedulerTest > testNonPeriodicTask STARTED

kafka.utils.SchedulerTest > testNonPeriodicTask PASSED

kafka.utils.SchedulerTest > testRestart STARTED

kafka.utils.SchedulerTest > testRestart PASSED

kafka.utils.SchedulerTest > testReentrantTaskInMockScheduler STARTED

kafka.utils.SchedulerTest > testReentrantTaskInMockScheduler PASSED

kafka.utils.SchedulerTest > testPeriodicTask STARTED

kafka.utils.SchedulerTest > testPeriodicTask PASSED

kafka.utils.JsonTest > testParseToWithInvalidJson STARTED

kafka.utils.JsonTest > testParseToWithInvalidJson PASSED

kafka.utils.JsonTest > testParseTo STARTED

kafka.utils.JsonTest > testParseTo PASSED

kafka.utils.JsonTest > testJsonParse STARTED

kafka.utils.JsonTest > testJsonParse PASSED

kafka.utils.JsonTest > testLegacyEncodeAsString STARTED

kafka.utils.JsonTest > testLegacyEncodeAsString PASSED

kafka.utils.JsonTest > testEncodeAsBytes STARTED

kafka.utils.JsonTest > testEncodeAsBytes PASSED

kafka.utils.JsonTest > testEncodeAsString STARTED

kafka.utils.JsonTest > testEncodeAsString PASSED

kafka.utils.timer.TimerTaskListTest > testAll STARTED

kafka.utils.timer.TimerTaskListTest > testAll PASSED

kafka.utils.timer.TimerTest > testAlreadyExpiredTask STARTED

kafka.utils.timer.TimerTest > testAlreadyExpiredTask PASSED

kafka.utils.timer.TimerTest > testTaskExpiration STARTED

kafka.utils.timer.TimerTest > testTaskExpiration PASSED

kafka.utils.ReplicationUtilsTest > testUpdateLeaderAndIsr STARTED

kafka.utils.ReplicationUtilsTest > testUpdateLeaderAndIsr PASSED

kafka.utils.CommandLineUtilsTest > testParseEmptyArg STARTED

kafka.utils.CommandLineUtilsTest > testParseEmptyArg PASSED

kafka.utils.CommandLineUtilsTest > testMaybeMergeOptionsOverwriteExisting STARTED

kafka.utils.CommandLineUtilsTest > testMaybeMergeOptionsOverwriteExisting PASSED

kafka.utils.CommandLineUtilsTest > testParseSingleArg STARTED

kafka.utils.CommandLineUtilsTest > testParseSingleArg PASSED

kafka.utils.CommandLineUtilsTest > testParseArgs STARTED

kafka.utils.CommandLineUtilsTest > testParseArgs PASSED

kafka.utils.CommandLineUtilsTest > testParseArgsWithMultipleDelimiters STARTED

kafka.utils.CommandLineUtilsTest > testParseArgsWithMultipleDelimiters PASSED

kafka.utils.CommandLineUtilsTest > testMaybeMergeOptionsDefaultValueIfNotExist STARTED

kafka.utils.CommandLineUtilsTest > testMaybeMergeOptionsDefaultValueIfNotExist PASSED

kafka.utils.CommandLineUtilsTest > testParseEmptyArgWithNoDelimiter STARTED

kafka.utils.CommandLineUtilsTest > testParseEmptyArgWithNoDelimiter PASSED

kafka.utils.CommandLineUtilsTest > testMaybeMergeOptionsDefaultOverwriteExisting STARTED

kafka.utils.CommandLineUtilsTest > testMaybeMergeOptionsDefaultOverwriteExisting PASSED

kafka.utils.CommandLineUtilsTest > testParseEmptyArgAsValid STARTED

kafka.utils.CommandLineUtilsTest > testParseEmptyArgAsValid PASSED

kafka.utils.CommandLineUtilsTest > testMaybeMergeOptionsNotOverwriteExisting STARTED

kafka.utils.CommandLineUtilsTest > testMaybeMergeOptionsNotOverwriteExisting PASSED

kafka.utils.ShutdownableThreadTest > testShutdownWhenCalledAfterThreadStart STARTED

kafka.utils.ShutdownableThreadTest > testShutdownWhenCalledAfterThreadStart PASSED

kafka.utils.json.JsonValueTest > testJsonObjectIterator STARTED

kafka.utils.json.JsonValueTest > testJsonObjectIterator PASSED

kafka.utils.json.JsonValueTest > testDecodeLong STARTED

kafka.utils.json.JsonValueTest > testDecodeLong PASSED

kafka.utils.json.JsonValueTest > testAsJsonObject STARTED

kafka.utils.json.JsonValueTest > testAsJsonObject PASSED

kafka.utils.json.JsonValueTest > testDecodeDouble STARTED

kafka.utils.json.JsonValueTest > testDecodeDouble PASSED

kafka.utils.json.JsonValueTest > testDecodeOption STARTED

kafka.utils.json.JsonValueTest > testDecodeOption PASSED

kafka.utils.json.JsonValueTest > testDecodeString STARTED

kafka.utils.json.JsonValueTest > testDecodeString PASSED

kafka.utils.json.JsonValueTest > testJsonValueToString STARTED

kafka.utils.json.JsonValueTest > testJsonValueToString PASSED

kafka.utils.json.JsonValueTest > testAsJsonObjectOption STARTED

kafka.utils.json.JsonValueTest > testAsJsonObjectOption PASSED

kafka.utils.json.JsonValueTest > testAsJsonArrayOption STARTED

kafka.utils.json.JsonValueTest > testAsJsonArrayOption PASSED

kafka.utils.json.JsonValueTest > testAsJsonArray STARTED

kafka.utils.json.JsonValueTest > testAsJsonArray PASSED

kafka.utils.json.JsonValueTest > testJsonValueHashCode STARTED

kafka.utils.json.JsonValueTest > testJsonValueHashCode PASSED

kafka.utils.json.JsonValueTest > testDecodeInt STARTED

kafka.utils.json.JsonValueTest > testDecodeInt PASSED

kafka.utils.json.JsonValueTest > testDecodeMap STARTED

kafka.utils.json.JsonValueTest > testDecodeMap PASSED

kafka.utils.json.JsonValueTest > testDecodeSeq STARTED

kafka.utils.json.JsonValueTest > testDecodeSeq PASSED

kafka.utils.json.JsonValueTest > testJsonObjectGet STARTED

kafka.utils.json.JsonValueTest > testJsonObjectGet PASSED

kafka.utils.json.JsonValueTest > testJsonValueEquals STARTED

kafka.utils.json.JsonValueTest > testJsonValueEquals PASSED

kafka.utils.json.JsonValueTest > testJsonArrayIterator STARTED

kafka.utils.json.JsonValueTest > testJsonArrayIterator PASSED

kafka.utils.json.JsonValueTest > testJsonObjectApply STARTED

kafka.utils.json.JsonValueTest > testJsonObjectApply PASSED

kafka.utils.json.JsonValueTest > testDecodeBoolean STARTED

kafka.utils.json.JsonValueTest > testDecodeBoolean PASSED

kafka.utils.LoggingTest > testLog4jControllerIsRegistered STARTED

kafka.utils.LoggingTest > testLog4jControllerIsRegistered PASSED

kafka.utils.LoggingTest > testLogName STARTED

kafka.utils.LoggingTest > testLogName PASSED

kafka.utils.LoggingTest > testLogNameOverride STARTED

kafka.utils.LoggingTest > testLogNameOverride PASSED

kafka.utils.TopicFilterTest > testWhitelists STARTED

kafka.utils.TopicFilterTest > testWhitelists PASSED

2381 tests completed, 1 failed, 2 skipped

> Task :kafka-2.3-jdk8:core:test FAILED
> Task :testScala_2_11 FAILED

FAILURE: Build completed with 2 failures.

1: Task failed with an exception.
-----------
* What went wrong:
Execution failed for task ':streams:test'.
> There were failing tests. See the report at: file://<https://builds.apache.org/job/kafka-2.3-jdk8/ws/streams/build/reports/tests/test/index.html>

* Try:
Run with --stacktrace option to get the stack trace. Run with --info or --debug option to get more log output. Run with --scan to get full insights.
==============================================================================

2: Task failed with an exception.
-----------
* What went wrong:
Execution failed for task ':kafka-2.3-jdk8:core:test'.
> There were failing tests. See the report at: file://<https://builds.apache.org/job/kafka-2.3-jdk8/ws/core/build/reports/tests/test/index.html>

* Try:
Run with --stacktrace option to get the stack trace. Run with --info or --debug option to get more log output. Run with --scan to get full insights.
==============================================================================

* Get more help at https://help.gradle.org

Deprecated Gradle features were used in this build, making it incompatible with Gradle 6.0.
Use '--warning-mode all' to show the individual deprecation warnings.
See https://docs.gradle.org/5.4.1/userguide/command_line_interface.html#sec:command_line_warnings

BUILD FAILED in 4h 59m 44s
136 actionable tasks: 110 executed, 26 up-to-date
Build step 'Execute shell' marked build as failure
[FINDBUGS] Collecting findbugs analysis files...
Setting GRADLE_4_8_1_HOME=/home/jenkins/tools/gradle/4.8.1
[FINDBUGS] Searching for all files in <https://builds.apache.org/job/kafka-2.3-jdk8/ws/> that match the pattern **/build/reports/findbugs/*.xml
[FINDBUGS] No files found. Configuration error?
Setting GRADLE_4_8_1_HOME=/home/jenkins/tools/gradle/4.8.1
No credentials specified
Setting GRADLE_4_8_1_HOME=/home/jenkins/tools/gradle/4.8.1
<Git Blamer> Using GitBlamer to create author and commit information for all warnings.
<Git Blamer> GIT_COMMIT=87b39cf9973232d66c8fe0008b57ae371086b8f9, workspace=<https://builds.apache.org/job/kafka-2.3-jdk8/ws/>
[FINDBUGS] Computing warning deltas based on reference build #45
Recording test results
Setting GRADLE_4_8_1_HOME=/home/jenkins/tools/gradle/4.8.1
Setting GRADLE_4_8_1_HOME=/home/jenkins/tools/gradle/4.8.1
Not sending mail to unregistered user cshapi@gmail.com