You are viewing a plain text version of this content. The canonical link for it is here.
Posted to hdfs-issues@hadoop.apache.org by "Hui Fei (Jira)" <ji...@apache.org> on 2021/08/13 01:42:00 UTC

[jira] [Updated] (HDFS-16170) TestFileTruncate#testTruncateWithDataNodesShutdownImmediately fails

     [ https://issues.apache.org/jira/browse/HDFS-16170?page=com.atlassian.jira.plugin.system.issuetabpanels:all-tabpanel ]

Hui Fei updated HDFS-16170:
---------------------------
    Description: 
[ERROR] Tests run: 26, Failures: 2, Errors: 0, Skipped: 0, Time elapsed: 263.442 s <<< FAILURE! - in org.apache.hadoop.hdfs.server.namenode.TestFileTruncate [ERROR] testTruncateWithDataNodesShutdownImmediately(org.apache.hadoop.hdfs.server.namenode.TestFileTruncate) Time elapsed: 4.291 s <<< FAILURE! java.lang.AssertionError at org.junit.Assert.fail(Assert.java:87) at org.junit.Assert.assertTrue(Assert.java:42) at org.junit.Assert.assertTrue(Assert.java:53) at org.apache.hadoop.hdfs.server.namenode.TestFileTruncate.testTruncateWithDataNodesShutdownImmediately(TestFileTruncate.java:927) at sun.reflect.NativeMethodAccessorImpl.invoke0(Native Method) at sun.reflect.NativeMethodAccessorImpl.invoke(NativeMethodAccessorImpl.java:62) at sun.reflect.DelegatingMethodAccessorImpl.invoke(DelegatingMethodAccessorImpl.java:43) at java.lang.reflect.Method.invoke(Method.java:498) at org.junit.runners.model.FrameworkMethod$1.runReflectiveCall(FrameworkMethod.java:59) at org.junit.internal.runners.model.ReflectiveCallable.run(ReflectiveCallable.java:12) at org.junit.runners.model.FrameworkMethod.invokeExplosively(FrameworkMethod.java:56) at org.junit.internal.runners.statements.InvokeMethod.evaluate(InvokeMethod.java:17) at org.junit.internal.runners.statements.FailOnTimeout$CallableStatement.call(FailOnTimeout.java:299) at org.junit.internal.runners.statements.FailOnTimeout$CallableStatement.call(FailOnTimeout.java:293) at java.util.concurrent.FutureTask.run(FutureTask.java:266) at java.lang.Thread.run(Thread.java:748) [ERROR] testTruncateWithDataNodesShutdownImmediately(org.apache.hadoop.hdfs.server.namenode.TestFileTruncate) Time elapsed: 3.868 s <<< FAILURE! java.lang.AssertionError at org.junit.Assert.fail(Assert.java:87) at org.junit.Assert.assertTrue(Assert.java:42) at org.junit.Assert.assertTrue(Assert.java:53) at org.apache.hadoop.hdfs.server.namenode.TestFileTruncate.testTruncateWithDataNodesShutdownImmediately(TestFileTruncate.java:927) at sun.reflect.NativeMethodAccessorImpl.invoke0(Native Method) at sun.reflect.NativeMethodAccessorImpl.invoke(NativeMethodAccessorImpl.java:62) at sun.reflect.DelegatingMethodAccessorImpl.invoke(DelegatingMethodAccessorImpl.java:43) at java.lang.reflect.Method.invoke(Method.java:498) at org.junit.runners.model.FrameworkMethod$1.runReflectiveCall(FrameworkMethod.java:59) at org.junit.internal.runners.model.ReflectiveCallable.run(ReflectiveCallable.java:12) at org.junit.runners.model.FrameworkMethod.invokeExplosively(FrameworkMethod.java:56) at org.junit.internal.runners.statements.InvokeMethod.evaluate(InvokeMethod.java:17) at org.junit.internal.runners.statements.FailOnTimeout$CallableStatement.call(FailOnTimeout.java:299) at org.junit.internal.runners.statements.FailOnTimeout$CallableStatement.call(FailOnTimeout.java:293) at java.util.concurrent.FutureTask.run(FutureTask.java:266) at java.lang.Thread.run(Thread.java:748)

 

CI result is https://ci-hadoop.apache.org/job/hadoop-multibranch/job/PR-3296/1/artifact/out/patch-unit-hadoop-hdfs-project_hadoop-hdfs.txt

> TestFileTruncate#testTruncateWithDataNodesShutdownImmediately fails
> -------------------------------------------------------------------
>
>                 Key: HDFS-16170
>                 URL: https://issues.apache.org/jira/browse/HDFS-16170
>             Project: Hadoop HDFS
>          Issue Type: Sub-task
>          Components: test
>    Affects Versions: 3.4.0
>            Reporter: Hui Fei
>            Priority: Major
>
> [ERROR] Tests run: 26, Failures: 2, Errors: 0, Skipped: 0, Time elapsed: 263.442 s <<< FAILURE! - in org.apache.hadoop.hdfs.server.namenode.TestFileTruncate [ERROR] testTruncateWithDataNodesShutdownImmediately(org.apache.hadoop.hdfs.server.namenode.TestFileTruncate) Time elapsed: 4.291 s <<< FAILURE! java.lang.AssertionError at org.junit.Assert.fail(Assert.java:87) at org.junit.Assert.assertTrue(Assert.java:42) at org.junit.Assert.assertTrue(Assert.java:53) at org.apache.hadoop.hdfs.server.namenode.TestFileTruncate.testTruncateWithDataNodesShutdownImmediately(TestFileTruncate.java:927) at sun.reflect.NativeMethodAccessorImpl.invoke0(Native Method) at sun.reflect.NativeMethodAccessorImpl.invoke(NativeMethodAccessorImpl.java:62) at sun.reflect.DelegatingMethodAccessorImpl.invoke(DelegatingMethodAccessorImpl.java:43) at java.lang.reflect.Method.invoke(Method.java:498) at org.junit.runners.model.FrameworkMethod$1.runReflectiveCall(FrameworkMethod.java:59) at org.junit.internal.runners.model.ReflectiveCallable.run(ReflectiveCallable.java:12) at org.junit.runners.model.FrameworkMethod.invokeExplosively(FrameworkMethod.java:56) at org.junit.internal.runners.statements.InvokeMethod.evaluate(InvokeMethod.java:17) at org.junit.internal.runners.statements.FailOnTimeout$CallableStatement.call(FailOnTimeout.java:299) at org.junit.internal.runners.statements.FailOnTimeout$CallableStatement.call(FailOnTimeout.java:293) at java.util.concurrent.FutureTask.run(FutureTask.java:266) at java.lang.Thread.run(Thread.java:748) [ERROR] testTruncateWithDataNodesShutdownImmediately(org.apache.hadoop.hdfs.server.namenode.TestFileTruncate) Time elapsed: 3.868 s <<< FAILURE! java.lang.AssertionError at org.junit.Assert.fail(Assert.java:87) at org.junit.Assert.assertTrue(Assert.java:42) at org.junit.Assert.assertTrue(Assert.java:53) at org.apache.hadoop.hdfs.server.namenode.TestFileTruncate.testTruncateWithDataNodesShutdownImmediately(TestFileTruncate.java:927) at sun.reflect.NativeMethodAccessorImpl.invoke0(Native Method) at sun.reflect.NativeMethodAccessorImpl.invoke(NativeMethodAccessorImpl.java:62) at sun.reflect.DelegatingMethodAccessorImpl.invoke(DelegatingMethodAccessorImpl.java:43) at java.lang.reflect.Method.invoke(Method.java:498) at org.junit.runners.model.FrameworkMethod$1.runReflectiveCall(FrameworkMethod.java:59) at org.junit.internal.runners.model.ReflectiveCallable.run(ReflectiveCallable.java:12) at org.junit.runners.model.FrameworkMethod.invokeExplosively(FrameworkMethod.java:56) at org.junit.internal.runners.statements.InvokeMethod.evaluate(InvokeMethod.java:17) at org.junit.internal.runners.statements.FailOnTimeout$CallableStatement.call(FailOnTimeout.java:299) at org.junit.internal.runners.statements.FailOnTimeout$CallableStatement.call(FailOnTimeout.java:293) at java.util.concurrent.FutureTask.run(FutureTask.java:266) at java.lang.Thread.run(Thread.java:748)
>  
> CI result is https://ci-hadoop.apache.org/job/hadoop-multibranch/job/PR-3296/1/artifact/out/patch-unit-hadoop-hdfs-project_hadoop-hdfs.txt



--
This message was sent by Atlassian Jira
(v8.3.4#803005)

---------------------------------------------------------------------
To unsubscribe, e-mail: hdfs-issues-unsubscribe@hadoop.apache.org
For additional commands, e-mail: hdfs-issues-help@hadoop.apache.org