You are viewing a plain text version of this content. The canonical link for it is here.
Posted to builds@solr.apache.org by Apache Jenkins Server <je...@builds.apache.org> on 2024/03/24 21:57:13 UTC
[JENKINS] Solr » Solr-NightlyTests-main - Build # 1099 - Still Unstable!
Build: https://ci-builds.apache.org/job/Solr/job/Solr-NightlyTests-main/1099/
7 tests failed.
FAILED: org.apache.solr.cloud.api.collections.ShardSplitTest.testSplitStaticIndexReplicationLink
Error Message:
java.util.concurrent.TimeoutException: Timeout waiting to see state for collection=testSplitStaticIndexReplication_link :DocCollection(testSplitStaticIndexReplication_link//collections/testSplitStaticIndexReplication_link/state.json/20 )={
"pullReplicas":"0",
"configName":"conf1",
"replicationFactor":1,
"router":{"name":"compositeId"},
"nrtReplicas":1,
"tlogReplicas":"0",
"shards":{
"shard1":{
"range":"80000000-7fffffff",
"state":"inactive",
"stateTimestamp":"1711313498616774509",
"replicas":{"core_node2":{
"core":"testSplitStaticIndexReplication_link_shard1_replica_n1",
"node_name":"127.0.0.1:44591_solr",
"type":"NRT",
"state":"active",
"leader":"true",
"force_set_state":"false",
"base_url":"http://127.0.0.1:44591/solr"}}},
"shard1_0":{
"range":"80000000-ffffffff",
"state":"active",
"stateTimestamp":"1711313498616759507",
"replicas":{
"core_node5":{
"core":"testSplitStaticIndexReplication_link_shard1_0_replica_n3",
"node_name":"127.0.0.1:44591_solr",
"type":"NRT",
"state":"active",
"leader":"true",
"force_set_state":"false",
"base_url":"http://127.0.0.1:44591/solr"},
"core_node8":{
"core":"testSplitStaticIndexReplication_link_shard1_0_replica_n7",
"node_name":"127.0.0.1:41595_solr",
"type":"NRT",
"state":"active",
"force_set_state":"false",
"base_url":"http://127.0.0.1:41595/solr"}}},
"shard1_1":{
"range":"0-7fffffff",
"state":"active",
"stateTimestamp":"1711313498616732591",
"replicas":{"core_node6":{
"core":"testSplitStaticIndexReplication_link_shard1_1_replica_n4",
"node_name":"127.0.0.1:44591_solr",
"type":"NRT",
"state":"active",
"leader":"true",
"force_set_state":"false",
"base_url":"http://127.0.0.1:44591/solr"}}}}}
Stack Trace:
java.util.concurrent.TimeoutException: Timeout waiting to see state for collection=testSplitStaticIndexReplication_link :DocCollection(testSplitStaticIndexReplication_link//collections/testSplitStaticIndexReplication_link/state.json/20 )={
"pullReplicas":"0",
"configName":"conf1",
"replicationFactor":1,
"router":{"name":"compositeId"},
"nrtReplicas":1,
"tlogReplicas":"0",
"shards":{
"shard1":{
"range":"80000000-7fffffff",
"state":"inactive",
"stateTimestamp":"1711313498616774509",
"replicas":{"core_node2":{
"core":"testSplitStaticIndexReplication_link_shard1_replica_n1",
"node_name":"127.0.0.1:44591_solr",
"type":"NRT",
"state":"active",
"leader":"true",
"force_set_state":"false",
"base_url":"http://127.0.0.1:44591/solr"}}},
"shard1_0":{
"range":"80000000-ffffffff",
"state":"active",
"stateTimestamp":"1711313498616759507",
"replicas":{
"core_node5":{
"core":"testSplitStaticIndexReplication_link_shard1_0_replica_n3",
"node_name":"127.0.0.1:44591_solr",
"type":"NRT",
"state":"active",
"leader":"true",
"force_set_state":"false",
"base_url":"http://127.0.0.1:44591/solr"},
"core_node8":{
"core":"testSplitStaticIndexReplication_link_shard1_0_replica_n7",
"node_name":"127.0.0.1:41595_solr",
"type":"NRT",
"state":"active",
"force_set_state":"false",
"base_url":"http://127.0.0.1:41595/solr"}}},
"shard1_1":{
"range":"0-7fffffff",
"state":"active",
"stateTimestamp":"1711313498616732591",
"replicas":{"core_node6":{
"core":"testSplitStaticIndexReplication_link_shard1_1_replica_n4",
"node_name":"127.0.0.1:44591_solr",
"type":"NRT",
"state":"active",
"leader":"true",
"force_set_state":"false",
"base_url":"http://127.0.0.1:44591/solr"}}}}}
at __randomizedtesting.SeedInfo.seed([221BB1D8D3478873:D9234F3616DB217F]:0)
at org.apache.solr.common.cloud.ZkStateReader.waitForState(ZkStateReader.java:1847)
at org.apache.solr.cloud.api.collections.ShardSplitTest.doSplitStaticIndexReplication(ShardSplitTest.java:252)
at org.apache.solr.cloud.api.collections.ShardSplitTest.testSplitStaticIndexReplicationLink(ShardSplitTest.java:131)
at java.base/jdk.internal.reflect.NativeMethodAccessorImpl.invoke0(Native Method)
at java.base/jdk.internal.reflect.NativeMethodAccessorImpl.invoke(NativeMethodAccessorImpl.java:62)
at java.base/jdk.internal.reflect.DelegatingMethodAccessorImpl.invoke(DelegatingMethodAccessorImpl.java:43)
at java.base/java.lang.reflect.Method.invoke(Method.java:566)
at com.carrotsearch.randomizedtesting.RandomizedRunner.invoke(RandomizedRunner.java:1758)
at com.carrotsearch.randomizedtesting.RandomizedRunner$8.evaluate(RandomizedRunner.java:946)
at com.carrotsearch.randomizedtesting.RandomizedRunner$9.evaluate(RandomizedRunner.java:982)
at com.carrotsearch.randomizedtesting.RandomizedRunner$10.evaluate(RandomizedRunner.java:996)
at org.apache.solr.BaseDistributedSearchTestCase$ShardsRepeatRule$ShardsFixedStatement.callStatement(BaseDistributedSearchTestCase.java:1069)
at org.apache.solr.BaseDistributedSearchTestCase$ShardsRepeatRule$ShardsStatement.evaluate(BaseDistributedSearchTestCase.java:1040)
at com.carrotsearch.randomizedtesting.rules.SystemPropertiesRestoreRule$1.evaluate(SystemPropertiesRestoreRule.java:80)
at org.junit.rules.RunRules.evaluate(RunRules.java:20)
at org.apache.lucene.tests.util.TestRuleSetupTeardownChained$1.evaluate(TestRuleSetupTeardownChained.java:48)
at org.apache.lucene.tests.util.AbstractBeforeAfterRule$1.evaluate(AbstractBeforeAfterRule.java:43)
at org.apache.lucene.tests.util.TestRuleThreadAndTestName$1.evaluate(TestRuleThreadAndTestName.java:45)
at org.apache.lucene.tests.util.TestRuleIgnoreAfterMaxFailures$1.evaluate(TestRuleIgnoreAfterMaxFailures.java:60)
at org.apache.lucene.tests.util.TestRuleMarkFailure$1.evaluate(TestRuleMarkFailure.java:44)
at org.junit.rules.RunRules.evaluate(RunRules.java:20)
at com.carrotsearch.randomizedtesting.rules.StatementAdapter.evaluate(StatementAdapter.java:36)
at com.carrotsearch.randomizedtesting.ThreadLeakControl$StatementRunner.run(ThreadLeakControl.java:390)
at com.carrotsearch.randomizedtesting.ThreadLeakControl.forkTimeoutingTask(ThreadLeakControl.java:843)
at com.carrotsearch.randomizedtesting.ThreadLeakControl$3.evaluate(ThreadLeakControl.java:490)
at com.carrotsearch.randomizedtesting.RandomizedRunner.runSingleTest(RandomizedRunner.java:955)
at com.carrotsearch.randomizedtesting.RandomizedRunner$5.evaluate(RandomizedRunner.java:840)
at com.carrotsearch.randomizedtesting.RandomizedRunner$6.evaluate(RandomizedRunner.java:891)
at com.carrotsearch.randomizedtesting.RandomizedRunner$7.evaluate(RandomizedRunner.java:902)
at com.carrotsearch.randomizedtesting.rules.StatementAdapter.evaluate(StatementAdapter.java:36)
at com.carrotsearch.randomizedtesting.rules.StatementAdapter.evaluate(StatementAdapter.java:36)
at org.apache.lucene.tests.util.AbstractBeforeAfterRule$1.evaluate(AbstractBeforeAfterRule.java:43)
at com.carrotsearch.randomizedtesting.rules.SystemPropertiesRestoreRule$1.evaluate(SystemPropertiesRestoreRule.java:80)
at org.junit.rules.RunRules.evaluate(RunRules.java:20)
at org.apache.lucene.tests.util.AbstractBeforeAfterRule$1.evaluate(AbstractBeforeAfterRule.java:43)
at com.carrotsearch.randomizedtesting.rules.StatementAdapter.evaluate(StatementAdapter.java:36)
at org.apache.lucene.tests.util.TestRuleStoreClassName$1.evaluate(TestRuleStoreClassName.java:38)
at com.carrotsearch.randomizedtesting.rules.NoShadowingOrOverridesOnMethodsRule$1.evaluate(NoShadowingOrOverridesOnMethodsRule.java:40)
at com.carrotsearch.randomizedtesting.rules.NoShadowingOrOverridesOnMethodsRule$1.evaluate(NoShadowingOrOverridesOnMethodsRule.java:40)
at com.carrotsearch.randomizedtesting.rules.StatementAdapter.evaluate(StatementAdapter.java:36)
at com.carrotsearch.randomizedtesting.rules.StatementAdapter.evaluate(StatementAdapter.java:36)
at org.apache.lucene.tests.util.TestRuleAssertionsRequired$1.evaluate(TestRuleAssertionsRequired.java:53)
at org.apache.lucene.tests.util.AbstractBeforeAfterRule$1.evaluate(AbstractBeforeAfterRule.java:43)
at org.apache.lucene.tests.util.TestRuleMarkFailure$1.evaluate(TestRuleMarkFailure.java:44)
at org.apache.lucene.tests.util.TestRuleIgnoreAfterMaxFailures$1.evaluate(TestRuleIgnoreAfterMaxFailures.java:60)
at org.apache.lucene.tests.util.TestRuleIgnoreTestSuites$1.evaluate(TestRuleIgnoreTestSuites.java:47)
at org.junit.rules.RunRules.evaluate(RunRules.java:20)
at com.carrotsearch.randomizedtesting.rules.StatementAdapter.evaluate(StatementAdapter.java:36)
at com.carrotsearch.randomizedtesting.ThreadLeakControl$StatementRunner.run(ThreadLeakControl.java:390)
at com.carrotsearch.randomizedtesting.ThreadLeakControl.lambda$forkTimeoutingTask$0(ThreadLeakControl.java:850)
at java.base/java.lang.Thread.run(Thread.java:829)
FAILED: org.apache.solr.cloud.api.collections.ShardSplitTest.testSplitLocking
Error Message:
java.lang.AssertionError: timed out waiting for the lock znode to appear
Stack Trace:
java.lang.AssertionError: timed out waiting for the lock znode to appear
at __randomizedtesting.SeedInfo.seed([221BB1D8D3478873:455C4629C372F6F6]:0)
at org.junit.Assert.fail(Assert.java:89)
at org.junit.Assert.assertTrue(Assert.java:42)
at org.junit.Assert.assertFalse(Assert.java:65)
at org.apache.solr.cloud.api.collections.ShardSplitTest.testSplitLocking(ShardSplitTest.java:717)
at java.base/jdk.internal.reflect.NativeMethodAccessorImpl.invoke0(Native Method)
at java.base/jdk.internal.reflect.NativeMethodAccessorImpl.invoke(NativeMethodAccessorImpl.java:62)
at java.base/jdk.internal.reflect.DelegatingMethodAccessorImpl.invoke(DelegatingMethodAccessorImpl.java:43)
at java.base/java.lang.reflect.Method.invoke(Method.java:566)
at com.carrotsearch.randomizedtesting.RandomizedRunner.invoke(RandomizedRunner.java:1758)
at com.carrotsearch.randomizedtesting.RandomizedRunner$8.evaluate(RandomizedRunner.java:946)
at com.carrotsearch.randomizedtesting.RandomizedRunner$9.evaluate(RandomizedRunner.java:982)
at com.carrotsearch.randomizedtesting.RandomizedRunner$10.evaluate(RandomizedRunner.java:996)
at org.apache.solr.BaseDistributedSearchTestCase$ShardsRepeatRule$ShardsFixedStatement.callStatement(BaseDistributedSearchTestCase.java:1069)
at org.apache.solr.BaseDistributedSearchTestCase$ShardsRepeatRule$ShardsStatement.evaluate(BaseDistributedSearchTestCase.java:1040)
at com.carrotsearch.randomizedtesting.rules.SystemPropertiesRestoreRule$1.evaluate(SystemPropertiesRestoreRule.java:80)
at org.junit.rules.RunRules.evaluate(RunRules.java:20)
at org.apache.lucene.tests.util.TestRuleSetupTeardownChained$1.evaluate(TestRuleSetupTeardownChained.java:48)
at org.apache.lucene.tests.util.AbstractBeforeAfterRule$1.evaluate(AbstractBeforeAfterRule.java:43)
at org.apache.lucene.tests.util.TestRuleThreadAndTestName$1.evaluate(TestRuleThreadAndTestName.java:45)
at org.apache.lucene.tests.util.TestRuleIgnoreAfterMaxFailures$1.evaluate(TestRuleIgnoreAfterMaxFailures.java:60)
at org.apache.lucene.tests.util.TestRuleMarkFailure$1.evaluate(TestRuleMarkFailure.java:44)
at org.junit.rules.RunRules.evaluate(RunRules.java:20)
at com.carrotsearch.randomizedtesting.rules.StatementAdapter.evaluate(StatementAdapter.java:36)
at com.carrotsearch.randomizedtesting.ThreadLeakControl$StatementRunner.run(ThreadLeakControl.java:390)
at com.carrotsearch.randomizedtesting.ThreadLeakControl.forkTimeoutingTask(ThreadLeakControl.java:843)
at com.carrotsearch.randomizedtesting.ThreadLeakControl$3.evaluate(ThreadLeakControl.java:490)
at com.carrotsearch.randomizedtesting.RandomizedRunner.runSingleTest(RandomizedRunner.java:955)
at com.carrotsearch.randomizedtesting.RandomizedRunner$5.evaluate(RandomizedRunner.java:840)
at com.carrotsearch.randomizedtesting.RandomizedRunner$6.evaluate(RandomizedRunner.java:891)
at com.carrotsearch.randomizedtesting.RandomizedRunner$7.evaluate(RandomizedRunner.java:902)
at com.carrotsearch.randomizedtesting.rules.StatementAdapter.evaluate(StatementAdapter.java:36)
at com.carrotsearch.randomizedtesting.rules.StatementAdapter.evaluate(StatementAdapter.java:36)
at org.apache.lucene.tests.util.AbstractBeforeAfterRule$1.evaluate(AbstractBeforeAfterRule.java:43)
at com.carrotsearch.randomizedtesting.rules.SystemPropertiesRestoreRule$1.evaluate(SystemPropertiesRestoreRule.java:80)
at org.junit.rules.RunRules.evaluate(RunRules.java:20)
at org.apache.lucene.tests.util.AbstractBeforeAfterRule$1.evaluate(AbstractBeforeAfterRule.java:43)
at com.carrotsearch.randomizedtesting.rules.StatementAdapter.evaluate(StatementAdapter.java:36)
at org.apache.lucene.tests.util.TestRuleStoreClassName$1.evaluate(TestRuleStoreClassName.java:38)
at com.carrotsearch.randomizedtesting.rules.NoShadowingOrOverridesOnMethodsRule$1.evaluate(NoShadowingOrOverridesOnMethodsRule.java:40)
at com.carrotsearch.randomizedtesting.rules.NoShadowingOrOverridesOnMethodsRule$1.evaluate(NoShadowingOrOverridesOnMethodsRule.java:40)
at com.carrotsearch.randomizedtesting.rules.StatementAdapter.evaluate(StatementAdapter.java:36)
at com.carrotsearch.randomizedtesting.rules.StatementAdapter.evaluate(StatementAdapter.java:36)
at org.apache.lucene.tests.util.TestRuleAssertionsRequired$1.evaluate(TestRuleAssertionsRequired.java:53)
at org.apache.lucene.tests.util.AbstractBeforeAfterRule$1.evaluate(AbstractBeforeAfterRule.java:43)
at org.apache.lucene.tests.util.TestRuleMarkFailure$1.evaluate(TestRuleMarkFailure.java:44)
at org.apache.lucene.tests.util.TestRuleIgnoreAfterMaxFailures$1.evaluate(TestRuleIgnoreAfterMaxFailures.java:60)
at org.apache.lucene.tests.util.TestRuleIgnoreTestSuites$1.evaluate(TestRuleIgnoreTestSuites.java:47)
at org.junit.rules.RunRules.evaluate(RunRules.java:20)
at com.carrotsearch.randomizedtesting.rules.StatementAdapter.evaluate(StatementAdapter.java:36)
at com.carrotsearch.randomizedtesting.ThreadLeakControl$StatementRunner.run(ThreadLeakControl.java:390)
at com.carrotsearch.randomizedtesting.ThreadLeakControl.lambda$forkTimeoutingTask$0(ThreadLeakControl.java:850)
at java.base/java.lang.Thread.run(Thread.java:829)
FAILED: org.apache.solr.cloud.api.collections.ShardSplitTest.testSplitMixedReplicaTypes
Error Message:
java.util.concurrent.TimeoutException: Timeout waiting to see state for collection=testSplitMixedReplicaTypes_rewrite :DocCollection(testSplitMixedReplicaTypes_rewrite//collections/testSplitMixedReplicaTypes_rewrite/state.json/17 )={
"pullReplicas":2,
"configName":"conf1",
"replicationFactor":2,
"router":{"name":"compositeId"},
"nrtReplicas":2,
"tlogReplicas":0,
"shards":{
"shard1":{
"range":"80000000-7fffffff",
"state":"inactive",
"stateTimestamp":"1711313597106965716",
"replicas":{
"core_node3":{
"core":"testSplitMixedReplicaTypes_rewrite_shard1_replica_p1",
"node_name":"127.0.0.1:45849_solr",
"type":"PULL",
"state":"active",
"force_set_state":"false",
"base_url":"http://127.0.0.1:45849/solr"},
"core_node5":{
"core":"testSplitMixedReplicaTypes_rewrite_shard1_replica_p2",
"node_name":"127.0.0.1:38681_solr",
"type":"PULL",
"state":"active",
"force_set_state":"false",
"base_url":"http://127.0.0.1:38681/solr"},
"core_node7":{
"core":"testSplitMixedReplicaTypes_rewrite_shard1_replica_n4",
"node_name":"127.0.0.1:38723_solr",
"type":"NRT",
"state":"active",
"leader":"true",
"force_set_state":"false",
"base_url":"http://127.0.0.1:38723/solr"},
"core_node8":{
"core":"testSplitMixedReplicaTypes_rewrite_shard1_replica_n6",
"node_name":"127.0.0.1:37711_solr",
"type":"NRT",
"state":"active",
"force_set_state":"false",
"base_url":"http://127.0.0.1:37711/solr"}}},
"shard1_0":{
"range":"80000000-ffffffff",
"stateTimestamp":"1711313597106949555",
"state":"active",
"replicas":{
"core_node11":{
"core":"testSplitMixedReplicaTypes_rewrite_shard1_0_replica_n9",
"node_name":"127.0.0.1:38723_solr",
"type":"NRT",
"state":"active",
"leader":"true",
"force_set_state":"false",
"base_url":"http://127.0.0.1:38723/solr"},
"core_node15":{
"core":"testSplitMixedReplicaTypes_rewrite_shard1_0_replica_p2",
"node_name":"127.0.0.1:37711_solr",
"type":"PULL",
"state":"active",
"force_set_state":"false",
"base_url":"http://127.0.0.1:37711/solr"},
"core_node16":{
"core":"testSplitMixedReplicaTypes_rewrite_shard1_0_replica_n3",
"node_name":"127.0.0.1:44615_solr",
"type":"NRT",
"state":"active",
"force_set_state":"false",
"base_url":"http://127.0.0.1:44615/solr"},
"core_node17":{
"core":"testSplitMixedReplicaTypes_rewrite_shard1_0_replica_p4",
"node_name":"127.0.0.1:38681_solr",
"type":"PULL",
"state":"active",
"force_set_state":"false",
"base_url":"http://127.0.0.1:38681/solr"}}},
"shard1_1":{
"range":"0-7fffffff",
"stateTimestamp":"1711313597106916145",
"state":"active",
"replicas":{
"core_node12":{
"core":"testSplitMixedReplicaTypes_rewrite_shard1_1_replica_n10",
"node_name":"127.0.0.1:38723_solr",
"type":"NRT",
"state":"active",
"leader":"true",
"force_set_state":"false",
"base_url":"http://127.0.0.1:38723/solr"},
"core_node13":{
"core":"testSplitMixedReplicaTypes_rewrite_shard1_1_replica_p0",
"node_name":"127.0.0.1:45849_solr",
"type":"PULL",
"state":"active",
"force_set_state":"false",
"base_url":"http://127.0.0.1:45849/solr"},
"core_node14":{
"core":"testSplitMixedReplicaTypes_rewrite_shard1_1_replica_p1",
"node_name":"127.0.0.1:37711_solr",
"type":"PULL",
"state":"active",
"force_set_state":"false",
"base_url":"http://127.0.0.1:37711/solr"},
"core_node18":{
"core":"testSplitMixedReplicaTypes_rewrite_shard1_1_replica_n5",
"node_name":"127.0.0.1:44615_solr",
"type":"NRT",
"state":"active",
"force_set_state":"false",
"base_url":"http://127.0.0.1:44615/solr"}}}}}
Stack Trace:
java.util.concurrent.TimeoutException: Timeout waiting to see state for collection=testSplitMixedReplicaTypes_rewrite :DocCollection(testSplitMixedReplicaTypes_rewrite//collections/testSplitMixedReplicaTypes_rewrite/state.json/17 )={
"pullReplicas":2,
"configName":"conf1",
"replicationFactor":2,
"router":{"name":"compositeId"},
"nrtReplicas":2,
"tlogReplicas":0,
"shards":{
"shard1":{
"range":"80000000-7fffffff",
"state":"inactive",
"stateTimestamp":"1711313597106965716",
"replicas":{
"core_node3":{
"core":"testSplitMixedReplicaTypes_rewrite_shard1_replica_p1",
"node_name":"127.0.0.1:45849_solr",
"type":"PULL",
"state":"active",
"force_set_state":"false",
"base_url":"http://127.0.0.1:45849/solr"},
"core_node5":{
"core":"testSplitMixedReplicaTypes_rewrite_shard1_replica_p2",
"node_name":"127.0.0.1:38681_solr",
"type":"PULL",
"state":"active",
"force_set_state":"false",
"base_url":"http://127.0.0.1:38681/solr"},
"core_node7":{
"core":"testSplitMixedReplicaTypes_rewrite_shard1_replica_n4",
"node_name":"127.0.0.1:38723_solr",
"type":"NRT",
"state":"active",
"leader":"true",
"force_set_state":"false",
"base_url":"http://127.0.0.1:38723/solr"},
"core_node8":{
"core":"testSplitMixedReplicaTypes_rewrite_shard1_replica_n6",
"node_name":"127.0.0.1:37711_solr",
"type":"NRT",
"state":"active",
"force_set_state":"false",
"base_url":"http://127.0.0.1:37711/solr"}}},
"shard1_0":{
"range":"80000000-ffffffff",
"stateTimestamp":"1711313597106949555",
"state":"active",
"replicas":{
"core_node11":{
"core":"testSplitMixedReplicaTypes_rewrite_shard1_0_replica_n9",
"node_name":"127.0.0.1:38723_solr",
"type":"NRT",
"state":"active",
"leader":"true",
"force_set_state":"false",
"base_url":"http://127.0.0.1:38723/solr"},
"core_node15":{
"core":"testSplitMixedReplicaTypes_rewrite_shard1_0_replica_p2",
"node_name":"127.0.0.1:37711_solr",
"type":"PULL",
"state":"active",
"force_set_state":"false",
"base_url":"http://127.0.0.1:37711/solr"},
"core_node16":{
"core":"testSplitMixedReplicaTypes_rewrite_shard1_0_replica_n3",
"node_name":"127.0.0.1:44615_solr",
"type":"NRT",
"state":"active",
"force_set_state":"false",
"base_url":"http://127.0.0.1:44615/solr"},
"core_node17":{
"core":"testSplitMixedReplicaTypes_rewrite_shard1_0_replica_p4",
"node_name":"127.0.0.1:38681_solr",
"type":"PULL",
"state":"active",
"force_set_state":"false",
"base_url":"http://127.0.0.1:38681/solr"}}},
"shard1_1":{
"range":"0-7fffffff",
"stateTimestamp":"1711313597106916145",
"state":"active",
"replicas":{
"core_node12":{
"core":"testSplitMixedReplicaTypes_rewrite_shard1_1_replica_n10",
"node_name":"127.0.0.1:38723_solr",
"type":"NRT",
"state":"active",
"leader":"true",
"force_set_state":"false",
"base_url":"http://127.0.0.1:38723/solr"},
"core_node13":{
"core":"testSplitMixedReplicaTypes_rewrite_shard1_1_replica_p0",
"node_name":"127.0.0.1:45849_solr",
"type":"PULL",
"state":"active",
"force_set_state":"false",
"base_url":"http://127.0.0.1:45849/solr"},
"core_node14":{
"core":"testSplitMixedReplicaTypes_rewrite_shard1_1_replica_p1",
"node_name":"127.0.0.1:37711_solr",
"type":"PULL",
"state":"active",
"force_set_state":"false",
"base_url":"http://127.0.0.1:37711/solr"},
"core_node18":{
"core":"testSplitMixedReplicaTypes_rewrite_shard1_1_replica_n5",
"node_name":"127.0.0.1:44615_solr",
"type":"NRT",
"state":"active",
"force_set_state":"false",
"base_url":"http://127.0.0.1:44615/solr"}}}}}
at __randomizedtesting.SeedInfo.seed([221BB1D8D3478873:9AD8E5782F9C5D06]:0)
at org.apache.solr.common.cloud.ZkStateReader.waitForState(ZkStateReader.java:1847)
at org.apache.solr.cloud.api.collections.ShardSplitTest.doSplitMixedReplicaTypes(ShardSplitTest.java:442)
at org.apache.solr.cloud.api.collections.ShardSplitTest.testSplitMixedReplicaTypes(ShardSplitTest.java:407)
at java.base/jdk.internal.reflect.NativeMethodAccessorImpl.invoke0(Native Method)
at java.base/jdk.internal.reflect.NativeMethodAccessorImpl.invoke(NativeMethodAccessorImpl.java:62)
at java.base/jdk.internal.reflect.DelegatingMethodAccessorImpl.invoke(DelegatingMethodAccessorImpl.java:43)
at java.base/java.lang.reflect.Method.invoke(Method.java:566)
at com.carrotsearch.randomizedtesting.RandomizedRunner.invoke(RandomizedRunner.java:1758)
at com.carrotsearch.randomizedtesting.RandomizedRunner$8.evaluate(RandomizedRunner.java:946)
at com.carrotsearch.randomizedtesting.RandomizedRunner$9.evaluate(RandomizedRunner.java:982)
at com.carrotsearch.randomizedtesting.RandomizedRunner$10.evaluate(RandomizedRunner.java:996)
at org.apache.solr.BaseDistributedSearchTestCase$ShardsRepeatRule$ShardsFixedStatement.callStatement(BaseDistributedSearchTestCase.java:1069)
at org.apache.solr.BaseDistributedSearchTestCase$ShardsRepeatRule$ShardsStatement.evaluate(BaseDistributedSearchTestCase.java:1040)
at com.carrotsearch.randomizedtesting.rules.SystemPropertiesRestoreRule$1.evaluate(SystemPropertiesRestoreRule.java:80)
at org.junit.rules.RunRules.evaluate(RunRules.java:20)
at org.apache.lucene.tests.util.TestRuleSetupTeardownChained$1.evaluate(TestRuleSetupTeardownChained.java:48)
at org.apache.lucene.tests.util.AbstractBeforeAfterRule$1.evaluate(AbstractBeforeAfterRule.java:43)
at org.apache.lucene.tests.util.TestRuleThreadAndTestName$1.evaluate(TestRuleThreadAndTestName.java:45)
at org.apache.lucene.tests.util.TestRuleIgnoreAfterMaxFailures$1.evaluate(TestRuleIgnoreAfterMaxFailures.java:60)
at org.apache.lucene.tests.util.TestRuleMarkFailure$1.evaluate(TestRuleMarkFailure.java:44)
at org.junit.rules.RunRules.evaluate(RunRules.java:20)
at com.carrotsearch.randomizedtesting.rules.StatementAdapter.evaluate(StatementAdapter.java:36)
at com.carrotsearch.randomizedtesting.ThreadLeakControl$StatementRunner.run(ThreadLeakControl.java:390)
at com.carrotsearch.randomizedtesting.ThreadLeakControl.forkTimeoutingTask(ThreadLeakControl.java:843)
at com.carrotsearch.randomizedtesting.ThreadLeakControl$3.evaluate(ThreadLeakControl.java:490)
at com.carrotsearch.randomizedtesting.RandomizedRunner.runSingleTest(RandomizedRunner.java:955)
at com.carrotsearch.randomizedtesting.RandomizedRunner$5.evaluate(RandomizedRunner.java:840)
at com.carrotsearch.randomizedtesting.RandomizedRunner$6.evaluate(RandomizedRunner.java:891)
at com.carrotsearch.randomizedtesting.RandomizedRunner$7.evaluate(RandomizedRunner.java:902)
at com.carrotsearch.randomizedtesting.rules.StatementAdapter.evaluate(StatementAdapter.java:36)
at com.carrotsearch.randomizedtesting.rules.StatementAdapter.evaluate(StatementAdapter.java:36)
at org.apache.lucene.tests.util.AbstractBeforeAfterRule$1.evaluate(AbstractBeforeAfterRule.java:43)
at com.carrotsearch.randomizedtesting.rules.SystemPropertiesRestoreRule$1.evaluate(SystemPropertiesRestoreRule.java:80)
at org.junit.rules.RunRules.evaluate(RunRules.java:20)
at org.apache.lucene.tests.util.AbstractBeforeAfterRule$1.evaluate(AbstractBeforeAfterRule.java:43)
at com.carrotsearch.randomizedtesting.rules.StatementAdapter.evaluate(StatementAdapter.java:36)
at org.apache.lucene.tests.util.TestRuleStoreClassName$1.evaluate(TestRuleStoreClassName.java:38)
at com.carrotsearch.randomizedtesting.rules.NoShadowingOrOverridesOnMethodsRule$1.evaluate(NoShadowingOrOverridesOnMethodsRule.java:40)
at com.carrotsearch.randomizedtesting.rules.NoShadowingOrOverridesOnMethodsRule$1.evaluate(NoShadowingOrOverridesOnMethodsRule.java:40)
at com.carrotsearch.randomizedtesting.rules.StatementAdapter.evaluate(StatementAdapter.java:36)
at com.carrotsearch.randomizedtesting.rules.StatementAdapter.evaluate(StatementAdapter.java:36)
at org.apache.lucene.tests.util.TestRuleAssertionsRequired$1.evaluate(TestRuleAssertionsRequired.java:53)
at org.apache.lucene.tests.util.AbstractBeforeAfterRule$1.evaluate(AbstractBeforeAfterRule.java:43)
at org.apache.lucene.tests.util.TestRuleMarkFailure$1.evaluate(TestRuleMarkFailure.java:44)
at org.apache.lucene.tests.util.TestRuleIgnoreAfterMaxFailures$1.evaluate(TestRuleIgnoreAfterMaxFailures.java:60)
at org.apache.lucene.tests.util.TestRuleIgnoreTestSuites$1.evaluate(TestRuleIgnoreTestSuites.java:47)
at org.junit.rules.RunRules.evaluate(RunRules.java:20)
at com.carrotsearch.randomizedtesting.rules.StatementAdapter.evaluate(StatementAdapter.java:36)
at com.carrotsearch.randomizedtesting.ThreadLeakControl$StatementRunner.run(ThreadLeakControl.java:390)
at com.carrotsearch.randomizedtesting.ThreadLeakControl.lambda$forkTimeoutingTask$0(ThreadLeakControl.java:850)
at java.base/java.lang.Thread.run(Thread.java:829)
FAILED: org.apache.solr.cloud.api.collections.ShardSplitTest.test
Error Message:
java.security.AccessControlException: access denied ("java.net.SocketPermission" "127.0.0.1:80" "connect,resolve")
Stack Trace:
java.security.AccessControlException: access denied ("java.net.SocketPermission" "127.0.0.1:80" "connect,resolve")
at __randomizedtesting.SeedInfo.seed([221BB1D8D3478873:AA4F8E027DBBE58B]:0)
at java.base/java.security.AccessControlContext.checkPermission(AccessControlContext.java:472)
at java.base/java.security.AccessController.checkPermission(AccessController.java:897)
at java.base/java.lang.SecurityManager.checkPermission(SecurityManager.java:322)
at java.base/java.lang.SecurityManager.checkConnect(SecurityManager.java:824)
at java.base/java.net.Socket.connect(Socket.java:604)
at org.apache.http.conn.socket.PlainConnectionSocketFactory.connectSocket(PlainConnectionSocketFactory.java:75)
at org.apache.http.impl.conn.DefaultHttpClientConnectionOperator.connect(DefaultHttpClientConnectionOperator.java:142)
at org.apache.http.impl.conn.PoolingHttpClientConnectionManager.connect(PoolingHttpClientConnectionManager.java:376)
at org.apache.http.impl.execchain.MainClientExec.establishRoute(MainClientExec.java:393)
at org.apache.http.impl.execchain.MainClientExec.execute(MainClientExec.java:236)
at org.apache.http.impl.execchain.ProtocolExec.execute(ProtocolExec.java:186)
at org.apache.http.impl.execchain.RetryExec.execute(RetryExec.java:89)
at org.apache.http.impl.execchain.RedirectExec.execute(RedirectExec.java:110)
at org.apache.http.impl.client.InternalHttpClient.doExecute(InternalHttpClient.java:185)
at org.apache.http.impl.client.CloseableHttpClient.execute(CloseableHttpClient.java:83)
at org.apache.http.impl.client.CloseableHttpClient.execute(CloseableHttpClient.java:56)
at org.apache.solr.client.solrj.impl.HttpSolrClient.executeMethod(HttpSolrClient.java:594)
at org.apache.solr.client.solrj.impl.HttpSolrClient.request(HttpSolrClient.java:257)
at org.apache.solr.client.solrj.impl.HttpSolrClient.request(HttpSolrClient.java:236)
at org.apache.solr.client.solrj.SolrClient.request(SolrClient.java:1194)
at org.apache.solr.cloud.api.collections.ShardSplitTest.splitShard(ShardSplitTest.java:1289)
at org.apache.solr.cloud.api.collections.ShardSplitTest.incompleteOrOverlappingCustomRangeTest(ShardSplitTest.java:799)
at org.apache.solr.cloud.api.collections.ShardSplitTest.test(ShardSplitTest.java:109)
at java.base/jdk.internal.reflect.NativeMethodAccessorImpl.invoke0(Native Method)
at java.base/jdk.internal.reflect.NativeMethodAccessorImpl.invoke(NativeMethodAccessorImpl.java:62)
at java.base/jdk.internal.reflect.DelegatingMethodAccessorImpl.invoke(DelegatingMethodAccessorImpl.java:43)
at java.base/java.lang.reflect.Method.invoke(Method.java:566)
at com.carrotsearch.randomizedtesting.RandomizedRunner.invoke(RandomizedRunner.java:1758)
at com.carrotsearch.randomizedtesting.RandomizedRunner$8.evaluate(RandomizedRunner.java:946)
at com.carrotsearch.randomizedtesting.RandomizedRunner$9.evaluate(RandomizedRunner.java:982)
at com.carrotsearch.randomizedtesting.RandomizedRunner$10.evaluate(RandomizedRunner.java:996)
at org.apache.solr.BaseDistributedSearchTestCase$ShardsRepeatRule$ShardsFixedStatement.callStatement(BaseDistributedSearchTestCase.java:1069)
at org.apache.solr.BaseDistributedSearchTestCase$ShardsRepeatRule$ShardsStatement.evaluate(BaseDistributedSearchTestCase.java:1040)
at com.carrotsearch.randomizedtesting.rules.SystemPropertiesRestoreRule$1.evaluate(SystemPropertiesRestoreRule.java:80)
at org.junit.rules.RunRules.evaluate(RunRules.java:20)
at org.apache.lucene.tests.util.TestRuleSetupTeardownChained$1.evaluate(TestRuleSetupTeardownChained.java:48)
at org.apache.lucene.tests.util.AbstractBeforeAfterRule$1.evaluate(AbstractBeforeAfterRule.java:43)
at org.apache.lucene.tests.util.TestRuleThreadAndTestName$1.evaluate(TestRuleThreadAndTestName.java:45)
at org.apache.lucene.tests.util.TestRuleIgnoreAfterMaxFailures$1.evaluate(TestRuleIgnoreAfterMaxFailures.java:60)
at org.apache.lucene.tests.util.TestRuleMarkFailure$1.evaluate(TestRuleMarkFailure.java:44)
at org.junit.rules.RunRules.evaluate(RunRules.java:20)
at com.carrotsearch.randomizedtesting.rules.StatementAdapter.evaluate(StatementAdapter.java:36)
at com.carrotsearch.randomizedtesting.ThreadLeakControl$StatementRunner.run(ThreadLeakControl.java:390)
at com.carrotsearch.randomizedtesting.ThreadLeakControl.forkTimeoutingTask(ThreadLeakControl.java:843)
at com.carrotsearch.randomizedtesting.ThreadLeakControl$3.evaluate(ThreadLeakControl.java:490)
at com.carrotsearch.randomizedtesting.RandomizedRunner.runSingleTest(RandomizedRunner.java:955)
at com.carrotsearch.randomizedtesting.RandomizedRunner$5.evaluate(RandomizedRunner.java:840)
at com.carrotsearch.randomizedtesting.RandomizedRunner$6.evaluate(RandomizedRunner.java:891)
at com.carrotsearch.randomizedtesting.RandomizedRunner$7.evaluate(RandomizedRunner.java:902)
at com.carrotsearch.randomizedtesting.rules.StatementAdapter.evaluate(StatementAdapter.java:36)
at com.carrotsearch.randomizedtesting.rules.StatementAdapter.evaluate(StatementAdapter.java:36)
at org.apache.lucene.tests.util.AbstractBeforeAfterRule$1.evaluate(AbstractBeforeAfterRule.java:43)
at com.carrotsearch.randomizedtesting.rules.SystemPropertiesRestoreRule$1.evaluate(SystemPropertiesRestoreRule.java:80)
at org.junit.rules.RunRules.evaluate(RunRules.java:20)
at org.apache.lucene.tests.util.AbstractBeforeAfterRule$1.evaluate(AbstractBeforeAfterRule.java:43)
at com.carrotsearch.randomizedtesting.rules.StatementAdapter.evaluate(StatementAdapter.java:36)
at org.apache.lucene.tests.util.TestRuleStoreClassName$1.evaluate(TestRuleStoreClassName.java:38)
at com.carrotsearch.randomizedtesting.rules.NoShadowingOrOverridesOnMethodsRule$1.evaluate(NoShadowingOrOverridesOnMethodsRule.java:40)
at com.carrotsearch.randomizedtesting.rules.NoShadowingOrOverridesOnMethodsRule$1.evaluate(NoShadowingOrOverridesOnMethodsRule.java:40)
at com.carrotsearch.randomizedtesting.rules.StatementAdapter.evaluate(StatementAdapter.java:36)
at com.carrotsearch.randomizedtesting.rules.StatementAdapter.evaluate(StatementAdapter.java:36)
at org.apache.lucene.tests.util.TestRuleAssertionsRequired$1.evaluate(TestRuleAssertionsRequired.java:53)
at org.apache.lucene.tests.util.AbstractBeforeAfterRule$1.evaluate(AbstractBeforeAfterRule.java:43)
at org.apache.lucene.tests.util.TestRuleMarkFailure$1.evaluate(TestRuleMarkFailure.java:44)
at org.apache.lucene.tests.util.TestRuleIgnoreAfterMaxFailures$1.evaluate(TestRuleIgnoreAfterMaxFailures.java:60)
at org.apache.lucene.tests.util.TestRuleIgnoreTestSuites$1.evaluate(TestRuleIgnoreTestSuites.java:47)
at org.junit.rules.RunRules.evaluate(RunRules.java:20)
at com.carrotsearch.randomizedtesting.rules.StatementAdapter.evaluate(StatementAdapter.java:36)
at com.carrotsearch.randomizedtesting.ThreadLeakControl$StatementRunner.run(ThreadLeakControl.java:390)
at com.carrotsearch.randomizedtesting.ThreadLeakControl.lambda$forkTimeoutingTask$0(ThreadLeakControl.java:850)
at java.base/java.lang.Thread.run(Thread.java:829)
FAILED: org.apache.solr.cloud.api.collections.ShardSplitTest.testSplitStaticIndexReplication
Error Message:
java.util.concurrent.TimeoutException: Timeout waiting to see state for collection=testSplitStaticIndexReplication_rewrite :DocCollection(testSplitStaticIndexReplication_rewrite//collections/testSplitStaticIndexReplication_rewrite/state.json/19 )={
"pullReplicas":"0",
"configName":"conf1",
"replicationFactor":1,
"router":{"name":"compositeId"},
"nrtReplicas":1,
"tlogReplicas":"0",
"shards":{
"shard1":{
"range":"80000000-7fffffff",
"state":"inactive",
"stateTimestamp":"1711313669875493540",
"replicas":{"core_node2":{
"core":"testSplitStaticIndexReplication_rewrite_shard1_replica_n1",
"node_name":"127.0.0.1:40697_solr",
"type":"NRT",
"state":"active",
"leader":"true",
"force_set_state":"false",
"base_url":"http://127.0.0.1:40697/solr"}}},
"shard1_0":{
"range":"80000000-ffffffff",
"state":"active",
"stateTimestamp":"1711313669875479318",
"replicas":{
"core_node5":{
"core":"testSplitStaticIndexReplication_rewrite_shard1_0_replica_n3",
"node_name":"127.0.0.1:40697_solr",
"type":"NRT",
"state":"active",
"leader":"true",
"force_set_state":"false",
"base_url":"http://127.0.0.1:40697/solr"},
"core_node8":{
"core":"testSplitStaticIndexReplication_rewrite_shard1_0_replica_n7",
"node_name":"127.0.0.1:42195_solr",
"type":"NRT",
"state":"active",
"force_set_state":"false",
"base_url":"http://127.0.0.1:42195/solr"}}},
"shard1_1":{
"range":"0-7fffffff",
"state":"active",
"stateTimestamp":"1711313669875455182",
"replicas":{"core_node6":{
"core":"testSplitStaticIndexReplication_rewrite_shard1_1_replica_n4",
"node_name":"127.0.0.1:40697_solr",
"type":"NRT",
"state":"active",
"leader":"true",
"force_set_state":"false",
"base_url":"http://127.0.0.1:40697/solr"}}}}}
Stack Trace:
java.util.concurrent.TimeoutException: Timeout waiting to see state for collection=testSplitStaticIndexReplication_rewrite :DocCollection(testSplitStaticIndexReplication_rewrite//collections/testSplitStaticIndexReplication_rewrite/state.json/19 )={
"pullReplicas":"0",
"configName":"conf1",
"replicationFactor":1,
"router":{"name":"compositeId"},
"nrtReplicas":1,
"tlogReplicas":"0",
"shards":{
"shard1":{
"range":"80000000-7fffffff",
"state":"inactive",
"stateTimestamp":"1711313669875493540",
"replicas":{"core_node2":{
"core":"testSplitStaticIndexReplication_rewrite_shard1_replica_n1",
"node_name":"127.0.0.1:40697_solr",
"type":"NRT",
"state":"active",
"leader":"true",
"force_set_state":"false",
"base_url":"http://127.0.0.1:40697/solr"}}},
"shard1_0":{
"range":"80000000-ffffffff",
"state":"active",
"stateTimestamp":"1711313669875479318",
"replicas":{
"core_node5":{
"core":"testSplitStaticIndexReplication_rewrite_shard1_0_replica_n3",
"node_name":"127.0.0.1:40697_solr",
"type":"NRT",
"state":"active",
"leader":"true",
"force_set_state":"false",
"base_url":"http://127.0.0.1:40697/solr"},
"core_node8":{
"core":"testSplitStaticIndexReplication_rewrite_shard1_0_replica_n7",
"node_name":"127.0.0.1:42195_solr",
"type":"NRT",
"state":"active",
"force_set_state":"false",
"base_url":"http://127.0.0.1:42195/solr"}}},
"shard1_1":{
"range":"0-7fffffff",
"state":"active",
"stateTimestamp":"1711313669875455182",
"replicas":{"core_node6":{
"core":"testSplitStaticIndexReplication_rewrite_shard1_1_replica_n4",
"node_name":"127.0.0.1:40697_solr",
"type":"NRT",
"state":"active",
"leader":"true",
"force_set_state":"false",
"base_url":"http://127.0.0.1:40697/solr"}}}}}
at __randomizedtesting.SeedInfo.seed([221BB1D8D3478873:685125D842EFA776]:0)
at org.apache.solr.common.cloud.ZkStateReader.waitForState(ZkStateReader.java:1847)
at org.apache.solr.cloud.api.collections.ShardSplitTest.doSplitStaticIndexReplication(ShardSplitTest.java:252)
at org.apache.solr.cloud.api.collections.ShardSplitTest.testSplitStaticIndexReplication(ShardSplitTest.java:126)
at java.base/jdk.internal.reflect.NativeMethodAccessorImpl.invoke0(Native Method)
at java.base/jdk.internal.reflect.NativeMethodAccessorImpl.invoke(NativeMethodAccessorImpl.java:62)
at java.base/jdk.internal.reflect.DelegatingMethodAccessorImpl.invoke(DelegatingMethodAccessorImpl.java:43)
at java.base/java.lang.reflect.Method.invoke(Method.java:566)
at com.carrotsearch.randomizedtesting.RandomizedRunner.invoke(RandomizedRunner.java:1758)
at com.carrotsearch.randomizedtesting.RandomizedRunner$8.evaluate(RandomizedRunner.java:946)
at com.carrotsearch.randomizedtesting.RandomizedRunner$9.evaluate(RandomizedRunner.java:982)
at com.carrotsearch.randomizedtesting.RandomizedRunner$10.evaluate(RandomizedRunner.java:996)
at org.apache.solr.BaseDistributedSearchTestCase$ShardsRepeatRule$ShardsFixedStatement.callStatement(BaseDistributedSearchTestCase.java:1069)
at org.apache.solr.BaseDistributedSearchTestCase$ShardsRepeatRule$ShardsStatement.evaluate(BaseDistributedSearchTestCase.java:1040)
at com.carrotsearch.randomizedtesting.rules.SystemPropertiesRestoreRule$1.evaluate(SystemPropertiesRestoreRule.java:80)
at org.junit.rules.RunRules.evaluate(RunRules.java:20)
at org.apache.lucene.tests.util.TestRuleSetupTeardownChained$1.evaluate(TestRuleSetupTeardownChained.java:48)
at org.apache.lucene.tests.util.AbstractBeforeAfterRule$1.evaluate(AbstractBeforeAfterRule.java:43)
at org.apache.lucene.tests.util.TestRuleThreadAndTestName$1.evaluate(TestRuleThreadAndTestName.java:45)
at org.apache.lucene.tests.util.TestRuleIgnoreAfterMaxFailures$1.evaluate(TestRuleIgnoreAfterMaxFailures.java:60)
at org.apache.lucene.tests.util.TestRuleMarkFailure$1.evaluate(TestRuleMarkFailure.java:44)
at org.junit.rules.RunRules.evaluate(RunRules.java:20)
at com.carrotsearch.randomizedtesting.rules.StatementAdapter.evaluate(StatementAdapter.java:36)
at com.carrotsearch.randomizedtesting.ThreadLeakControl$StatementRunner.run(ThreadLeakControl.java:390)
at com.carrotsearch.randomizedtesting.ThreadLeakControl.forkTimeoutingTask(ThreadLeakControl.java:843)
at com.carrotsearch.randomizedtesting.ThreadLeakControl$3.evaluate(ThreadLeakControl.java:490)
at com.carrotsearch.randomizedtesting.RandomizedRunner.runSingleTest(RandomizedRunner.java:955)
at com.carrotsearch.randomizedtesting.RandomizedRunner$5.evaluate(RandomizedRunner.java:840)
at com.carrotsearch.randomizedtesting.RandomizedRunner$6.evaluate(RandomizedRunner.java:891)
at com.carrotsearch.randomizedtesting.RandomizedRunner$7.evaluate(RandomizedRunner.java:902)
at com.carrotsearch.randomizedtesting.rules.StatementAdapter.evaluate(StatementAdapter.java:36)
at com.carrotsearch.randomizedtesting.rules.StatementAdapter.evaluate(StatementAdapter.java:36)
at org.apache.lucene.tests.util.AbstractBeforeAfterRule$1.evaluate(AbstractBeforeAfterRule.java:43)
at com.carrotsearch.randomizedtesting.rules.SystemPropertiesRestoreRule$1.evaluate(SystemPropertiesRestoreRule.java:80)
at org.junit.rules.RunRules.evaluate(RunRules.java:20)
at org.apache.lucene.tests.util.AbstractBeforeAfterRule$1.evaluate(AbstractBeforeAfterRule.java:43)
at com.carrotsearch.randomizedtesting.rules.StatementAdapter.evaluate(StatementAdapter.java:36)
at org.apache.lucene.tests.util.TestRuleStoreClassName$1.evaluate(TestRuleStoreClassName.java:38)
at com.carrotsearch.randomizedtesting.rules.NoShadowingOrOverridesOnMethodsRule$1.evaluate(NoShadowingOrOverridesOnMethodsRule.java:40)
at com.carrotsearch.randomizedtesting.rules.NoShadowingOrOverridesOnMethodsRule$1.evaluate(NoShadowingOrOverridesOnMethodsRule.java:40)
at com.carrotsearch.randomizedtesting.rules.StatementAdapter.evaluate(StatementAdapter.java:36)
at com.carrotsearch.randomizedtesting.rules.StatementAdapter.evaluate(StatementAdapter.java:36)
at org.apache.lucene.tests.util.TestRuleAssertionsRequired$1.evaluate(TestRuleAssertionsRequired.java:53)
at org.apache.lucene.tests.util.AbstractBeforeAfterRule$1.evaluate(AbstractBeforeAfterRule.java:43)
at org.apache.lucene.tests.util.TestRuleMarkFailure$1.evaluate(TestRuleMarkFailure.java:44)
at org.apache.lucene.tests.util.TestRuleIgnoreAfterMaxFailures$1.evaluate(TestRuleIgnoreAfterMaxFailures.java:60)
at org.apache.lucene.tests.util.TestRuleIgnoreTestSuites$1.evaluate(TestRuleIgnoreTestSuites.java:47)
at org.junit.rules.RunRules.evaluate(RunRules.java:20)
at com.carrotsearch.randomizedtesting.rules.StatementAdapter.evaluate(StatementAdapter.java:36)
at com.carrotsearch.randomizedtesting.ThreadLeakControl$StatementRunner.run(ThreadLeakControl.java:390)
at com.carrotsearch.randomizedtesting.ThreadLeakControl.lambda$forkTimeoutingTask$0(ThreadLeakControl.java:850)
at java.base/java.lang.Thread.run(Thread.java:829)
FAILED: org.apache.solr.cloud.api.collections.ShardSplitTest.testSplitMixedReplicaTypesLink
Error Message:
java.util.concurrent.TimeoutException: Timeout waiting to see state for collection=testSplitMixedReplicaTypes_link :DocCollection(testSplitMixedReplicaTypes_link//collections/testSplitMixedReplicaTypes_link/state.json/18 )={
"pullReplicas":2,
"configName":"conf1",
"replicationFactor":2,
"router":{"name":"compositeId"},
"nrtReplicas":2,
"tlogReplicas":0,
"shards":{
"shard1":{
"range":"80000000-7fffffff",
"state":"inactive",
"stateTimestamp":"1711313771083412551",
"replicas":{
"core_node3":{
"core":"testSplitMixedReplicaTypes_link_shard1_replica_p1",
"node_name":"127.0.0.1:38527_solr",
"type":"PULL",
"state":"active",
"force_set_state":"false",
"base_url":"http://127.0.0.1:38527/solr"},
"core_node5":{
"core":"testSplitMixedReplicaTypes_link_shard1_replica_n2",
"node_name":"127.0.0.1:36141_solr",
"type":"NRT",
"state":"active",
"leader":"true",
"force_set_state":"false",
"base_url":"http://127.0.0.1:36141/solr"},
"core_node7":{
"core":"testSplitMixedReplicaTypes_link_shard1_replica_p4",
"node_name":"127.0.0.1:40083_solr",
"type":"PULL",
"state":"active",
"force_set_state":"false",
"base_url":"http://127.0.0.1:40083/solr"},
"core_node8":{
"core":"testSplitMixedReplicaTypes_link_shard1_replica_n6",
"node_name":"127.0.0.1:35025_solr",
"type":"NRT",
"state":"active",
"force_set_state":"false",
"base_url":"http://127.0.0.1:35025/solr"}}},
"shard1_0":{
"range":"80000000-ffffffff",
"stateTimestamp":"1711313771083399047",
"state":"active",
"replicas":{
"core_node11":{
"core":"testSplitMixedReplicaTypes_link_shard1_0_replica_n9",
"node_name":"127.0.0.1:36141_solr",
"type":"NRT",
"state":"active",
"leader":"true",
"force_set_state":"false",
"base_url":"http://127.0.0.1:36141/solr"},
"core_node13":{
"core":"testSplitMixedReplicaTypes_link_shard1_0_replica_p0",
"node_name":"127.0.0.1:35025_solr",
"type":"PULL",
"state":"active",
"force_set_state":"false",
"base_url":"http://127.0.0.1:35025/solr"},
"core_node17":{
"core":"testSplitMixedReplicaTypes_link_shard1_0_replica_n4",
"node_name":"127.0.0.1:38527_solr",
"type":"NRT",
"state":"active",
"force_set_state":"false",
"base_url":"http://127.0.0.1:38527/solr"},
"core_node18":{
"core":"testSplitMixedReplicaTypes_link_shard1_0_replica_p5",
"node_name":"127.0.0.1:45555_solr",
"type":"PULL",
"state":"active",
"force_set_state":"false",
"base_url":"http://127.0.0.1:45555/solr"}}},
"shard1_1":{
"range":"0-7fffffff",
"stateTimestamp":"1711313771083371068",
"state":"active",
"replicas":{
"core_node12":{
"core":"testSplitMixedReplicaTypes_link_shard1_1_replica_n10",
"node_name":"127.0.0.1:36141_solr",
"type":"NRT",
"state":"active",
"leader":"true",
"force_set_state":"false",
"base_url":"http://127.0.0.1:36141/solr"},
"core_node14":{
"core":"testSplitMixedReplicaTypes_link_shard1_1_replica_p1",
"node_name":"127.0.0.1:35025_solr",
"type":"PULL",
"state":"active",
"force_set_state":"false",
"base_url":"http://127.0.0.1:35025/solr"},
"core_node15":{
"core":"testSplitMixedReplicaTypes_link_shard1_1_replica_p2",
"node_name":"127.0.0.1:40083_solr",
"type":"PULL",
"state":"active",
"force_set_state":"false",
"base_url":"http://127.0.0.1:40083/solr"},
"core_node16":{
"core":"testSplitMixedReplicaTypes_link_shard1_1_replica_n3",
"node_name":"127.0.0.1:45555_solr",
"type":"NRT",
"state":"active",
"force_set_state":"false",
"base_url":"http://127.0.0.1:45555/solr"}}}}}
Stack Trace:
java.util.concurrent.TimeoutException: Timeout waiting to see state for collection=testSplitMixedReplicaTypes_link :DocCollection(testSplitMixedReplicaTypes_link//collections/testSplitMixedReplicaTypes_link/state.json/18 )={
"pullReplicas":2,
"configName":"conf1",
"replicationFactor":2,
"router":{"name":"compositeId"},
"nrtReplicas":2,
"tlogReplicas":0,
"shards":{
"shard1":{
"range":"80000000-7fffffff",
"state":"inactive",
"stateTimestamp":"1711313771083412551",
"replicas":{
"core_node3":{
"core":"testSplitMixedReplicaTypes_link_shard1_replica_p1",
"node_name":"127.0.0.1:38527_solr",
"type":"PULL",
"state":"active",
"force_set_state":"false",
"base_url":"http://127.0.0.1:38527/solr"},
"core_node5":{
"core":"testSplitMixedReplicaTypes_link_shard1_replica_n2",
"node_name":"127.0.0.1:36141_solr",
"type":"NRT",
"state":"active",
"leader":"true",
"force_set_state":"false",
"base_url":"http://127.0.0.1:36141/solr"},
"core_node7":{
"core":"testSplitMixedReplicaTypes_link_shard1_replica_p4",
"node_name":"127.0.0.1:40083_solr",
"type":"PULL",
"state":"active",
"force_set_state":"false",
"base_url":"http://127.0.0.1:40083/solr"},
"core_node8":{
"core":"testSplitMixedReplicaTypes_link_shard1_replica_n6",
"node_name":"127.0.0.1:35025_solr",
"type":"NRT",
"state":"active",
"force_set_state":"false",
"base_url":"http://127.0.0.1:35025/solr"}}},
"shard1_0":{
"range":"80000000-ffffffff",
"stateTimestamp":"1711313771083399047",
"state":"active",
"replicas":{
"core_node11":{
"core":"testSplitMixedReplicaTypes_link_shard1_0_replica_n9",
"node_name":"127.0.0.1:36141_solr",
"type":"NRT",
"state":"active",
"leader":"true",
"force_set_state":"false",
"base_url":"http://127.0.0.1:36141/solr"},
"core_node13":{
"core":"testSplitMixedReplicaTypes_link_shard1_0_replica_p0",
"node_name":"127.0.0.1:35025_solr",
"type":"PULL",
"state":"active",
"force_set_state":"false",
"base_url":"http://127.0.0.1:35025/solr"},
"core_node17":{
"core":"testSplitMixedReplicaTypes_link_shard1_0_replica_n4",
"node_name":"127.0.0.1:38527_solr",
"type":"NRT",
"state":"active",
"force_set_state":"false",
"base_url":"http://127.0.0.1:38527/solr"},
"core_node18":{
"core":"testSplitMixedReplicaTypes_link_shard1_0_replica_p5",
"node_name":"127.0.0.1:45555_solr",
"type":"PULL",
"state":"active",
"force_set_state":"false",
"base_url":"http://127.0.0.1:45555/solr"}}},
"shard1_1":{
"range":"0-7fffffff",
"stateTimestamp":"1711313771083371068",
"state":"active",
"replicas":{
"core_node12":{
"core":"testSplitMixedReplicaTypes_link_shard1_1_replica_n10",
"node_name":"127.0.0.1:36141_solr",
"type":"NRT",
"state":"active",
"leader":"true",
"force_set_state":"false",
"base_url":"http://127.0.0.1:36141/solr"},
"core_node14":{
"core":"testSplitMixedReplicaTypes_link_shard1_1_replica_p1",
"node_name":"127.0.0.1:35025_solr",
"type":"PULL",
"state":"active",
"force_set_state":"false",
"base_url":"http://127.0.0.1:35025/solr"},
"core_node15":{
"core":"testSplitMixedReplicaTypes_link_shard1_1_replica_p2",
"node_name":"127.0.0.1:40083_solr",
"type":"PULL",
"state":"active",
"force_set_state":"false",
"base_url":"http://127.0.0.1:40083/solr"},
"core_node16":{
"core":"testSplitMixedReplicaTypes_link_shard1_1_replica_n3",
"node_name":"127.0.0.1:45555_solr",
"type":"NRT",
"state":"active",
"force_set_state":"false",
"base_url":"http://127.0.0.1:45555/solr"}}}}}
at __randomizedtesting.SeedInfo.seed([221BB1D8D3478873:1E757881769F23EA]:0)
at org.apache.solr.common.cloud.ZkStateReader.waitForState(ZkStateReader.java:1847)
at org.apache.solr.cloud.api.collections.ShardSplitTest.doSplitMixedReplicaTypes(ShardSplitTest.java:442)
at org.apache.solr.cloud.api.collections.ShardSplitTest.testSplitMixedReplicaTypesLink(ShardSplitTest.java:412)
at java.base/jdk.internal.reflect.NativeMethodAccessorImpl.invoke0(Native Method)
at java.base/jdk.internal.reflect.NativeMethodAccessorImpl.invoke(NativeMethodAccessorImpl.java:62)
at java.base/jdk.internal.reflect.DelegatingMethodAccessorImpl.invoke(DelegatingMethodAccessorImpl.java:43)
at java.base/java.lang.reflect.Method.invoke(Method.java:566)
at com.carrotsearch.randomizedtesting.RandomizedRunner.invoke(RandomizedRunner.java:1758)
at com.carrotsearch.randomizedtesting.RandomizedRunner$8.evaluate(RandomizedRunner.java:946)
at com.carrotsearch.randomizedtesting.RandomizedRunner$9.evaluate(RandomizedRunner.java:982)
at com.carrotsearch.randomizedtesting.RandomizedRunner$10.evaluate(RandomizedRunner.java:996)
at org.apache.solr.BaseDistributedSearchTestCase$ShardsRepeatRule$ShardsFixedStatement.callStatement(BaseDistributedSearchTestCase.java:1069)
at org.apache.solr.BaseDistributedSearchTestCase$ShardsRepeatRule$ShardsStatement.evaluate(BaseDistributedSearchTestCase.java:1040)
at com.carrotsearch.randomizedtesting.rules.SystemPropertiesRestoreRule$1.evaluate(SystemPropertiesRestoreRule.java:80)
at org.junit.rules.RunRules.evaluate(RunRules.java:20)
at org.apache.lucene.tests.util.TestRuleSetupTeardownChained$1.evaluate(TestRuleSetupTeardownChained.java:48)
at org.apache.lucene.tests.util.AbstractBeforeAfterRule$1.evaluate(AbstractBeforeAfterRule.java:43)
at org.apache.lucene.tests.util.TestRuleThreadAndTestName$1.evaluate(TestRuleThreadAndTestName.java:45)
at org.apache.lucene.tests.util.TestRuleIgnoreAfterMaxFailures$1.evaluate(TestRuleIgnoreAfterMaxFailures.java:60)
at org.apache.lucene.tests.util.TestRuleMarkFailure$1.evaluate(TestRuleMarkFailure.java:44)
at org.junit.rules.RunRules.evaluate(RunRules.java:20)
at com.carrotsearch.randomizedtesting.rules.StatementAdapter.evaluate(StatementAdapter.java:36)
at com.carrotsearch.randomizedtesting.ThreadLeakControl$StatementRunner.run(ThreadLeakControl.java:390)
at com.carrotsearch.randomizedtesting.ThreadLeakControl.forkTimeoutingTask(ThreadLeakControl.java:843)
at com.carrotsearch.randomizedtesting.ThreadLeakControl$3.evaluate(ThreadLeakControl.java:490)
at com.carrotsearch.randomizedtesting.RandomizedRunner.runSingleTest(RandomizedRunner.java:955)
at com.carrotsearch.randomizedtesting.RandomizedRunner$5.evaluate(RandomizedRunner.java:840)
at com.carrotsearch.randomizedtesting.RandomizedRunner$6.evaluate(RandomizedRunner.java:891)
at com.carrotsearch.randomizedtesting.RandomizedRunner$7.evaluate(RandomizedRunner.java:902)
at com.carrotsearch.randomizedtesting.rules.StatementAdapter.evaluate(StatementAdapter.java:36)
at com.carrotsearch.randomizedtesting.rules.StatementAdapter.evaluate(StatementAdapter.java:36)
at org.apache.lucene.tests.util.AbstractBeforeAfterRule$1.evaluate(AbstractBeforeAfterRule.java:43)
at com.carrotsearch.randomizedtesting.rules.SystemPropertiesRestoreRule$1.evaluate(SystemPropertiesRestoreRule.java:80)
at org.junit.rules.RunRules.evaluate(RunRules.java:20)
at org.apache.lucene.tests.util.AbstractBeforeAfterRule$1.evaluate(AbstractBeforeAfterRule.java:43)
at com.carrotsearch.randomizedtesting.rules.StatementAdapter.evaluate(StatementAdapter.java:36)
at org.apache.lucene.tests.util.TestRuleStoreClassName$1.evaluate(TestRuleStoreClassName.java:38)
at com.carrotsearch.randomizedtesting.rules.NoShadowingOrOverridesOnMethodsRule$1.evaluate(NoShadowingOrOverridesOnMethodsRule.java:40)
at com.carrotsearch.randomizedtesting.rules.NoShadowingOrOverridesOnMethodsRule$1.evaluate(NoShadowingOrOverridesOnMethodsRule.java:40)
at com.carrotsearch.randomizedtesting.rules.StatementAdapter.evaluate(StatementAdapter.java:36)
at com.carrotsearch.randomizedtesting.rules.StatementAdapter.evaluate(StatementAdapter.java:36)
at org.apache.lucene.tests.util.TestRuleAssertionsRequired$1.evaluate(TestRuleAssertionsRequired.java:53)
at org.apache.lucene.tests.util.AbstractBeforeAfterRule$1.evaluate(AbstractBeforeAfterRule.java:43)
at org.apache.lucene.tests.util.TestRuleMarkFailure$1.evaluate(TestRuleMarkFailure.java:44)
at org.apache.lucene.tests.util.TestRuleIgnoreAfterMaxFailures$1.evaluate(TestRuleIgnoreAfterMaxFailures.java:60)
at org.apache.lucene.tests.util.TestRuleIgnoreTestSuites$1.evaluate(TestRuleIgnoreTestSuites.java:47)
at org.junit.rules.RunRules.evaluate(RunRules.java:20)
at com.carrotsearch.randomizedtesting.rules.StatementAdapter.evaluate(StatementAdapter.java:36)
at com.carrotsearch.randomizedtesting.ThreadLeakControl$StatementRunner.run(ThreadLeakControl.java:390)
at com.carrotsearch.randomizedtesting.ThreadLeakControl.lambda$forkTimeoutingTask$0(ThreadLeakControl.java:850)
at java.base/java.lang.Thread.run(Thread.java:829)
FAILED: org.apache.solr.hdfs.cloud.StressHdfsTest.test
Error Message:
java.security.AccessControlException: access denied ("java.net.SocketPermission" "127.0.0." "resolve")
Stack Trace:
java.security.AccessControlException: access denied ("java.net.SocketPermission" "127.0.0." "resolve")
at __randomizedtesting.SeedInfo.seed([221BB1D8D3478873:AA4F8E027DBBE58B]:0)
at java.base/java.security.AccessControlContext.checkPermission(AccessControlContext.java:472)
at java.base/java.security.AccessController.checkPermission(AccessController.java:897)
at java.base/java.lang.SecurityManager.checkPermission(SecurityManager.java:322)
at java.base/java.lang.SecurityManager.checkConnect(SecurityManager.java:821)
at java.base/java.net.InetAddress.getAllByName0(InetAddress.java:1467)
at java.base/java.net.InetAddress.getAllByName(InetAddress.java:1378)
at java.base/java.net.InetAddress.getAllByName(InetAddress.java:1306)
at org.apache.http.impl.conn.SystemDefaultDnsResolver.resolve(SystemDefaultDnsResolver.java:45)
at org.apache.http.impl.conn.DefaultHttpClientConnectionOperator.connect(DefaultHttpClientConnectionOperator.java:112)
at org.apache.http.impl.conn.PoolingHttpClientConnectionManager.connect(PoolingHttpClientConnectionManager.java:376)
at org.apache.http.impl.execchain.MainClientExec.establishRoute(MainClientExec.java:393)
at org.apache.http.impl.execchain.MainClientExec.execute(MainClientExec.java:236)
at org.apache.http.impl.execchain.ProtocolExec.execute(ProtocolExec.java:186)
at org.apache.http.impl.execchain.RetryExec.execute(RetryExec.java:89)
at org.apache.http.impl.execchain.RedirectExec.execute(RedirectExec.java:110)
at org.apache.http.impl.client.InternalHttpClient.doExecute(InternalHttpClient.java:185)
at org.apache.http.impl.client.CloseableHttpClient.execute(CloseableHttpClient.java:83)
at org.apache.http.impl.client.CloseableHttpClient.execute(CloseableHttpClient.java:56)
at org.apache.solr.client.solrj.impl.HttpSolrClient.executeMethod(HttpSolrClient.java:594)
at org.apache.solr.client.solrj.impl.HttpSolrClient.request(HttpSolrClient.java:257)
at org.apache.solr.client.solrj.impl.HttpSolrClient.request(HttpSolrClient.java:236)
at org.apache.solr.client.solrj.SolrRequest.process(SolrRequest.java:229)
at org.apache.solr.client.solrj.SolrClient.add(SolrClient.java:166)
at org.apache.solr.client.solrj.SolrClient.add(SolrClient.java:131)
at org.apache.solr.client.solrj.SolrClient.add(SolrClient.java:147)
at org.apache.solr.hdfs.cloud.StressHdfsTest.createAndDeleteCollection(StressHdfsTest.java:198)
at org.apache.solr.hdfs.cloud.StressHdfsTest.test(StressHdfsTest.java:112)
at java.base/jdk.internal.reflect.NativeMethodAccessorImpl.invoke0(Native Method)
at java.base/jdk.internal.reflect.NativeMethodAccessorImpl.invoke(NativeMethodAccessorImpl.java:62)
at java.base/jdk.internal.reflect.DelegatingMethodAccessorImpl.invoke(DelegatingMethodAccessorImpl.java:43)
at java.base/java.lang.reflect.Method.invoke(Method.java:566)
at com.carrotsearch.randomizedtesting.RandomizedRunner.invoke(RandomizedRunner.java:1758)
at com.carrotsearch.randomizedtesting.RandomizedRunner$8.evaluate(RandomizedRunner.java:946)
at com.carrotsearch.randomizedtesting.RandomizedRunner$9.evaluate(RandomizedRunner.java:982)
at com.carrotsearch.randomizedtesting.RandomizedRunner$10.evaluate(RandomizedRunner.java:996)
at org.apache.solr.BaseDistributedSearchTestCase$ShardsRepeatRule$ShardsFixedStatement.callStatement(BaseDistributedSearchTestCase.java:1069)
at org.apache.solr.BaseDistributedSearchTestCase$ShardsRepeatRule$ShardsStatement.evaluate(BaseDistributedSearchTestCase.java:1040)
at com.carrotsearch.randomizedtesting.rules.SystemPropertiesRestoreRule$1.evaluate(SystemPropertiesRestoreRule.java:80)
at org.junit.rules.RunRules.evaluate(RunRules.java:20)
at org.apache.lucene.tests.util.TestRuleSetupTeardownChained$1.evaluate(TestRuleSetupTeardownChained.java:48)
at org.apache.lucene.tests.util.AbstractBeforeAfterRule$1.evaluate(AbstractBeforeAfterRule.java:43)
at org.apache.lucene.tests.util.TestRuleThreadAndTestName$1.evaluate(TestRuleThreadAndTestName.java:45)
at org.apache.lucene.tests.util.TestRuleIgnoreAfterMaxFailures$1.evaluate(TestRuleIgnoreAfterMaxFailures.java:60)
at org.apache.lucene.tests.util.TestRuleMarkFailure$1.evaluate(TestRuleMarkFailure.java:44)
at org.junit.rules.RunRules.evaluate(RunRules.java:20)
at com.carrotsearch.randomizedtesting.rules.StatementAdapter.evaluate(StatementAdapter.java:36)
at com.carrotsearch.randomizedtesting.ThreadLeakControl$StatementRunner.run(ThreadLeakControl.java:390)
at com.carrotsearch.randomizedtesting.ThreadLeakControl.forkTimeoutingTask(ThreadLeakControl.java:843)
at com.carrotsearch.randomizedtesting.ThreadLeakControl$3.evaluate(ThreadLeakControl.java:490)
at com.carrotsearch.randomizedtesting.RandomizedRunner.runSingleTest(RandomizedRunner.java:955)
at com.carrotsearch.randomizedtesting.RandomizedRunner$5.evaluate(RandomizedRunner.java:840)
at com.carrotsearch.randomizedtesting.RandomizedRunner$6.evaluate(RandomizedRunner.java:891)
at com.carrotsearch.randomizedtesting.RandomizedRunner$7.evaluate(RandomizedRunner.java:902)
at com.carrotsearch.randomizedtesting.rules.StatementAdapter.evaluate(StatementAdapter.java:36)
at com.carrotsearch.randomizedtesting.rules.StatementAdapter.evaluate(StatementAdapter.java:36)
at org.apache.lucene.tests.util.AbstractBeforeAfterRule$1.evaluate(AbstractBeforeAfterRule.java:43)
at com.carrotsearch.randomizedtesting.rules.SystemPropertiesRestoreRule$1.evaluate(SystemPropertiesRestoreRule.java:80)
at org.junit.rules.RunRules.evaluate(RunRules.java:20)
at org.apache.lucene.tests.util.AbstractBeforeAfterRule$1.evaluate(AbstractBeforeAfterRule.java:43)
at com.carrotsearch.randomizedtesting.rules.StatementAdapter.evaluate(StatementAdapter.java:36)
at org.apache.lucene.tests.util.TestRuleStoreClassName$1.evaluate(TestRuleStoreClassName.java:38)
at com.carrotsearch.randomizedtesting.rules.NoShadowingOrOverridesOnMethodsRule$1.evaluate(NoShadowingOrOverridesOnMethodsRule.java:40)
at com.carrotsearch.randomizedtesting.rules.NoShadowingOrOverridesOnMethodsRule$1.evaluate(NoShadowingOrOverridesOnMethodsRule.java:40)
at com.carrotsearch.randomizedtesting.rules.StatementAdapter.evaluate(StatementAdapter.java:36)
at com.carrotsearch.randomizedtesting.rules.StatementAdapter.evaluate(StatementAdapter.java:36)
at org.apache.lucene.tests.util.TestRuleAssertionsRequired$1.evaluate(TestRuleAssertionsRequired.java:53)
at org.apache.lucene.tests.util.AbstractBeforeAfterRule$1.evaluate(AbstractBeforeAfterRule.java:43)
at org.apache.lucene.tests.util.TestRuleMarkFailure$1.evaluate(TestRuleMarkFailure.java:44)
at org.apache.lucene.tests.util.TestRuleIgnoreAfterMaxFailures$1.evaluate(TestRuleIgnoreAfterMaxFailures.java:60)
at org.apache.lucene.tests.util.TestRuleIgnoreTestSuites$1.evaluate(TestRuleIgnoreTestSuites.java:47)
at org.junit.rules.RunRules.evaluate(RunRules.java:20)
at com.carrotsearch.randomizedtesting.rules.StatementAdapter.evaluate(StatementAdapter.java:36)
at com.carrotsearch.randomizedtesting.ThreadLeakControl$StatementRunner.run(ThreadLeakControl.java:390)
at com.carrotsearch.randomizedtesting.ThreadLeakControl.lambda$forkTimeoutingTask$0(ThreadLeakControl.java:850)
at java.base/java.lang.Thread.run(Thread.java:829)
Build Log:
[...truncated 66552 lines...]
ERROR: The following test(s) have failed:
- org.apache.solr.hdfs.cloud.StressHdfsTest.test (:solr:modules:hdfs)
Test output: /home/jenkins/jenkins-slave/workspace/Solr/Solr-NightlyTests-main/solr/modules/hdfs/build/test-results/test/outputs/OUTPUT-org.apache.solr.hdfs.cloud.StressHdfsTest.txt
Reproduce with: gradlew :solr:modules:hdfs:test --tests "org.apache.solr.hdfs.cloud.StressHdfsTest.test" -Ptests.jvms=4 -Ptests.haltonfailure=false "-Ptests.jvmargs=-XX:TieredStopAtLevel=1 -XX:+UseParallelGC -XX:ActiveProcessorCount=1 -XX:ReservedCodeCacheSize=120m" -Ptests.seed=221BB1D8D3478873 -Ptests.multiplier=2 -Ptests.nightly=true -Ptests.badapples=false -Ptests.file.encoding=UTF-8 -Ptests.linedocsfile=/home/jenkins/jenkins-slave/workspace/Solr/Solr-NightlyTests-main/test-data/enwiki.random.lines.txt
- org.apache.solr.cloud.api.collections.ShardSplitTest.testSplitStaticIndexReplicationLink (:solr:core)
Test output: /home/jenkins/jenkins-slave/workspace/Solr/Solr-NightlyTests-main/solr/core/build/test-results/test/outputs/OUTPUT-org.apache.solr.cloud.api.collections.ShardSplitTest.txt
Reproduce with: gradlew :solr:core:test --tests "org.apache.solr.cloud.api.collections.ShardSplitTest.testSplitStaticIndexReplicationLink" -Ptests.jvms=4 -Ptests.haltonfailure=false "-Ptests.jvmargs=-XX:TieredStopAtLevel=1 -XX:+UseParallelGC -XX:ActiveProcessorCount=1 -XX:ReservedCodeCacheSize=120m" -Ptests.seed=221BB1D8D3478873 -Ptests.multiplier=2 -Ptests.nightly=true -Ptests.badapples=false -Ptests.file.encoding=UTF-8 -Ptests.linedocsfile=/home/jenkins/jenkins-slave/workspace/Solr/Solr-NightlyTests-main/test-data/enwiki.random.lines.txt
- org.apache.solr.cloud.api.collections.ShardSplitTest.testSplitLocking (:solr:core)
Test output: /home/jenkins/jenkins-slave/workspace/Solr/Solr-NightlyTests-main/solr/core/build/test-results/test/outputs/OUTPUT-org.apache.solr.cloud.api.collections.ShardSplitTest.txt
Reproduce with: gradlew :solr:core:test --tests "org.apache.solr.cloud.api.collections.ShardSplitTest.testSplitLocking" -Ptests.jvms=4 -Ptests.haltonfailure=false "-Ptests.jvmargs=-XX:TieredStopAtLevel=1 -XX:+UseParallelGC -XX:ActiveProcessorCount=1 -XX:ReservedCodeCacheSize=120m" -Ptests.seed=221BB1D8D3478873 -Ptests.multiplier=2 -Ptests.nightly=true -Ptests.badapples=false -Ptests.file.encoding=UTF-8 -Ptests.linedocsfile=/home/jenkins/jenkins-slave/workspace/Solr/Solr-NightlyTests-main/test-data/enwiki.random.lines.txt
- org.apache.solr.cloud.api.collections.ShardSplitTest.testSplitMixedReplicaTypes (:solr:core)
Test output: /home/jenkins/jenkins-slave/workspace/Solr/Solr-NightlyTests-main/solr/core/build/test-results/test/outputs/OUTPUT-org.apache.solr.cloud.api.collections.ShardSplitTest.txt
Reproduce with: gradlew :solr:core:test --tests "org.apache.solr.cloud.api.collections.ShardSplitTest.testSplitMixedReplicaTypes" -Ptests.jvms=4 -Ptests.haltonfailure=false "-Ptests.jvmargs=-XX:TieredStopAtLevel=1 -XX:+UseParallelGC -XX:ActiveProcessorCount=1 -XX:ReservedCodeCacheSize=120m" -Ptests.seed=221BB1D8D3478873 -Ptests.multiplier=2 -Ptests.nightly=true -Ptests.badapples=false -Ptests.file.encoding=UTF-8 -Ptests.linedocsfile=/home/jenkins/jenkins-slave/workspace/Solr/Solr-NightlyTests-main/test-data/enwiki.random.lines.txt
- org.apache.solr.cloud.api.collections.ShardSplitTest.test (:solr:core)
Test output: /home/jenkins/jenkins-slave/workspace/Solr/Solr-NightlyTests-main/solr/core/build/test-results/test/outputs/OUTPUT-org.apache.solr.cloud.api.collections.ShardSplitTest.txt
Reproduce with: gradlew :solr:core:test --tests "org.apache.solr.cloud.api.collections.ShardSplitTest.test" -Ptests.jvms=4 -Ptests.haltonfailure=false "-Ptests.jvmargs=-XX:TieredStopAtLevel=1 -XX:+UseParallelGC -XX:ActiveProcessorCount=1 -XX:ReservedCodeCacheSize=120m" -Ptests.seed=221BB1D8D3478873 -Ptests.multiplier=2 -Ptests.nightly=true -Ptests.badapples=false -Ptests.file.encoding=UTF-8 -Ptests.linedocsfile=/home/jenkins/jenkins-slave/workspace/Solr/Solr-NightlyTests-main/test-data/enwiki.random.lines.txt
- org.apache.solr.cloud.api.collections.ShardSplitTest.testSplitStaticIndexReplication (:solr:core)
Test output: /home/jenkins/jenkins-slave/workspace/Solr/Solr-NightlyTests-main/solr/core/build/test-results/test/outputs/OUTPUT-org.apache.solr.cloud.api.collections.ShardSplitTest.txt
Reproduce with: gradlew :solr:core:test --tests "org.apache.solr.cloud.api.collections.ShardSplitTest.testSplitStaticIndexReplication" -Ptests.jvms=4 -Ptests.haltonfailure=false "-Ptests.jvmargs=-XX:TieredStopAtLevel=1 -XX:+UseParallelGC -XX:ActiveProcessorCount=1 -XX:ReservedCodeCacheSize=120m" -Ptests.seed=221BB1D8D3478873 -Ptests.multiplier=2 -Ptests.nightly=true -Ptests.badapples=false -Ptests.file.encoding=UTF-8 -Ptests.linedocsfile=/home/jenkins/jenkins-slave/workspace/Solr/Solr-NightlyTests-main/test-data/enwiki.random.lines.txt
- org.apache.solr.cloud.api.collections.ShardSplitTest.testSplitMixedReplicaTypesLink (:solr:core)
Test output: /home/jenkins/jenkins-slave/workspace/Solr/Solr-NightlyTests-main/solr/core/build/test-results/test/outputs/OUTPUT-org.apache.solr.cloud.api.collections.ShardSplitTest.txt
Reproduce with: gradlew :solr:core:test --tests "org.apache.solr.cloud.api.collections.ShardSplitTest.testSplitMixedReplicaTypesLink" -Ptests.jvms=4 -Ptests.haltonfailure=false "-Ptests.jvmargs=-XX:TieredStopAtLevel=1 -XX:+UseParallelGC -XX:ActiveProcessorCount=1 -XX:ReservedCodeCacheSize=120m" -Ptests.seed=221BB1D8D3478873 -Ptests.multiplier=2 -Ptests.nightly=true -Ptests.badapples=false -Ptests.file.encoding=UTF-8 -Ptests.linedocsfile=/home/jenkins/jenkins-slave/workspace/Solr/Solr-NightlyTests-main/test-data/enwiki.random.lines.txt
Deprecated Gradle features were used in this build, making it incompatible with Gradle 9.0.
You can use '--warning-mode all' to show the individual deprecation warnings and determine if they come from your own scripts or plugins.
For more on this, please refer to https://docs.gradle.org/8.4/userguide/command_line_interface.html#sec:command_line_warnings in the Gradle documentation.
BUILD SUCCESSFUL in 1h 39m 15s
141 actionable tasks: 141 executed
Publishing build scan...
https://ge.apache.org/s/uw5fo7czbvph2
Build step 'Invoke Gradle script' changed build result to SUCCESS
Archiving artifacts
hudson.FilePath$ValidateAntFileMask$1Cancel
at hudson.FilePath$ValidateAntFileMask$1.isCaseSensitive(FilePath.java:3338)
at org.apache.tools.ant.DirectoryScanner.lambda$isIncluded$3(DirectoryScanner.java:1389)
at java.base/java.util.stream.MatchOps$1MatchSink.accept(MatchOps.java:90)
at java.base/java.util.Spliterators$ArraySpliterator.tryAdvance(Spliterators.java:958)
at java.base/java.util.stream.ReferencePipeline.forEachWithCancel(ReferencePipeline.java:127)
at java.base/java.util.stream.AbstractPipeline.copyIntoWithCancel(AbstractPipeline.java:502)
at java.base/java.util.stream.AbstractPipeline.copyInto(AbstractPipeline.java:488)
at java.base/java.util.stream.AbstractPipeline.wrapAndCopyInto(AbstractPipeline.java:474)
at java.base/java.util.stream.MatchOps$MatchOp.evaluateSequential(MatchOps.java:230)
at java.base/java.util.stream.MatchOps$MatchOp.evaluateSequential(MatchOps.java:196)
at java.base/java.util.stream.AbstractPipeline.evaluate(AbstractPipeline.java:234)
at java.base/java.util.stream.ReferencePipeline.anyMatch(ReferencePipeline.java:528)
at org.apache.tools.ant.DirectoryScanner.isIncluded(DirectoryScanner.java:1389)
at org.apache.tools.ant.DirectoryScanner.scandir(DirectoryScanner.java:1256)
at org.apache.tools.ant.DirectoryScanner.scandir(DirectoryScanner.java:1282)
at org.apache.tools.ant.DirectoryScanner.scandir(DirectoryScanner.java:1282)
at org.apache.tools.ant.DirectoryScanner.scandir(DirectoryScanner.java:1282)
at org.apache.tools.ant.DirectoryScanner.scandir(DirectoryScanner.java:1282)
at org.apache.tools.ant.DirectoryScanner.scandir(DirectoryScanner.java:1282)
at org.apache.tools.ant.DirectoryScanner.scandir(DirectoryScanner.java:1282)
at org.apache.tools.ant.DirectoryScanner.scandir(DirectoryScanner.java:1282)
at org.apache.tools.ant.DirectoryScanner.scandir(DirectoryScanner.java:1282)
at org.apache.tools.ant.DirectoryScanner.scandir(DirectoryScanner.java:1282)
at org.apache.tools.ant.DirectoryScanner.scandir(DirectoryScanner.java:1282)
at org.apache.tools.ant.DirectoryScanner.scandir(DirectoryScanner.java:1198)
at org.apache.tools.ant.DirectoryScanner.scandir(DirectoryScanner.java:1160)
at org.apache.tools.ant.DirectoryScanner.checkIncludePatterns(DirectoryScanner.java:954)
at org.apache.tools.ant.DirectoryScanner.scan(DirectoryScanner.java:912)
at hudson.FilePath$ValidateAntFileMask.hasMatch(FilePath.java:3351)
Caused: hudson.FilePath$FileMaskNoMatchesFoundException: no matches found within 60000
at hudson.FilePath$ValidateAntFileMask.hasMatch(FilePath.java:3356)
at hudson.FilePath$ValidateAntFileMask.invoke(FilePath.java:3234)
at hudson.FilePath$ValidateAntFileMask.invoke(FilePath.java:3212)
at hudson.FilePath$FileCallableWrapper.call(FilePath.java:3616)
Also: hudson.remoting.Channel$CallSiteStackTrace: Remote call to lucene-solr-1
at hudson.remoting.Channel.attachCallSiteStackTrace(Channel.java:1787)
at hudson.remoting.UserRequest$ExceptionResponse.retrieve(UserRequest.java:356)
at hudson.remoting.Channel.call(Channel.java:1003)
at hudson.FilePath.act(FilePath.java:1230)
at hudson.FilePath.act(FilePath.java:1219)
at hudson.FilePath.validateAntFileMask(FilePath.java:3209)
at hudson.tasks.ArtifactArchiver.perform(ArtifactArchiver.java:271)
at hudson.tasks.BuildStepCompatibilityLayer.perform(BuildStepCompatibilityLayer.java:80)
at hudson.tasks.BuildStepMonitor$1.perform(BuildStepMonitor.java:20)
at hudson.model.AbstractBuild$AbstractBuildExecution.perform(AbstractBuild.java:818)
at hudson.model.AbstractBuild$AbstractBuildExecution.performAllBuildSteps(AbstractBuild.java:767)
at hudson.model.Build$BuildExecution.post2(Build.java:179)
at hudson.model.AbstractBuild$AbstractBuildExecution.post(AbstractBuild.java:711)
at hudson.model.Run.execute(Run.java:1864)
at hudson.model.FreeStyleBuild.run(FreeStyleBuild.java:44)
at hudson.model.ResourceController.execute(ResourceController.java:101)
at hudson.model.Executor.run(Executor.java:442)
Caused: hudson.FilePath$TunneledInterruptedException
at hudson.FilePath$FileCallableWrapper.call(FilePath.java:3618)
at hudson.remoting.UserRequest.perform(UserRequest.java:211)
at hudson.remoting.UserRequest.perform(UserRequest.java:54)
at hudson.remoting.Request$2.run(Request.java:377)
at hudson.remoting.InterceptingExecutorService.lambda$wrap$0(InterceptingExecutorService.java:78)
at java.base/java.util.concurrent.FutureTask.run(FutureTask.java:264)
at java.base/java.util.concurrent.ThreadPoolExecutor.runWorker(ThreadPoolExecutor.java:1128)
at java.base/java.util.concurrent.ThreadPoolExecutor$Worker.run(ThreadPoolExecutor.java:628)
at java.base/java.lang.Thread.run(Thread.java:829)
Caused: java.lang.InterruptedException: hudson.FilePath$FileMaskNoMatchesFoundException: no matches found within 60000
at hudson.FilePath.act(FilePath.java:1232)
at hudson.FilePath.act(FilePath.java:1219)
at hudson.FilePath.validateAntFileMask(FilePath.java:3209)
at hudson.tasks.ArtifactArchiver.perform(ArtifactArchiver.java:271)
at hudson.tasks.BuildStepCompatibilityLayer.perform(BuildStepCompatibilityLayer.java:80)
at hudson.tasks.BuildStepMonitor$1.perform(BuildStepMonitor.java:20)
at hudson.model.AbstractBuild$AbstractBuildExecution.perform(AbstractBuild.java:818)
at hudson.model.AbstractBuild$AbstractBuildExecution.performAllBuildSteps(AbstractBuild.java:767)
at hudson.model.Build$BuildExecution.post2(Build.java:179)
at hudson.model.AbstractBuild$AbstractBuildExecution.post(AbstractBuild.java:711)
at hudson.model.Run.execute(Run.java:1864)
at hudson.model.FreeStyleBuild.run(FreeStyleBuild.java:44)
at hudson.model.ResourceController.execute(ResourceController.java:101)
at hudson.model.Executor.run(Executor.java:442)
No artifacts found that match the file pattern "**/*.events,heapdumps/**,**/hs_err_pid*". Configuration error?
Recording test results
[Checks API] No suitable checks publisher found.
Build step 'Publish JUnit test result report' changed build result to UNSTABLE
Email was triggered for: Unstable (Test Failures)
Sending email for trigger: Unstable (Test Failures)