You are viewing a plain text version of this content. The canonical link for it is here.
Posted to dev@hive.apache.org by Murli Varadachari <mv...@facebook.com> on 2009/03/25 01:31:17 UTC
JIRA_hive-132.3.patch_UNIT_TEST_FAILED
ERROR: UNIT TEST using PATCH hive-132.3.patch FAILED!!
[junit] Test org.apache.hadoop.hive.cli.TestCliDriver FAILED
BUILD FAILED