You are viewing a plain text version of this content. The canonical link for it is here.
Posted to commits@flex.apache.org by Apache Jenkins Server <je...@builds.apache.org> on 2013/09/19 13:36:34 UTC
Build failed in Jenkins: flex-falcon #133
See <https://builds.apache.org/job/flex-falcon/133/changes>
Changes:
[aharui] MXMLC says -is is a valid alias for -include-sources
[aharui] Also add flash.events.Event as import for [Bindable] classes. Looks like MXMLC used to do that
[aharui] [Bindable] class with toString needs to have it converted to be an override
[aharui] revert auto-importing flash.events.Event. It isn't always needed so we shouldn't always add it
[aharui] move creation of CompilerProblem so it is only created when needed
[aharui] Output an Ambiguous error if type is ambiguous. In one case, an identifier was imported from another package but also existed in the package.
[aharui] Missing resource bundle is now a warning
------------------------------------------
[...truncated 3473 lines...]
[junit] f:\hudson\hudson-slave\workspace\flex-sdk\frameworks\projects\spark\compile-config.xml:30
[junit] Error: unable to open 'f:\hudson\hudson-slave\workspace\flex-sdk\frameworks\libs\framework.swc'.
[junit] f:\hudson\hudson-slave\workspace\flex-sdk\frameworks\projects\spark\compile-config.xml (line: 30)
[junit] </external-library-path>
[junit]
[junit]
[junit] f:\hudson\hudson-slave\workspace\flex-sdk\frameworks\projects\spark\compile-config.xml:30
[junit] Error: unable to open 'f:\hudson\hudson-slave\workspace\flex-sdk\frameworks\libs\mx\mx.swc'.
[junit] f:\hudson\hudson-slave\workspace\flex-sdk\frameworks\projects\spark\compile-config.xml (line: 30)
[junit] </external-library-path>
[junit]
[junit]
[junit] f:\hudson\hudson-slave\workspace\flex-sdk\frameworks\projects\spark\compile-config.xml:30
[junit] Error: unable to open 'f:\hudson\hudson-slave\workspace\flex-sdk\frameworks\libs\osmf.swc'.
[junit] f:\hudson\hudson-slave\workspace\flex-sdk\frameworks\projects\spark\compile-config.xml (line: 30)
[junit] </external-library-path>
[junit]
[junit]
[junit] f:\hudson\hudson-slave\workspace\flex-sdk\frameworks\projects\spark\compile-config.xml:30
[junit] Error: unable to open 'f:\hudson\hudson-slave\workspace\flex-sdk\frameworks\libs\textLayout.swc'.
[junit] f:\hudson\hudson-slave\workspace\flex-sdk\frameworks\projects\spark\compile-config.xml (line: 30)
[junit] </external-library-path>
[junit]
[junit]
[junit] f:\hudson\hudson-slave\workspace\flex-sdk\frameworks\projects\spark\compile-config.xml:48
[junit] Error: unable to open 'f:\hudson\hudson-slave\workspace\flex-sdk\frameworks\projects\spark\manifest.xml'.
[junit] f:\hudson\hudson-slave\workspace\flex-sdk\frameworks\projects\spark\compile-config.xml (line: 48)
[junit] </namespace>
[junit]
[junit]
[junit] Loading configuration: f:\hudson\hudson-slave\workspace\flex-tlf\compile-config.xml
[junit]
[junit] <https://builds.apache.org/job/flex-falcon/ws/compiler.tests\defaults>
[junit] Error: unable to open 'f:\hudson\hudson-slave\workspace\flex-sdk\frameworks\flex-config.xml'.
[junit] defaults (line: -1)
[junit]
[junit] Loading configuration: f:\hudson\hudson-slave\workspace\flex-sdk\frameworks\projects\tool_air\compile-config.xml
[junit]
[junit] <https://builds.apache.org/job/flex-falcon/ws/compiler.tests\defaults>
[junit] Error: unable to open 'f:\hudson\hudson-slave\workspace\flex-sdk\frameworks\flex-config.xml'.
[junit] defaults (line: -1)
[junit]
[junit] f:\hudson\hudson-slave\workspace\flex-sdk\frameworks\projects\tool_air\compile-config.xml:34
[junit] Error: unable to open 'f:\hudson\hudson-slave\workspace\flex-sdk\frameworks\libs\framework.swc'.
[junit] f:\hudson\hudson-slave\workspace\flex-sdk\frameworks\projects\tool_air\compile-config.xml (line: 34)
[junit] </external-library-path>
[junit]
[junit]
[junit] f:\hudson\hudson-slave\workspace\flex-sdk\frameworks\projects\tool_air\compile-config.xml:34
[junit] Error: unable to open 'f:\hudson\hudson-slave\workspace\flex-sdk\frameworks\libs\mx\mx.swc'.
[junit] f:\hudson\hudson-slave\workspace\flex-sdk\frameworks\projects\tool_air\compile-config.xml (line: 34)
[junit] </external-library-path>
[junit]
[junit]
[junit] f:\hudson\hudson-slave\workspace\flex-sdk\frameworks\projects\tool_air\compile-config.xml:34
[junit] Error: unable to open 'f:\hudson\hudson-slave\workspace\flex-sdk\frameworks\libs\textLayout.swc'.
[junit] f:\hudson\hudson-slave\workspace\flex-sdk\frameworks\projects\tool_air\compile-config.xml (line: 34)
[junit] </external-library-path>
[junit]
[junit]
[junit] f:\hudson\hudson-slave\workspace\flex-sdk\frameworks\projects\tool_air\compile-config.xml:34
[junit] Error: unable to open 'f:\hudson\hudson-slave\workspace\flex-sdk\frameworks\libs\advancedgrids.swc'.
[junit] f:\hudson\hudson-slave\workspace\flex-sdk\frameworks\projects\tool_air\compile-config.xml (line: 34)
[junit] </external-library-path>
[junit]
[junit]
[junit] f:\hudson\hudson-slave\workspace\flex-sdk\frameworks\projects\tool_air\compile-config.xml:34
[junit] Error: unable to open 'f:\hudson\hudson-slave\workspace\flex-sdk\frameworks\libs\charts.swc'.
[junit] f:\hudson\hudson-slave\workspace\flex-sdk\frameworks\projects\tool_air\compile-config.xml (line: 34)
[junit] </external-library-path>
[junit]
[junit]
[junit] f:\hudson\hudson-slave\workspace\flex-sdk\frameworks\projects\tool_air\compile-config.xml:34
[junit] Error: unable to open 'f:\hudson\hudson-slave\workspace\flex-sdk\frameworks\libs\spark.swc'.
[junit] f:\hudson\hudson-slave\workspace\flex-sdk\frameworks\projects\tool_air\compile-config.xml (line: 34)
[junit] </external-library-path>
[junit]
[junit]
[junit] f:\hudson\hudson-slave\workspace\flex-sdk\frameworks\projects\tool_air\compile-config.xml:34
[junit] Error: unable to open 'f:\hudson\hudson-slave\workspace\flex-sdk\frameworks\libs\automation\automation_agent.swc'.
[junit] f:\hudson\hudson-slave\workspace\flex-sdk\frameworks\projects\tool_air\compile-config.xml (line: 34)
[junit] </external-library-path>
[junit]
[junit]
[junit] f:\hudson\hudson-slave\workspace\flex-sdk\frameworks\projects\tool_air\compile-config.xml:34
[junit] Error: unable to open 'f:\hudson\hudson-slave\workspace\flex-sdk\frameworks\libs\automation\automation_dmv.swc'.
[junit] f:\hudson\hudson-slave\workspace\flex-sdk\frameworks\projects\tool_air\compile-config.xml (line: 34)
[junit] </external-library-path>
[junit]
[junit]
[junit] Loading configuration: f:\hudson\hudson-slave\workspace\flex-sdk\frameworks\projects\tool\compile-config.xml
[junit]
[junit] <https://builds.apache.org/job/flex-falcon/ws/compiler.tests\defaults>
[junit] Error: unable to open 'f:\hudson\hudson-slave\workspace\flex-sdk\frameworks\flex-config.xml'.
[junit] defaults (line: -1)
[junit]
[junit] f:\hudson\hudson-slave\workspace\flex-sdk\frameworks\projects\tool\compile-config.xml:34
[junit] Error: unable to open 'f:\hudson\hudson-slave\workspace\flex-sdk\frameworks\libs\framework.swc'.
[junit] f:\hudson\hudson-slave\workspace\flex-sdk\frameworks\projects\tool\compile-config.xml (line: 34)
[junit] </external-library-path>
[junit]
[junit]
[junit] f:\hudson\hudson-slave\workspace\flex-sdk\frameworks\projects\tool\compile-config.xml:34
[junit] Error: unable to open 'f:\hudson\hudson-slave\workspace\flex-sdk\frameworks\libs\mx\mx.swc'.
[junit] f:\hudson\hudson-slave\workspace\flex-sdk\frameworks\projects\tool\compile-config.xml (line: 34)
[junit] </external-library-path>
[junit]
[junit]
[junit] f:\hudson\hudson-slave\workspace\flex-sdk\frameworks\projects\tool\compile-config.xml:34
[junit] Error: unable to open 'f:\hudson\hudson-slave\workspace\flex-sdk\frameworks\libs\textLayout.swc'.
[junit] f:\hudson\hudson-slave\workspace\flex-sdk\frameworks\projects\tool\compile-config.xml (line: 34)
[junit] </external-library-path>
[junit]
[junit]
[junit] f:\hudson\hudson-slave\workspace\flex-sdk\frameworks\projects\tool\compile-config.xml:34
[junit] Error: unable to open 'f:\hudson\hudson-slave\workspace\flex-sdk\frameworks\libs\advancedgrids.swc'.
[junit] f:\hudson\hudson-slave\workspace\flex-sdk\frameworks\projects\tool\compile-config.xml (line: 34)
[junit] </external-library-path>
[junit]
[junit]
[junit] f:\hudson\hudson-slave\workspace\flex-sdk\frameworks\projects\tool\compile-config.xml:34
[junit] Error: unable to open 'f:\hudson\hudson-slave\workspace\flex-sdk\frameworks\libs\charts.swc'.
[junit] f:\hudson\hudson-slave\workspace\flex-sdk\frameworks\projects\tool\compile-config.xml (line: 34)
[junit] </external-library-path>
[junit]
[junit]
[junit] f:\hudson\hudson-slave\workspace\flex-sdk\frameworks\projects\tool\compile-config.xml:34
[junit] Error: unable to open 'f:\hudson\hudson-slave\workspace\flex-sdk\frameworks\libs\spark.swc'.
[junit] f:\hudson\hudson-slave\workspace\flex-sdk\frameworks\projects\tool\compile-config.xml (line: 34)
[junit] </external-library-path>
[junit]
[junit]
[junit] f:\hudson\hudson-slave\workspace\flex-sdk\frameworks\projects\tool\compile-config.xml:34
[junit] Error: unable to open 'f:\hudson\hudson-slave\workspace\flex-sdk\frameworks\libs\automation\automation_agent.swc'.
[junit] f:\hudson\hudson-slave\workspace\flex-sdk\frameworks\projects\tool\compile-config.xml (line: 34)
[junit] </external-library-path>
[junit]
[junit]
[junit] f:\hudson\hudson-slave\workspace\flex-sdk\frameworks\projects\tool\compile-config.xml:34
[junit] Error: unable to open 'f:\hudson\hudson-slave\workspace\flex-sdk\frameworks\libs\automation\automation_dmv.swc'.
[junit] f:\hudson\hudson-slave\workspace\flex-sdk\frameworks\projects\tool\compile-config.xml (line: 34)
[junit] </external-library-path>
[junit]
[junit]
[junit] Loading configuration: f:\hudson\hudson-slave\workspace\flex-sdk\frameworks\projects\wireframe\compile-config.xml
[junit]
[junit] <https://builds.apache.org/job/flex-falcon/ws/compiler.tests\defaults>
[junit] Error: unable to open 'f:\hudson\hudson-slave\workspace\flex-sdk\frameworks\flex-config.xml'.
[junit] defaults (line: -1)
[junit]
[junit] f:\hudson\hudson-slave\workspace\flex-sdk\frameworks\projects\wireframe\compile-config.xml:33
[junit] Error: unable to open 'f:\hudson\hudson-slave\workspace\flex-sdk\frameworks\libs\framework.swc'.
[junit] f:\hudson\hudson-slave\workspace\flex-sdk\frameworks\projects\wireframe\compile-config.xml (line: 33)
[junit] </external-library-path>
[junit]
[junit]
[junit] f:\hudson\hudson-slave\workspace\flex-sdk\frameworks\projects\wireframe\compile-config.xml:33
[junit] Error: unable to open 'f:\hudson\hudson-slave\workspace\flex-sdk\frameworks\libs\mx\mx.swc'.
[junit] f:\hudson\hudson-slave\workspace\flex-sdk\frameworks\projects\wireframe\compile-config.xml (line: 33)
[junit] </external-library-path>
[junit]
[junit]
[junit] f:\hudson\hudson-slave\workspace\flex-sdk\frameworks\projects\wireframe\compile-config.xml:33
[junit] Error: unable to open 'f:\hudson\hudson-slave\workspace\flex-sdk\frameworks\libs\osmf.swc'.
[junit] f:\hudson\hudson-slave\workspace\flex-sdk\frameworks\projects\wireframe\compile-config.xml (line: 33)
[junit] </external-library-path>
[junit]
[junit]
[junit] f:\hudson\hudson-slave\workspace\flex-sdk\frameworks\projects\wireframe\compile-config.xml:33
[junit] Error: unable to open 'f:\hudson\hudson-slave\workspace\flex-sdk\frameworks\libs\spark.swc'.
[junit] f:\hudson\hudson-slave\workspace\flex-sdk\frameworks\projects\wireframe\compile-config.xml (line: 33)
[junit] </external-library-path>
[junit]
[junit]
[junit] f:\hudson\hudson-slave\workspace\flex-sdk\frameworks\projects\wireframe\compile-config.xml:33
[junit] Error: unable to open 'f:\hudson\hudson-slave\workspace\flex-sdk\frameworks\libs\air\airspark.swc'.
[junit] f:\hudson\hudson-slave\workspace\flex-sdk\frameworks\projects\wireframe\compile-config.xml (line: 33)
[junit] </external-library-path>
[junit]
[junit]
[junit] f:\hudson\hudson-slave\workspace\flex-sdk\frameworks\projects\wireframe\compile-config.xml:33
[junit] Error: unable to open 'f:\hudson\hudson-slave\workspace\flex-sdk\frameworks\libs\textLayout.swc'.
[junit] f:\hudson\hudson-slave\workspace\flex-sdk\frameworks\projects\wireframe\compile-config.xml (line: 33)
[junit] </external-library-path>
[junit]
[junit]
[junit] Tests run: 29, Failures: 29, Errors: 0, Time elapsed: 6.837 sec
[junit] Test f.SDKSWCTests FAILED
jar.tests:
[java] Apache ActionScript Compiler (mxmlc)
[java] Version 2.0.0 build 0
[java]
[java] mxmlc [options] [defaultVar]
[java] Use 'mxmlc -help' for more information.
[java]
[java]
[java] Java Result: 1
[java] Apache SWC Component Compiler (compc)
[java] Version 2.0.0 build 0
[java]
[java] compc [options] [defaultVar]
[java] Use 'compc -help' for more information.
[java]
[java]
[java] Java Result: 1
[java] ActionScript 3.0 Compiler for AVM+
[java] Version 2.0.0 build 0
[java]
[java] usage: asc [-abcfuture] [-api <version>] [-AS3] [-avmtarget <vm version
[java] number>] [-b] [-coach] [-config <ns::name=value>] [-d] [-doc]
[java] [-ES] [-ES4] [-exe <avmplus path>] [-f] [-h] [-i] [-import
[java] <filename>] [-in <filename>] [-inline] [-l] [-language <lang>]
[java] [-le <swc file>] [-li <swc file>] [-log] [-m] [-md] [-merge]
[java] [-movieclip] [-o] [-o2 <name=value>] [-optimize] [-out
[java] <basename>] [-outdir <output directory name>] [-p] [-parallel]
[java] [-removedeadcode] [-sanity] [-static] [-strict] [-swf
[java] <classname,width,height[,fps]>] [-use <namespace>] [-warnings]
[java] FILENAME...
[java] Java Result: 1
[java] Apache ActionScript Compiler (optimizer)
[java] Version 2.0.0 build 0
[java]
[java] optimizer [options] [defaultVar]
[java] Use 'optimizer -help' for more information.
[java]
[java]
[java] Java Result: 1
[java] Apache SWF Dump Utility
[java] Version 2.0.0 build 0
[java]
[java] Usage: swfdump [-abc] file1.swf
[java] Java Result: 1
ant.tests:
[mxmlc]
[mxmlc] <https://builds.apache.org/job/flex-falcon/ws/defaults>
[mxmlc] Error: unable to open 'f:\hudson\hudson-slave\workspace\flex-sdk\frameworks\flex-config.xml'.
[mxmlc] defaults (line: -1)
[mxmlc]
BUILD FAILED
<https://builds.apache.org/job/flex-falcon/ws/build.xml>:44: The following error occurred while executing this line:
<https://builds.apache.org/job/flex-falcon/ws/compiler.tests\build.xml>:63: mxmlc task failed
Total time: 8 minutes 37 seconds
Build step 'Invoke Ant' marked build as failure
Archiving artifacts
Recording test results
Build failed in Jenkins: flex-falcon #136
Posted by Apache Jenkins Server <je...@builds.apache.org>.
See <https://builds.apache.org/job/flex-falcon/136/>
------------------------------------------
[...truncated 1643 lines...]
[junit] f:\hudson\hudson-slave\workspace\flex-sdk\frameworks\projects\spark\compile-config.xml:30
[junit] Error: unable to open 'f:\hudson\hudson-slave\workspace\flex-sdk\frameworks\libs\framework.swc'.
[junit] f:\hudson\hudson-slave\workspace\flex-sdk\frameworks\projects\spark\compile-config.xml (line: 30)
[junit] </external-library-path>
[junit]
[junit]
[junit] f:\hudson\hudson-slave\workspace\flex-sdk\frameworks\projects\spark\compile-config.xml:30
[junit] Error: unable to open 'f:\hudson\hudson-slave\workspace\flex-sdk\frameworks\libs\mx\mx.swc'.
[junit] f:\hudson\hudson-slave\workspace\flex-sdk\frameworks\projects\spark\compile-config.xml (line: 30)
[junit] </external-library-path>
[junit]
[junit]
[junit] f:\hudson\hudson-slave\workspace\flex-sdk\frameworks\projects\spark\compile-config.xml:30
[junit] Error: unable to open 'f:\hudson\hudson-slave\workspace\flex-sdk\frameworks\libs\osmf.swc'.
[junit] f:\hudson\hudson-slave\workspace\flex-sdk\frameworks\projects\spark\compile-config.xml (line: 30)
[junit] </external-library-path>
[junit]
[junit]
[junit] f:\hudson\hudson-slave\workspace\flex-sdk\frameworks\projects\spark\compile-config.xml:30
[junit] Error: unable to open 'f:\hudson\hudson-slave\workspace\flex-sdk\frameworks\libs\textLayout.swc'.
[junit] f:\hudson\hudson-slave\workspace\flex-sdk\frameworks\projects\spark\compile-config.xml (line: 30)
[junit] </external-library-path>
[junit]
[junit]
[junit] f:\hudson\hudson-slave\workspace\flex-sdk\frameworks\projects\spark\compile-config.xml:48
[junit] Error: unable to open 'f:\hudson\hudson-slave\workspace\flex-sdk\frameworks\projects\spark\manifest.xml'.
[junit] f:\hudson\hudson-slave\workspace\flex-sdk\frameworks\projects\spark\compile-config.xml (line: 48)
[junit] </namespace>
[junit]
[junit]
[junit] Loading configuration: f:\hudson\hudson-slave\workspace\flex-tlf\compile-config.xml
[junit]
[junit] <https://builds.apache.org/job/flex-falcon/ws/compiler.tests\defaults>
[junit] Error: unable to open 'f:\hudson\hudson-slave\workspace\flex-sdk\frameworks\flex-config.xml'.
[junit] defaults (line: -1)
[junit]
[junit] Loading configuration: f:\hudson\hudson-slave\workspace\flex-sdk\frameworks\projects\tool_air\compile-config.xml
[junit]
[junit] <https://builds.apache.org/job/flex-falcon/ws/compiler.tests\defaults>
[junit] Error: unable to open 'f:\hudson\hudson-slave\workspace\flex-sdk\frameworks\flex-config.xml'.
[junit] defaults (line: -1)
[junit]
[junit] f:\hudson\hudson-slave\workspace\flex-sdk\frameworks\projects\tool_air\compile-config.xml:34
[junit] Error: unable to open 'f:\hudson\hudson-slave\workspace\flex-sdk\frameworks\libs\framework.swc'.
[junit] f:\hudson\hudson-slave\workspace\flex-sdk\frameworks\projects\tool_air\compile-config.xml (line: 34)
[junit] </external-library-path>
[junit]
[junit]
[junit] f:\hudson\hudson-slave\workspace\flex-sdk\frameworks\projects\tool_air\compile-config.xml:34
[junit] Error: unable to open 'f:\hudson\hudson-slave\workspace\flex-sdk\frameworks\libs\mx\mx.swc'.
[junit] f:\hudson\hudson-slave\workspace\flex-sdk\frameworks\projects\tool_air\compile-config.xml (line: 34)
[junit] </external-library-path>
[junit]
[junit]
[junit] f:\hudson\hudson-slave\workspace\flex-sdk\frameworks\projects\tool_air\compile-config.xml:34
[junit] Error: unable to open 'f:\hudson\hudson-slave\workspace\flex-sdk\frameworks\libs\textLayout.swc'.
[junit] f:\hudson\hudson-slave\workspace\flex-sdk\frameworks\projects\tool_air\compile-config.xml (line: 34)
[junit] </external-library-path>
[junit]
[junit]
[junit] f:\hudson\hudson-slave\workspace\flex-sdk\frameworks\projects\tool_air\compile-config.xml:34
[junit] Error: unable to open 'f:\hudson\hudson-slave\workspace\flex-sdk\frameworks\libs\advancedgrids.swc'.
[junit] f:\hudson\hudson-slave\workspace\flex-sdk\frameworks\projects\tool_air\compile-config.xml (line: 34)
[junit] </external-library-path>
[junit]
[junit]
[junit] f:\hudson\hudson-slave\workspace\flex-sdk\frameworks\projects\tool_air\compile-config.xml:34
[junit] Error: unable to open 'f:\hudson\hudson-slave\workspace\flex-sdk\frameworks\libs\charts.swc'.
[junit] f:\hudson\hudson-slave\workspace\flex-sdk\frameworks\projects\tool_air\compile-config.xml (line: 34)
[junit] </external-library-path>
[junit]
[junit]
[junit] f:\hudson\hudson-slave\workspace\flex-sdk\frameworks\projects\tool_air\compile-config.xml:34
[junit] Error: unable to open 'f:\hudson\hudson-slave\workspace\flex-sdk\frameworks\libs\spark.swc'.
[junit] f:\hudson\hudson-slave\workspace\flex-sdk\frameworks\projects\tool_air\compile-config.xml (line: 34)
[junit] </external-library-path>
[junit]
[junit]
[junit] f:\hudson\hudson-slave\workspace\flex-sdk\frameworks\projects\tool_air\compile-config.xml:34
[junit] Error: unable to open 'f:\hudson\hudson-slave\workspace\flex-sdk\frameworks\libs\automation\automation_agent.swc'.
[junit] f:\hudson\hudson-slave\workspace\flex-sdk\frameworks\projects\tool_air\compile-config.xml (line: 34)
[junit] </external-library-path>
[junit]
[junit]
[junit] f:\hudson\hudson-slave\workspace\flex-sdk\frameworks\projects\tool_air\compile-config.xml:34
[junit] Error: unable to open 'f:\hudson\hudson-slave\workspace\flex-sdk\frameworks\libs\automation\automation_dmv.swc'.
[junit] f:\hudson\hudson-slave\workspace\flex-sdk\frameworks\projects\tool_air\compile-config.xml (line: 34)
[junit] </external-library-path>
[junit]
[junit]
[junit] Loading configuration: f:\hudson\hudson-slave\workspace\flex-sdk\frameworks\projects\tool\compile-config.xml
[junit]
[junit] <https://builds.apache.org/job/flex-falcon/ws/compiler.tests\defaults>
[junit] Error: unable to open 'f:\hudson\hudson-slave\workspace\flex-sdk\frameworks\flex-config.xml'.
[junit] defaults (line: -1)
[junit]
[junit] f:\hudson\hudson-slave\workspace\flex-sdk\frameworks\projects\tool\compile-config.xml:34
[junit] Error: unable to open 'f:\hudson\hudson-slave\workspace\flex-sdk\frameworks\libs\framework.swc'.
[junit] f:\hudson\hudson-slave\workspace\flex-sdk\frameworks\projects\tool\compile-config.xml (line: 34)
[junit] </external-library-path>
[junit]
[junit]
[junit] f:\hudson\hudson-slave\workspace\flex-sdk\frameworks\projects\tool\compile-config.xml:34
[junit] Error: unable to open 'f:\hudson\hudson-slave\workspace\flex-sdk\frameworks\libs\mx\mx.swc'.
[junit] f:\hudson\hudson-slave\workspace\flex-sdk\frameworks\projects\tool\compile-config.xml (line: 34)
[junit] </external-library-path>
[junit]
[junit]
[junit] f:\hudson\hudson-slave\workspace\flex-sdk\frameworks\projects\tool\compile-config.xml:34
[junit] Error: unable to open 'f:\hudson\hudson-slave\workspace\flex-sdk\frameworks\libs\textLayout.swc'.
[junit] f:\hudson\hudson-slave\workspace\flex-sdk\frameworks\projects\tool\compile-config.xml (line: 34)
[junit] </external-library-path>
[junit]
[junit]
[junit] f:\hudson\hudson-slave\workspace\flex-sdk\frameworks\projects\tool\compile-config.xml:34
[junit] Error: unable to open 'f:\hudson\hudson-slave\workspace\flex-sdk\frameworks\libs\advancedgrids.swc'.
[junit] f:\hudson\hudson-slave\workspace\flex-sdk\frameworks\projects\tool\compile-config.xml (line: 34)
[junit] </external-library-path>
[junit]
[junit]
[junit] f:\hudson\hudson-slave\workspace\flex-sdk\frameworks\projects\tool\compile-config.xml:34
[junit] Error: unable to open 'f:\hudson\hudson-slave\workspace\flex-sdk\frameworks\libs\charts.swc'.
[junit] f:\hudson\hudson-slave\workspace\flex-sdk\frameworks\projects\tool\compile-config.xml (line: 34)
[junit] </external-library-path>
[junit]
[junit]
[junit] f:\hudson\hudson-slave\workspace\flex-sdk\frameworks\projects\tool\compile-config.xml:34
[junit] Error: unable to open 'f:\hudson\hudson-slave\workspace\flex-sdk\frameworks\libs\spark.swc'.
[junit] f:\hudson\hudson-slave\workspace\flex-sdk\frameworks\projects\tool\compile-config.xml (line: 34)
[junit] </external-library-path>
[junit]
[junit]
[junit] f:\hudson\hudson-slave\workspace\flex-sdk\frameworks\projects\tool\compile-config.xml:34
[junit] Error: unable to open 'f:\hudson\hudson-slave\workspace\flex-sdk\frameworks\libs\automation\automation_agent.swc'.
[junit] f:\hudson\hudson-slave\workspace\flex-sdk\frameworks\projects\tool\compile-config.xml (line: 34)
[junit] </external-library-path>
[junit]
[junit]
[junit] f:\hudson\hudson-slave\workspace\flex-sdk\frameworks\projects\tool\compile-config.xml:34
[junit] Error: unable to open 'f:\hudson\hudson-slave\workspace\flex-sdk\frameworks\libs\automation\automation_dmv.swc'.
[junit] f:\hudson\hudson-slave\workspace\flex-sdk\frameworks\projects\tool\compile-config.xml (line: 34)
[junit] </external-library-path>
[junit]
[junit]
[junit] Loading configuration: f:\hudson\hudson-slave\workspace\flex-sdk\frameworks\projects\wireframe\compile-config.xml
[junit]
[junit] <https://builds.apache.org/job/flex-falcon/ws/compiler.tests\defaults>
[junit] Error: unable to open 'f:\hudson\hudson-slave\workspace\flex-sdk\frameworks\flex-config.xml'.
[junit] defaults (line: -1)
[junit]
[junit] f:\hudson\hudson-slave\workspace\flex-sdk\frameworks\projects\wireframe\compile-config.xml:33
[junit] Error: unable to open 'f:\hudson\hudson-slave\workspace\flex-sdk\frameworks\libs\framework.swc'.
[junit] f:\hudson\hudson-slave\workspace\flex-sdk\frameworks\projects\wireframe\compile-config.xml (line: 33)
[junit] </external-library-path>
[junit]
[junit]
[junit] f:\hudson\hudson-slave\workspace\flex-sdk\frameworks\projects\wireframe\compile-config.xml:33
[junit] Error: unable to open 'f:\hudson\hudson-slave\workspace\flex-sdk\frameworks\libs\mx\mx.swc'.
[junit] f:\hudson\hudson-slave\workspace\flex-sdk\frameworks\projects\wireframe\compile-config.xml (line: 33)
[junit] </external-library-path>
[junit]
[junit]
[junit] f:\hudson\hudson-slave\workspace\flex-sdk\frameworks\projects\wireframe\compile-config.xml:33
[junit] Error: unable to open 'f:\hudson\hudson-slave\workspace\flex-sdk\frameworks\libs\osmf.swc'.
[junit] f:\hudson\hudson-slave\workspace\flex-sdk\frameworks\projects\wireframe\compile-config.xml (line: 33)
[junit] </external-library-path>
[junit]
[junit]
[junit] f:\hudson\hudson-slave\workspace\flex-sdk\frameworks\projects\wireframe\compile-config.xml:33
[junit] Error: unable to open 'f:\hudson\hudson-slave\workspace\flex-sdk\frameworks\libs\spark.swc'.
[junit] f:\hudson\hudson-slave\workspace\flex-sdk\frameworks\projects\wireframe\compile-config.xml (line: 33)
[junit] </external-library-path>
[junit]
[junit]
[junit] f:\hudson\hudson-slave\workspace\flex-sdk\frameworks\projects\wireframe\compile-config.xml:33
[junit] Error: unable to open 'f:\hudson\hudson-slave\workspace\flex-sdk\frameworks\libs\air\airspark.swc'.
[junit] f:\hudson\hudson-slave\workspace\flex-sdk\frameworks\projects\wireframe\compile-config.xml (line: 33)
[junit] </external-library-path>
[junit]
[junit]
[junit] f:\hudson\hudson-slave\workspace\flex-sdk\frameworks\projects\wireframe\compile-config.xml:33
[junit] Error: unable to open 'f:\hudson\hudson-slave\workspace\flex-sdk\frameworks\libs\textLayout.swc'.
[junit] f:\hudson\hudson-slave\workspace\flex-sdk\frameworks\projects\wireframe\compile-config.xml (line: 33)
[junit] </external-library-path>
[junit]
[junit]
[junit] Tests run: 29, Failures: 29, Errors: 0, Time elapsed: 5.827 sec
[junit] Test f.SDKSWCTests FAILED
jar.tests:
[java] Apache ActionScript Compiler (mxmlc)
[java] Version 2.0.0 build 0
[java]
[java] mxmlc [options] [defaultVar]
[java] Use 'mxmlc -help' for more information.
[java]
[java]
[java] Java Result: 1
[java] Apache SWC Component Compiler (compc)
[java] Version 2.0.0 build 0
[java]
[java] compc [options] [defaultVar]
[java] Use 'compc -help' for more information.
[java]
[java]
[java] Java Result: 1
[java] ActionScript 3.0 Compiler for AVM+
[java] Version 2.0.0 build 0
[java]
[java] usage: asc [-abcfuture] [-api <version>] [-AS3] [-avmtarget <vm version
[java] number>] [-b] [-coach] [-config <ns::name=value>] [-d] [-doc]
[java] [-ES] [-ES4] [-exe <avmplus path>] [-f] [-h] [-i] [-import
[java] <filename>] [-in <filename>] [-inline] [-l] [-language <lang>]
[java] [-le <swc file>] [-li <swc file>] [-log] [-m] [-md] [-merge]
[java] [-movieclip] [-o] [-o2 <name=value>] [-optimize] [-out
[java] <basename>] [-outdir <output directory name>] [-p] [-parallel]
[java] [-removedeadcode] [-sanity] [-static] [-strict] [-swf
[java] <classname,width,height[,fps]>] [-use <namespace>] [-warnings]
[java] FILENAME...
[java] Java Result: 1
[java] Apache ActionScript Compiler (optimizer)
[java] Version 2.0.0 build 0
[java]
[java] optimizer [options] [defaultVar]
[java] Use 'optimizer -help' for more information.
[java]
[java]
[java] Java Result: 1
[java] Apache SWF Dump Utility
[java] Version 2.0.0 build 0
[java]
[java] Usage: swfdump [-abc] file1.swf
[java] Java Result: 1
ant.tests:
[mxmlc]
[mxmlc] <https://builds.apache.org/job/flex-falcon/ws/defaults>
[mxmlc] Error: unable to open 'f:\hudson\hudson-slave\workspace\flex-sdk\frameworks\flex-config.xml'.
[mxmlc] defaults (line: -1)
[mxmlc]
BUILD FAILED
<https://builds.apache.org/job/flex-falcon/ws/build.xml>:44: The following error occurred while executing this line:
<https://builds.apache.org/job/flex-falcon/ws/compiler.tests\build.xml>:63: mxmlc task failed
Total time: 2 minutes 40 seconds
Build step 'Invoke Ant' marked build as failure
Archiving artifacts
Recording test results
Build failed in Jenkins: flex-falcon #135
Posted by Apache Jenkins Server <je...@builds.apache.org>.
See <https://builds.apache.org/job/flex-falcon/135/>
------------------------------------------
[...truncated 1642 lines...]
[junit] f:\hudson\hudson-slave\workspace\flex-sdk\frameworks\projects\spark\compile-config.xml (line: 30)
[junit] </external-library-path>
[junit]
[junit]
[junit] f:\hudson\hudson-slave\workspace\flex-sdk\frameworks\projects\spark\compile-config.xml:30
[junit] Error: unable to open 'f:\hudson\hudson-slave\workspace\flex-sdk\frameworks\libs\mx\mx.swc'.
[junit] f:\hudson\hudson-slave\workspace\flex-sdk\frameworks\projects\spark\compile-config.xml (line: 30)
[junit] </external-library-path>
[junit]
[junit]
[junit] f:\hudson\hudson-slave\workspace\flex-sdk\frameworks\projects\spark\compile-config.xml:30
[junit] Error: unable to open 'f:\hudson\hudson-slave\workspace\flex-sdk\frameworks\libs\osmf.swc'.
[junit] f:\hudson\hudson-slave\workspace\flex-sdk\frameworks\projects\spark\compile-config.xml (line: 30)
[junit] </external-library-path>
[junit]
[junit]
[junit] f:\hudson\hudson-slave\workspace\flex-sdk\frameworks\projects\spark\compile-config.xml:30
[junit] Error: unable to open 'f:\hudson\hudson-slave\workspace\flex-sdk\frameworks\libs\textLayout.swc'.
[junit] f:\hudson\hudson-slave\workspace\flex-sdk\frameworks\projects\spark\compile-config.xml (line: 30)
[junit] </external-library-path>
[junit]
[junit]
[junit] f:\hudson\hudson-slave\workspace\flex-sdk\frameworks\projects\spark\compile-config.xml:48
[junit] Error: unable to open 'f:\hudson\hudson-slave\workspace\flex-sdk\frameworks\projects\spark\manifest.xml'.
[junit] f:\hudson\hudson-slave\workspace\flex-sdk\frameworks\projects\spark\compile-config.xml (line: 48)
[junit] </namespace>
[junit]
[junit]
[junit] Loading configuration: f:\hudson\hudson-slave\workspace\flex-sdk\frameworks\projects\spark\compile-config.xml
[junit]
[junit] Loading configuration: f:\hudson\hudson-slave\workspace\flex-tlf\compile-config.xml
[junit]
[junit] <https://builds.apache.org/job/flex-falcon/ws/compiler.tests\defaults>
[junit] Error: unable to open 'f:\hudson\hudson-slave\workspace\flex-sdk\frameworks\flex-config.xml'.
[junit] defaults (line: -1)
[junit]
[junit] <https://builds.apache.org/job/flex-falcon/ws/compiler.tests\defaults>
[junit] Error: unable to open 'f:\hudson\hudson-slave\workspace\flex-sdk\frameworks\flex-config.xml'.
[junit] defaults (line: -1)
[junit]
[junit] f:\hudson\hudson-slave\workspace\flex-sdk\frameworks\projects\tool_air\compile-config.xml:34
[junit] Error: unable to open 'f:\hudson\hudson-slave\workspace\flex-sdk\frameworks\libs\framework.swc'.
[junit] f:\hudson\hudson-slave\workspace\flex-sdk\frameworks\projects\tool_air\compile-config.xml (line: 34)
[junit] </external-library-path>
[junit]
[junit]
[junit] f:\hudson\hudson-slave\workspace\flex-sdk\frameworks\projects\tool_air\compile-config.xml:34
[junit] Error: unable to open 'f:\hudson\hudson-slave\workspace\flex-sdk\frameworks\libs\mx\mx.swc'.
[junit] f:\hudson\hudson-slave\workspace\flex-sdk\frameworks\projects\tool_air\compile-config.xml (line: 34)
[junit] </external-library-path>
[junit]
[junit]
[junit] f:\hudson\hudson-slave\workspace\flex-sdk\frameworks\projects\tool_air\compile-config.xml:34
[junit] Error: unable to open 'f:\hudson\hudson-slave\workspace\flex-sdk\frameworks\libs\textLayout.swc'.
[junit] f:\hudson\hudson-slave\workspace\flex-sdk\frameworks\projects\tool_air\compile-config.xml (line: 34)
[junit] </external-library-path>
[junit]
[junit]
[junit] f:\hudson\hudson-slave\workspace\flex-sdk\frameworks\projects\tool_air\compile-config.xml:34
[junit] Error: unable to open 'f:\hudson\hudson-slave\workspace\flex-sdk\frameworks\libs\advancedgrids.swc'.
[junit] f:\hudson\hudson-slave\workspace\flex-sdk\frameworks\projects\tool_air\compile-config.xml (line: 34)
[junit] </external-library-path>
[junit]
[junit]
[junit] f:\hudson\hudson-slave\workspace\flex-sdk\frameworks\projects\tool_air\compile-config.xml:34
[junit] Error: unable to open 'f:\hudson\hudson-slave\workspace\flex-sdk\frameworks\libs\charts.swc'.
[junit] f:\hudson\hudson-slave\workspace\flex-sdk\frameworks\projects\tool_air\compile-config.xml (line: 34)
[junit] </external-library-path>
[junit]
[junit]
[junit] f:\hudson\hudson-slave\workspace\flex-sdk\frameworks\projects\tool_air\compile-config.xml:34
[junit] Error: unable to open 'f:\hudson\hudson-slave\workspace\flex-sdk\frameworks\libs\spark.swc'.
[junit] f:\hudson\hudson-slave\workspace\flex-sdk\frameworks\projects\tool_air\compile-config.xml (line: 34)
[junit] </external-library-path>
[junit]
[junit]
[junit] f:\hudson\hudson-slave\workspace\flex-sdk\frameworks\projects\tool_air\compile-config.xml:34
[junit] Error: unable to open 'f:\hudson\hudson-slave\workspace\flex-sdk\frameworks\libs\automation\automation_agent.swc'.
[junit] f:\hudson\hudson-slave\workspace\flex-sdk\frameworks\projects\tool_air\compile-config.xml (line: 34)
[junit] </external-library-path>
[junit]
[junit]
[junit] f:\hudson\hudson-slave\workspace\flex-sdk\frameworks\projects\tool_air\compile-config.xml:34
[junit] Error: unable to open 'f:\hudson\hudson-slave\workspace\flex-sdk\frameworks\libs\automation\automation_dmv.swc'.
[junit] f:\hudson\hudson-slave\workspace\flex-sdk\frameworks\projects\tool_air\compile-config.xml (line: 34)
[junit] </external-library-path>
[junit]
[junit]
[junit] Loading configuration: f:\hudson\hudson-slave\workspace\flex-sdk\frameworks\projects\tool_air\compile-config.xml
[junit]
[junit] Loading configuration: f:\hudson\hudson-slave\workspace\flex-sdk\frameworks\projects\tool\compile-config.xml
[junit]
[junit] <https://builds.apache.org/job/flex-falcon/ws/compiler.tests\defaults>
[junit] Error: unable to open 'f:\hudson\hudson-slave\workspace\flex-sdk\frameworks\flex-config.xml'.
[junit] defaults (line: -1)
[junit]
[junit] f:\hudson\hudson-slave\workspace\flex-sdk\frameworks\projects\tool\compile-config.xml:34
[junit] Error: unable to open 'f:\hudson\hudson-slave\workspace\flex-sdk\frameworks\libs\framework.swc'.
[junit] f:\hudson\hudson-slave\workspace\flex-sdk\frameworks\projects\tool\compile-config.xml (line: 34)
[junit] </external-library-path>
[junit]
[junit]
[junit] f:\hudson\hudson-slave\workspace\flex-sdk\frameworks\projects\tool\compile-config.xml:34
[junit] Error: unable to open 'f:\hudson\hudson-slave\workspace\flex-sdk\frameworks\libs\mx\mx.swc'.
[junit] f:\hudson\hudson-slave\workspace\flex-sdk\frameworks\projects\tool\compile-config.xml (line: 34)
[junit] </external-library-path>
[junit]
[junit]
[junit] f:\hudson\hudson-slave\workspace\flex-sdk\frameworks\projects\tool\compile-config.xml:34
[junit] Error: unable to open 'f:\hudson\hudson-slave\workspace\flex-sdk\frameworks\libs\textLayout.swc'.
[junit] f:\hudson\hudson-slave\workspace\flex-sdk\frameworks\projects\tool\compile-config.xml (line: 34)
[junit] </external-library-path>
[junit]
[junit]
[junit] f:\hudson\hudson-slave\workspace\flex-sdk\frameworks\projects\tool\compile-config.xml:34
[junit] Error: unable to open 'f:\hudson\hudson-slave\workspace\flex-sdk\frameworks\libs\advancedgrids.swc'.
[junit] f:\hudson\hudson-slave\workspace\flex-sdk\frameworks\projects\tool\compile-config.xml (line: 34)
[junit] </external-library-path>
[junit]
[junit]
[junit] f:\hudson\hudson-slave\workspace\flex-sdk\frameworks\projects\tool\compile-config.xml:34
[junit] Error: unable to open 'f:\hudson\hudson-slave\workspace\flex-sdk\frameworks\libs\charts.swc'.
[junit] f:\hudson\hudson-slave\workspace\flex-sdk\frameworks\projects\tool\compile-config.xml (line: 34)
[junit] </external-library-path>
[junit]
[junit]
[junit] f:\hudson\hudson-slave\workspace\flex-sdk\frameworks\projects\tool\compile-config.xml:34
[junit] Error: unable to open 'f:\hudson\hudson-slave\workspace\flex-sdk\frameworks\libs\spark.swc'.
[junit] f:\hudson\hudson-slave\workspace\flex-sdk\frameworks\projects\tool\compile-config.xml (line: 34)
[junit] </external-library-path>
[junit]
[junit]
[junit] f:\hudson\hudson-slave\workspace\flex-sdk\frameworks\projects\tool\compile-config.xml:34
[junit] Error: unable to open 'f:\hudson\hudson-slave\workspace\flex-sdk\frameworks\libs\automation\automation_agent.swc'.
[junit] f:\hudson\hudson-slave\workspace\flex-sdk\frameworks\projects\tool\compile-config.xml (line: 34)
[junit] </external-library-path>
[junit]
[junit]
[junit] f:\hudson\hudson-slave\workspace\flex-sdk\frameworks\projects\tool\compile-config.xml:34
[junit] Error: unable to open 'f:\hudson\hudson-slave\workspace\flex-sdk\frameworks\libs\automation\automation_dmv.swc'.
[junit] f:\hudson\hudson-slave\workspace\flex-sdk\frameworks\projects\tool\compile-config.xml (line: 34)
[junit] </external-library-path>
[junit]
[junit]
[junit] Loading configuration: f:\hudson\hudson-slave\workspace\flex-sdk\frameworks\projects\wireframe\compile-config.xml
[junit]
[junit] <https://builds.apache.org/job/flex-falcon/ws/compiler.tests\defaults>
[junit] Error: unable to open 'f:\hudson\hudson-slave\workspace\flex-sdk\frameworks\flex-config.xml'.
[junit] defaults (line: -1)
[junit]
[junit] f:\hudson\hudson-slave\workspace\flex-sdk\frameworks\projects\wireframe\compile-config.xml:33
[junit] Error: unable to open 'f:\hudson\hudson-slave\workspace\flex-sdk\frameworks\libs\framework.swc'.
[junit] f:\hudson\hudson-slave\workspace\flex-sdk\frameworks\projects\wireframe\compile-config.xml (line: 33)
[junit] </external-library-path>
[junit]
[junit]
[junit] f:\hudson\hudson-slave\workspace\flex-sdk\frameworks\projects\wireframe\compile-config.xml:33
[junit] Error: unable to open 'f:\hudson\hudson-slave\workspace\flex-sdk\frameworks\libs\mx\mx.swc'.
[junit] f:\hudson\hudson-slave\workspace\flex-sdk\frameworks\projects\wireframe\compile-config.xml (line: 33)
[junit] </external-library-path>
[junit]
[junit]
[junit] f:\hudson\hudson-slave\workspace\flex-sdk\frameworks\projects\wireframe\compile-config.xml:33
[junit] Error: unable to open 'f:\hudson\hudson-slave\workspace\flex-sdk\frameworks\libs\osmf.swc'.
[junit] f:\hudson\hudson-slave\workspace\flex-sdk\frameworks\projects\wireframe\compile-config.xml (line: 33)
[junit] </external-library-path>
[junit]
[junit]
[junit] f:\hudson\hudson-slave\workspace\flex-sdk\frameworks\projects\wireframe\compile-config.xml:33
[junit] Error: unable to open 'f:\hudson\hudson-slave\workspace\flex-sdk\frameworks\libs\spark.swc'.
[junit] f:\hudson\hudson-slave\workspace\flex-sdk\frameworks\projects\wireframe\compile-config.xml (line: 33)
[junit] </external-library-path>
[junit]
[junit]
[junit] f:\hudson\hudson-slave\workspace\flex-sdk\frameworks\projects\wireframe\compile-config.xml:33
[junit] Error: unable to open 'f:\hudson\hudson-slave\workspace\flex-sdk\frameworks\libs\air\airspark.swc'.
[junit] f:\hudson\hudson-slave\workspace\flex-sdk\frameworks\projects\wireframe\compile-config.xml (line: 33)
[junit] </external-library-path>
[junit]
[junit]
[junit] f:\hudson\hudson-slave\workspace\flex-sdk\frameworks\projects\wireframe\compile-config.xml:33
[junit] Error: unable to open 'f:\hudson\hudson-slave\workspace\flex-sdk\frameworks\libs\textLayout.swc'.
[junit] f:\hudson\hudson-slave\workspace\flex-sdk\frameworks\projects\wireframe\compile-config.xml (line: 33)
[junit] </external-library-path>
[junit]
[junit]
[junit] Tests run: 29, Failures: 29, Errors: 0, Time elapsed: 13.571 sec
[junit] Test f.SDKSWCTests FAILED
jar.tests:
[java] Apache ActionScript Compiler (mxmlc)
[java] Version 2.0.0 build 0
[java]
[java] mxmlc [options] [defaultVar]
[java] Use 'mxmlc -help' for more information.
[java]
[java]
[java] Java Result: 1
[java] Apache SWC Component Compiler (compc)
[java] Version 2.0.0 build 0
[java]
[java] compc [options] [defaultVar]
[java] Use 'compc -help' for more information.
[java]
[java]
[java] Java Result: 1
[java] ActionScript 3.0 Compiler for AVM+
[java] Version 2.0.0 build 0
[java]
[java] usage: asc [-abcfuture] [-api <version>] [-AS3] [-avmtarget <vm version
[java] number>] [-b] [-coach] [-config <ns::name=value>] [-d] [-doc]
[java] [-ES] [-ES4] [-exe <avmplus path>] [-f] [-h] [-i] [-import
[java] <filename>] [-in <filename>] [-inline] [-l] [-language <lang>]
[java] [-le <swc file>] [-li <swc file>] [-log] [-m] [-md] [-merge]
[java] [-movieclip] [-o] [-o2 <name=value>] [-optimize] [-out
[java] <basename>] [-outdir <output directory name>] [-p] [-parallel]
[java] [-removedeadcode] [-sanity] [-static] [-strict] [-swf
[java] <classname,width,height[,fps]>] [-use <namespace>] [-warnings]
[java] FILENAME...
[java] Java Result: 1
[java] Apache ActionScript Compiler (optimizer)
[java] Version 2.0.0 build 0
[java]
[java] optimizer [options] [defaultVar]
[java] Use 'optimizer -help' for more information.
[java]
[java]
[java] Java Result: 1
[java] Apache SWF Dump Utility
[java] Version 2.0.0 build 0
[java]
[java] Usage: swfdump [-abc] file1.swf
[java] Java Result: 1
ant.tests:
[mxmlc]
[mxmlc] <https://builds.apache.org/job/flex-falcon/ws/defaults>
[mxmlc] Error: unable to open 'f:\hudson\hudson-slave\workspace\flex-sdk\frameworks\flex-config.xml'.
[mxmlc] defaults (line: -1)
[mxmlc]
BUILD FAILED
<https://builds.apache.org/job/flex-falcon/ws/build.xml>:44: The following error occurred while executing this line:
<https://builds.apache.org/job/flex-falcon/ws/compiler.tests\build.xml>:63: mxmlc task failed
Total time: 4 minutes 27 seconds
Build step 'Invoke Ant' marked build as failure
Archiving artifacts
Recording test results
Build failed in Jenkins: flex-falcon #134
Posted by Apache Jenkins Server <je...@builds.apache.org>.
See <https://builds.apache.org/job/flex-falcon/134/>
------------------------------------------
[...truncated 1641 lines...]
[junit] f:\hudson\hudson-slave\workspace\flex-sdk\frameworks\projects\spark\compile-config.xml (line: 30)
[junit] </external-library-path>
[junit]
[junit]
[junit] f:\hudson\hudson-slave\workspace\flex-sdk\frameworks\projects\spark\compile-config.xml:30
[junit] Error: unable to open 'f:\hudson\hudson-slave\workspace\flex-sdk\frameworks\libs\mx\mx.swc'.
[junit] f:\hudson\hudson-slave\workspace\flex-sdk\frameworks\projects\spark\compile-config.xml (line: 30)
[junit] </external-library-path>
[junit]
[junit]
[junit] f:\hudson\hudson-slave\workspace\flex-sdk\frameworks\projects\spark\compile-config.xml:30
[junit] Error: unable to open 'f:\hudson\hudson-slave\workspace\flex-sdk\frameworks\libs\osmf.swc'.
[junit] f:\hudson\hudson-slave\workspace\flex-sdk\frameworks\projects\spark\compile-config.xml (line: 30)
[junit] </external-library-path>
[junit]
[junit]
[junit] f:\hudson\hudson-slave\workspace\flex-sdk\frameworks\projects\spark\compile-config.xml:30
[junit] Error: unable to open 'f:\hudson\hudson-slave\workspace\flex-sdk\frameworks\libs\textLayout.swc'.
[junit] f:\hudson\hudson-slave\workspace\flex-sdk\frameworks\projects\spark\compile-config.xml (line: 30)
[junit] </external-library-path>
[junit]
[junit]
[junit] f:\hudson\hudson-slave\workspace\flex-sdk\frameworks\projects\spark\compile-config.xml:48
[junit] Error: unable to open 'f:\hudson\hudson-slave\workspace\flex-sdk\frameworks\projects\spark\manifest.xml'.
[junit] f:\hudson\hudson-slave\workspace\flex-sdk\frameworks\projects\spark\compile-config.xml (line: 48)
[junit] </namespace>
[junit]
[junit]
[junit] Loading configuration: f:\hudson\hudson-slave\workspace\flex-sdk\frameworks\projects\spark\compile-config.xml
[junit]
[junit] Loading configuration: f:\hudson\hudson-slave\workspace\flex-tlf\compile-config.xml
[junit]
[junit] <https://builds.apache.org/job/flex-falcon/ws/compiler.tests\defaults>
[junit] Error: unable to open 'f:\hudson\hudson-slave\workspace\flex-sdk\frameworks\flex-config.xml'.
[junit] defaults (line: -1)
[junit]
[junit] Loading configuration: f:\hudson\hudson-slave\workspace\flex-sdk\frameworks\projects\tool_air\compile-config.xml
[junit]
[junit] <https://builds.apache.org/job/flex-falcon/ws/compiler.tests\defaults>
[junit] Error: unable to open 'f:\hudson\hudson-slave\workspace\flex-sdk\frameworks\flex-config.xml'.
[junit] defaults (line: -1)
[junit]
[junit] f:\hudson\hudson-slave\workspace\flex-sdk\frameworks\projects\tool_air\compile-config.xml:34
[junit] Error: unable to open 'f:\hudson\hudson-slave\workspace\flex-sdk\frameworks\libs\framework.swc'.
[junit] f:\hudson\hudson-slave\workspace\flex-sdk\frameworks\projects\tool_air\compile-config.xml (line: 34)
[junit] </external-library-path>
[junit]
[junit]
[junit] f:\hudson\hudson-slave\workspace\flex-sdk\frameworks\projects\tool_air\compile-config.xml:34
[junit] Error: unable to open 'f:\hudson\hudson-slave\workspace\flex-sdk\frameworks\libs\mx\mx.swc'.
[junit] f:\hudson\hudson-slave\workspace\flex-sdk\frameworks\projects\tool_air\compile-config.xml (line: 34)
[junit] </external-library-path>
[junit]
[junit]
[junit] f:\hudson\hudson-slave\workspace\flex-sdk\frameworks\projects\tool_air\compile-config.xml:34
[junit] Error: unable to open 'f:\hudson\hudson-slave\workspace\flex-sdk\frameworks\libs\textLayout.swc'.
[junit] f:\hudson\hudson-slave\workspace\flex-sdk\frameworks\projects\tool_air\compile-config.xml (line: 34)
[junit] </external-library-path>
[junit]
[junit]
[junit] f:\hudson\hudson-slave\workspace\flex-sdk\frameworks\projects\tool_air\compile-config.xml:34
[junit] Error: unable to open 'f:\hudson\hudson-slave\workspace\flex-sdk\frameworks\libs\advancedgrids.swc'.
[junit] f:\hudson\hudson-slave\workspace\flex-sdk\frameworks\projects\tool_air\compile-config.xml (line: 34)
[junit] </external-library-path>
[junit]
[junit]
[junit] f:\hudson\hudson-slave\workspace\flex-sdk\frameworks\projects\tool_air\compile-config.xml:34
[junit] Error: unable to open 'f:\hudson\hudson-slave\workspace\flex-sdk\frameworks\libs\charts.swc'.
[junit] f:\hudson\hudson-slave\workspace\flex-sdk\frameworks\projects\tool_air\compile-config.xml (line: 34)
[junit] </external-library-path>
[junit]
[junit]
[junit] f:\hudson\hudson-slave\workspace\flex-sdk\frameworks\projects\tool_air\compile-config.xml:34
[junit] Error: unable to open 'f:\hudson\hudson-slave\workspace\flex-sdk\frameworks\libs\spark.swc'.
[junit] f:\hudson\hudson-slave\workspace\flex-sdk\frameworks\projects\tool_air\compile-config.xml (line: 34)
[junit] </external-library-path>
[junit]
[junit]
[junit] f:\hudson\hudson-slave\workspace\flex-sdk\frameworks\projects\tool_air\compile-config.xml:34
[junit] Error: unable to open 'f:\hudson\hudson-slave\workspace\flex-sdk\frameworks\libs\automation\automation_agent.swc'.
[junit] f:\hudson\hudson-slave\workspace\flex-sdk\frameworks\projects\tool_air\compile-config.xml (line: 34)
[junit] </external-library-path>
[junit]
[junit]
[junit] f:\hudson\hudson-slave\workspace\flex-sdk\frameworks\projects\tool_air\compile-config.xml:34
[junit] Error: unable to open 'f:\hudson\hudson-slave\workspace\flex-sdk\frameworks\libs\automation\automation_dmv.swc'.
[junit] f:\hudson\hudson-slave\workspace\flex-sdk\frameworks\projects\tool_air\compile-config.xml (line: 34)
[junit] </external-library-path>
[junit]
[junit]
[junit] <https://builds.apache.org/job/flex-falcon/ws/compiler.tests\defaults>
[junit] Error: unable to open 'f:\hudson\hudson-slave\workspace\flex-sdk\frameworks\flex-config.xml'.
[junit] defaults (line: -1)
[junit]
[junit] f:\hudson\hudson-slave\workspace\flex-sdk\frameworks\projects\tool\compile-config.xml:34
[junit] Error: unable to open 'f:\hudson\hudson-slave\workspace\flex-sdk\frameworks\libs\framework.swc'.
[junit] f:\hudson\hudson-slave\workspace\flex-sdk\frameworks\projects\tool\compile-config.xml (line: 34)
[junit] </external-library-path>
[junit]
[junit]
[junit] f:\hudson\hudson-slave\workspace\flex-sdk\frameworks\projects\tool\compile-config.xml:34
[junit] Error: unable to open 'f:\hudson\hudson-slave\workspace\flex-sdk\frameworks\libs\mx\mx.swc'.
[junit] f:\hudson\hudson-slave\workspace\flex-sdk\frameworks\projects\tool\compile-config.xml (line: 34)
[junit] </external-library-path>
[junit]
[junit]
[junit] f:\hudson\hudson-slave\workspace\flex-sdk\frameworks\projects\tool\compile-config.xml:34
[junit] Error: unable to open 'f:\hudson\hudson-slave\workspace\flex-sdk\frameworks\libs\textLayout.swc'.
[junit] f:\hudson\hudson-slave\workspace\flex-sdk\frameworks\projects\tool\compile-config.xml (line: 34)
[junit] </external-library-path>
[junit]
[junit]
[junit] f:\hudson\hudson-slave\workspace\flex-sdk\frameworks\projects\tool\compile-config.xml:34
[junit] Error: unable to open 'f:\hudson\hudson-slave\workspace\flex-sdk\frameworks\libs\advancedgrids.swc'.
[junit] f:\hudson\hudson-slave\workspace\flex-sdk\frameworks\projects\tool\compile-config.xml (line: 34)
[junit] </external-library-path>
[junit]
[junit]
[junit] f:\hudson\hudson-slave\workspace\flex-sdk\frameworks\projects\tool\compile-config.xml:34
[junit] Error: unable to open 'f:\hudson\hudson-slave\workspace\flex-sdk\frameworks\libs\charts.swc'.
[junit] f:\hudson\hudson-slave\workspace\flex-sdk\frameworks\projects\tool\compile-config.xml (line: 34)
[junit] </external-library-path>
[junit]
[junit]
[junit] f:\hudson\hudson-slave\workspace\flex-sdk\frameworks\projects\tool\compile-config.xml:34
[junit] Error: unable to open 'f:\hudson\hudson-slave\workspace\flex-sdk\frameworks\libs\spark.swc'.
[junit] f:\hudson\hudson-slave\workspace\flex-sdk\frameworks\projects\tool\compile-config.xml (line: 34)
[junit] </external-library-path>
[junit]
[junit]
[junit] f:\hudson\hudson-slave\workspace\flex-sdk\frameworks\projects\tool\compile-config.xml:34
[junit] Error: unable to open 'f:\hudson\hudson-slave\workspace\flex-sdk\frameworks\libs\automation\automation_agent.swc'.
[junit] f:\hudson\hudson-slave\workspace\flex-sdk\frameworks\projects\tool\compile-config.xml (line: 34)
[junit] </external-library-path>
[junit]
[junit]
[junit] f:\hudson\hudson-slave\workspace\flex-sdk\frameworks\projects\tool\compile-config.xml:34
[junit] Error: unable to open 'f:\hudson\hudson-slave\workspace\flex-sdk\frameworks\libs\automation\automation_dmv.swc'.
[junit] f:\hudson\hudson-slave\workspace\flex-sdk\frameworks\projects\tool\compile-config.xml (line: 34)
[junit] </external-library-path>
[junit]
[junit]
[junit] Loading configuration: f:\hudson\hudson-slave\workspace\flex-sdk\frameworks\projects\tool\compile-config.xml
[junit]
[junit] <https://builds.apache.org/job/flex-falcon/ws/compiler.tests\defaults>
[junit] Error: unable to open 'f:\hudson\hudson-slave\workspace\flex-sdk\frameworks\flex-config.xml'.
[junit] defaults (line: -1)
[junit]
[junit] f:\hudson\hudson-slave\workspace\flex-sdk\frameworks\projects\wireframe\compile-config.xml:33
[junit] Error: unable to open 'f:\hudson\hudson-slave\workspace\flex-sdk\frameworks\libs\framework.swc'.
[junit] f:\hudson\hudson-slave\workspace\flex-sdk\frameworks\projects\wireframe\compile-config.xml (line: 33)
[junit] </external-library-path>
[junit]
[junit]
[junit] f:\hudson\hudson-slave\workspace\flex-sdk\frameworks\projects\wireframe\compile-config.xml:33
[junit] Error: unable to open 'f:\hudson\hudson-slave\workspace\flex-sdk\frameworks\libs\mx\mx.swc'.
[junit] f:\hudson\hudson-slave\workspace\flex-sdk\frameworks\projects\wireframe\compile-config.xml (line: 33)
[junit] </external-library-path>
[junit]
[junit]
[junit] f:\hudson\hudson-slave\workspace\flex-sdk\frameworks\projects\wireframe\compile-config.xml:33
[junit] Error: unable to open 'f:\hudson\hudson-slave\workspace\flex-sdk\frameworks\libs\osmf.swc'.
[junit] f:\hudson\hudson-slave\workspace\flex-sdk\frameworks\projects\wireframe\compile-config.xml (line: 33)
[junit] </external-library-path>
[junit]
[junit]
[junit] f:\hudson\hudson-slave\workspace\flex-sdk\frameworks\projects\wireframe\compile-config.xml:33
[junit] Error: unable to open 'f:\hudson\hudson-slave\workspace\flex-sdk\frameworks\libs\spark.swc'.
[junit] f:\hudson\hudson-slave\workspace\flex-sdk\frameworks\projects\wireframe\compile-config.xml (line: 33)
[junit] </external-library-path>
[junit]
[junit]
[junit] f:\hudson\hudson-slave\workspace\flex-sdk\frameworks\projects\wireframe\compile-config.xml:33
[junit] Error: unable to open 'f:\hudson\hudson-slave\workspace\flex-sdk\frameworks\libs\air\airspark.swc'.
[junit] f:\hudson\hudson-slave\workspace\flex-sdk\frameworks\projects\wireframe\compile-config.xml (line: 33)
[junit] </external-library-path>
[junit]
[junit]
[junit] f:\hudson\hudson-slave\workspace\flex-sdk\frameworks\projects\wireframe\compile-config.xml:33
[junit] Error: unable to open 'f:\hudson\hudson-slave\workspace\flex-sdk\frameworks\libs\textLayout.swc'.
[junit] f:\hudson\hudson-slave\workspace\flex-sdk\frameworks\projects\wireframe\compile-config.xml (line: 33)
[junit] </external-library-path>
[junit]
[junit]
[junit] Loading configuration: f:\hudson\hudson-slave\workspace\flex-sdk\frameworks\projects\wireframe\compile-config.xml
[junit]
[junit] Tests run: 29, Failures: 29, Errors: 0, Time elapsed: 8.948 sec
[junit] Test f.SDKSWCTests FAILED
jar.tests:
[java] Apache ActionScript Compiler (mxmlc)
[java] Version 2.0.0 build 0
[java]
[java] mxmlc [options] [defaultVar]
[java] Use 'mxmlc -help' for more information.
[java]
[java]
[java] Java Result: 1
[java] Apache SWC Component Compiler (compc)
[java] Version 2.0.0 build 0
[java]
[java] compc [options] [defaultVar]
[java] Use 'compc -help' for more information.
[java]
[java]
[java] Java Result: 1
[java] ActionScript 3.0 Compiler for AVM+
[java] Version 2.0.0 build 0
[java]
[java] usage: asc [-abcfuture] [-api <version>] [-AS3] [-avmtarget <vm version
[java] number>] [-b] [-coach] [-config <ns::name=value>] [-d] [-doc]
[java] [-ES] [-ES4] [-exe <avmplus path>] [-f] [-h] [-i] [-import
[java] <filename>] [-in <filename>] [-inline] [-l] [-language <lang>]
[java] [-le <swc file>] [-li <swc file>] [-log] [-m] [-md] [-merge]
[java] [-movieclip] [-o] [-o2 <name=value>] [-optimize] [-out
[java] <basename>] [-outdir <output directory name>] [-p] [-parallel]
[java] [-removedeadcode] [-sanity] [-static] [-strict] [-swf
[java] <classname,width,height[,fps]>] [-use <namespace>] [-warnings]
[java] FILENAME...
[java] Java Result: 1
[java] Apache ActionScript Compiler (optimizer)
[java] Version 2.0.0 build 0
[java]
[java] optimizer [options] [defaultVar]
[java] Use 'optimizer -help' for more information.
[java]
[java]
[java] Java Result: 1
[java] Apache SWF Dump Utility
[java] Version 2.0.0 build 0
[java]
[java] Usage: swfdump [-abc] file1.swf
[java] Java Result: 1
ant.tests:
[mxmlc]
[mxmlc] <https://builds.apache.org/job/flex-falcon/ws/defaults>
[mxmlc] Error: unable to open 'f:\hudson\hudson-slave\workspace\flex-sdk\frameworks\flex-config.xml'.
[mxmlc] defaults (line: -1)
[mxmlc]
BUILD FAILED
<https://builds.apache.org/job/flex-falcon/ws/build.xml>:44: The following error occurred while executing this line:
<https://builds.apache.org/job/flex-falcon/ws/compiler.tests\build.xml>:63: mxmlc task failed
Total time: 3 minutes 9 seconds
Build step 'Invoke Ant' marked build as failure
Archiving artifacts
Recording test results