You are viewing a plain text version of this content. The canonical link for it is here.
Posted to builds@beam.apache.org by Apache Jenkins Server <je...@builds.apache.org> on 2022/02/24 18:05:24 UTC
Build failed in Jenkins: beam_PreCommit_Java_Cron #5138
See <https://ci-beam.apache.org/job/beam_PreCommit_Java_Cron/5138/display/redirect>
Changes:
------------------------------------------
Started by timer
Running as SYSTEM
[EnvInject] - Loading node environment variables.
Building remotely on apache-beam-jenkins-4 (beam) in workspace <https://ci-beam.apache.org/job/beam_PreCommit_Java_Cron/ws/>
The recommended git tool is: NONE
No credentials specified
Wiping out workspace first.
Cloning the remote Git repository
Cloning repository https://github.com/apache/beam.git
> git init <https://ci-beam.apache.org/job/beam_PreCommit_Java_Cron/ws/src> # timeout=10
Fetching upstream changes from https://github.com/apache/beam.git
> git --version # timeout=10
> git --version # 'git version 2.25.1'
> git fetch --tags --force --progress -- https://github.com/apache/beam.git +refs/heads/*:refs/remotes/origin/* # timeout=10
> git config remote.origin.url https://github.com/apache/beam.git # timeout=10
> git config --add remote.origin.fetch +refs/heads/*:refs/remotes/origin/* # timeout=10
> git config remote.origin.url https://github.com/apache/beam.git # timeout=10
Fetching upstream changes from https://github.com/apache/beam.git
> git fetch --tags --force --progress -- https://github.com/apache/beam.git +refs/heads/*:refs/remotes/origin/* +refs/pull/${ghprbPullId}/*:refs/remotes/origin/pr/${ghprbPullId}/* # timeout=10
> git rev-parse origin/master^{commit} # timeout=10
Checking out Revision 2a45a5b6c34141dcc595c5cda3d28264e542bdff (origin/master)
> git config core.sparsecheckout # timeout=10
> git checkout -f 2a45a5b6c34141dcc595c5cda3d28264e542bdff # timeout=10
Commit message: "Merge pull request #16826 from [BEAM-13870] [Playground] Increase test coverage for the cache package"
> git rev-list --no-walk 2a45a5b6c34141dcc595c5cda3d28264e542bdff # timeout=10
No emails were triggered.
[EnvInject] - Executing scripts and injecting environment variables after the SCM step.
[EnvInject] - Injecting as environment variables the properties content
SPARK_LOCAL_IP=127.0.0.1
SETUPTOOLS_USE_DISTUTILS=stdlib
[EnvInject] - Variables injected successfully.
[Gradle] - Launching build.
[src] $ <https://ci-beam.apache.org/job/beam_PreCommit_Java_Cron/ws/src/gradlew> -PretryFlakyTest=true -PdisableSpotlessCheck=true --continue --max-workers=12 -Dorg.gradle.jvmargs=-Xms2g -Dorg.gradle.jvmargs=-Xmx4g -Dorg.gradle.vfs.watch=false -Pdocker-pull-licenses :javaPreCommit
FAILURE: Build failed with an exception.
* What went wrong:
Timeout waiting to lock daemon addresses registry. It is currently in use by another Gradle instance.
Owner PID: unknown
Our PID: 2087435
Owner Operation: unknown
Our operation:
Lock file: /home/jenkins/.gradle/daemon/7.3.2/registry.bin.lock
* Try:
> Run with --stacktrace option to get the stack trace.
> Run with --info or --debug option to get more log output.
> Run with --scan to get full insights.
* Get more help at https://help.gradle.org
Build step 'Invoke Gradle script' changed build result to FAILURE
Build step 'Invoke Gradle script' marked build as failure
---------------------------------------------------------------------
To unsubscribe, e-mail: builds-unsubscribe@beam.apache.org
For additional commands, e-mail: builds-help@beam.apache.org
Jenkins build is back to normal : beam_PreCommit_Java_Cron #5156
Posted by Apache Jenkins Server <je...@builds.apache.org>.
See <https://ci-beam.apache.org/job/beam_PreCommit_Java_Cron/5156/display/redirect?page=changes>
---------------------------------------------------------------------
To unsubscribe, e-mail: builds-unsubscribe@beam.apache.org
For additional commands, e-mail: builds-help@beam.apache.org
beam_PreCommit_Java_Cron - Build # 5155 - Aborted!
Posted by Apache Jenkins Server <je...@builds.apache.org>.
beam_PreCommit_Java_Cron - Build # 5155 - Aborted:
Check console output at https://ci-beam.apache.org/job/beam_PreCommit_Java_Cron/5155/ to view the results.
Build failed in Jenkins: beam_PreCommit_Java_Cron #5154
Posted by Apache Jenkins Server <je...@builds.apache.org>.
See <https://ci-beam.apache.org/job/beam_PreCommit_Java_Cron/5154/display/redirect?page=changes>
Changes:
[noreply] Build wheels for Python 3.9
[noreply] Merge pull request #16892 from [BEAM-13755] [Playground] Scroll the
[noreply] Merge pull request #16880 from [BEAM-13963][Playground] Get bucket name
[noreply] Merge pull request #16870 from [BEAM-13874][Playground] Tag multifile
[noreply] Merge pull request #16910 from [BEAM-13724] [Playground] Get the default
[noreply] [BEAM-14008] Fix incorrect guava import (#16966)
------------------------------------------
[...truncated 2.71 MB...]
> Task :runners:spark:3:build
> Task :runners:spark:3:buildDependents
> Task :runners:samza:compileTestJava
Note: Some input files use or override a deprecated API.
Note: Recompile with -Xlint:deprecation for details.
Note: Some input files use unchecked or unsafe operations.
Note: Recompile with -Xlint:unchecked for details.
> Task :runners:samza:testClasses
> Task :runners:samza:analyzeTestClassesDependencies SKIPPED
> Task :runners:samza:analyzeDependencies
> Task :runners:samza:checkstyleMain
> Task :runners:samza:checkstyleTest
> Task :sdks:java:extensions:sql:jdbc:preCommit
> Task :runners:samza:job-server:distZip
> Task :runners:samza:job-server:compileTestJava NO-SOURCE
> Task :runners:samza:job-server:testClasses UP-TO-DATE
> Task :runners:samza:job-server:packageTests
> Task :runners:samza:javadoc
> Task :runners:samza:spotbugsTest SKIPPED
> Task :sdks:java:harness:test
> Task :runners:samza:spotbugsMain
> Task :sdks:java:harness:check
> Task :sdks:java:harness:build
> Task :runners:samza:job-server:shadowJar
> Task :runners:samza:test
> Task :sdks:java:io:elasticsearch-tests:elasticsearch-tests-6:check
> Task :sdks:java:io:elasticsearch-tests:elasticsearch-tests-6:build
> Task :sdks:java:io:elasticsearch-tests:elasticsearch-tests-6:buildDependents
> Task :sdks:java:io:elasticsearch-tests:elasticsearch-tests-5:check
> Task :sdks:java:io:elasticsearch-tests:elasticsearch-tests-5:build
> Task :sdks:java:io:elasticsearch-tests:elasticsearch-tests-5:buildDependents
> Task :runners:samza:check
> Task :runners:samza:build
> Task :sdks:java:io:elasticsearch-tests:elasticsearch-tests-7:check
> Task :sdks:java:io:elasticsearch-tests:elasticsearch-tests-7:build
> Task :sdks:java:io:elasticsearch-tests:elasticsearch-tests-7:buildDependents
> Task :sdks:java:io:elasticsearch-tests:elasticsearch-tests-common:buildDependents
> Task :sdks:java:io:elasticsearch:buildDependents
> Task :runners:flink:1.14:test
[FileChannelManagerImpl-io shutdown hook] INFO org.apache.flink.runtime.io.disk.FileChannelManagerImpl - FileChannelManager removed spill file directory /tmp/flink-io-8990e504-16b6-4c11-b36a-cb7ab51817f8
[IOManagerAsync shutdown hook] INFO org.apache.flink.runtime.io.disk.FileChannelManagerImpl - FileChannelManager removed spill file directory /tmp/flink-io-325e2232-74c0-4c05-9052-576b686a2f69
[FileChannelManagerImpl-io shutdown hook] INFO org.apache.flink.runtime.io.disk.FileChannelManagerImpl - FileChannelManager removed spill file directory /tmp/flink-io-a85a3fad-f451-4143-9c73-b05286064f14
[FileChannelManagerImpl-io shutdown hook] INFO org.apache.flink.runtime.io.disk.FileChannelManagerImpl - FileChannelManager removed spill file directory /tmp/flink-io-19dddfad-22b8-4ce6-8d74-cd99d3f31389
[FileChannelManagerImpl-io shutdown hook] INFO org.apache.flink.runtime.io.disk.FileChannelManagerImpl - FileChannelManager removed spill file directory /tmp/flink-io-75246d24-e033-4202-8e3c-37b99928e05a
[FileChannelManagerImpl-io shutdown hook] INFO org.apache.flink.runtime.io.disk.FileChannelManagerImpl - FileChannelManager removed spill file directory /tmp/flink-io-8f063b57-2d34-412c-9e33-398a593c9a26
[IOManagerAsync shutdown hook] INFO org.apache.flink.runtime.io.disk.FileChannelManagerImpl - FileChannelManager removed spill file directory /tmp/flink-io-2c2cca0e-8cbf-4483-b29f-beedd310a337
[IOManagerAsync shutdown hook] INFO org.apache.flink.runtime.io.disk.FileChannelManagerImpl - FileChannelManager removed spill file directory /tmp/flink-io-e2e99bf2-3da9-4c63-adf0-397d99544e7e
[IOManagerAsync shutdown hook] INFO org.apache.flink.runtime.io.disk.FileChannelManagerImpl - FileChannelManager removed spill file directory /tmp/flink-io-442a422b-a85b-4970-af1b-fb84f23d904c
[FileChannelManagerImpl-io shutdown hook] INFO org.apache.flink.runtime.io.disk.FileChannelManagerImpl - FileChannelManager removed spill file directory /tmp/flink-io-1a1f28e2-614c-4bc7-9296-fb573a124d33
[FileChannelManagerImpl-io shutdown hook] INFO org.apache.flink.runtime.io.disk.FileChannelManagerImpl - FileChannelManager removed spill file directory /tmp/flink-io-c2e6a74c-fe83-4cb7-826b-114c678c2e6a
[IOManagerAsync shutdown hook] INFO org.apache.flink.runtime.io.disk.FileChannelManagerImpl - FileChannelManager removed spill file directory /tmp/flink-io-a549cd96-4fdd-470e-91a2-c46badf7b8ef
[FileChannelManagerImpl-io shutdown hook] INFO org.apache.flink.runtime.io.disk.FileChannelManagerImpl - FileChannelManager removed spill file directory /tmp/flink-io-5ccf7507-261c-4f6b-abb0-04f9dc832919
[FileChannelManagerImpl-io shutdown hook] INFO org.apache.flink.runtime.io.disk.FileChannelManagerImpl - FileChannelManager removed spill file directory /tmp/flink-io-584da343-8184-4bec-9fcd-a0f1f28e7dfd
[IOManagerAsync shutdown hook] INFO org.apache.flink.runtime.io.disk.FileChannelManagerImpl - FileChannelManager removed spill file directory /tmp/flink-io-7d6c83ca-5960-4748-86a2-0db96b948760
[FileChannelManagerImpl-io shutdown hook] INFO org.apache.flink.runtime.io.disk.FileChannelManagerImpl - FileChannelManager removed spill file directory /tmp/flink-io-9e5e0030-83cf-43c8-bbb4-ba19926c8b3e
[FileChannelManagerImpl-io shutdown hook] INFO org.apache.flink.runtime.io.disk.FileChannelManagerImpl - FileChannelManager removed spill file directory /tmp/flink-io-391c6db5-ef7c-48ae-9cde-291f86709a91
[FileChannelManagerImpl-io shutdown hook] INFO org.apache.flink.runtime.io.disk.FileChannelManagerImpl - FileChannelManager removed spill file directory /tmp/flink-io-79600ae3-cbf5-4088-b199-20871adca972
[FileChannelManagerImpl-io shutdown hook] INFO org.apache.flink.runtime.io.disk.FileChannelManagerImpl - FileChannelManager removed spill file directory /tmp/flink-io-bf6fefb1-bf7e-4ba0-b139-d16a7599228a
[FileChannelManagerImpl-io shutdown hook] INFO org.apache.flink.runtime.io.disk.FileChannelManagerImpl - FileChannelManager removed spill file directory /tmp/flink-io-439d5be2-64bd-418d-89cf-2f5471dc69d5
[FileChannelManagerImpl-io shutdown hook] INFO org.apache.flink.runtime.io.disk.FileChannelManagerImpl - FileChannelManager removed spill file directory /tmp/flink-io-32a6d273-08d3-43d5-8713-66dc28580550
[FileChannelManagerImpl-io shutdown hook] INFO org.apache.flink.runtime.io.disk.FileChannelManagerImpl - FileChannelManager removed spill file directory /tmp/flink-io-8799834a-bff8-458c-83d3-c32b18c861dc
[FileChannelManagerImpl-io shutdown hook] INFO org.apache.flink.runtime.io.disk.FileChannelManagerImpl - FileChannelManager removed spill file directory /tmp/flink-io-18cbd248-cf40-4186-8461-aec3a8e0bd93
[FileChannelManagerImpl-io shutdown hook] INFO org.apache.flink.runtime.io.disk.FileChannelManagerImpl - FileChannelManager removed spill file directory /tmp/flink-io-acbc02a2-8a2f-4d87-9ac5-c2a0057a4753
[FileChannelManagerImpl-io shutdown hook] INFO org.apache.flink.runtime.io.disk.FileChannelManagerImpl - FileChannelManager removed spill file directory /tmp/flink-io-35e6fc41-b824-4128-970f-df0d5daec405
[IOManagerAsync shutdown hook] INFO org.apache.flink.runtime.io.disk.FileChannelManagerImpl - FileChannelManager removed spill file directory /tmp/flink-io-20dc4e19-b348-4bef-8258-c73dc845e907
[FileChannelManagerImpl-io shutdown hook] INFO org.apache.flink.runtime.io.disk.FileChannelManagerImpl - FileChannelManager removed spill file directory /tmp/flink-io-8e58524f-b01e-4a84-8f7e-29a438ebd404
[FileChannelManagerImpl-io shutdown hook] INFO org.apache.flink.runtime.io.disk.FileChannelManagerImpl - FileChannelManager removed spill file directory /tmp/flink-io-d9ecb2a8-65b8-4dda-84e9-224768479eb6
[FileChannelManagerImpl-io shutdown hook] INFO org.apache.flink.runtime.io.disk.FileChannelManagerImpl - FileChannelManager removed spill file directory /tmp/flink-io-a3b1bff0-87ca-4fd4-85c2-e1891fb93b54
[FileChannelManagerImpl-io shutdown hook] INFO org.apache.flink.runtime.io.disk.FileChannelManagerImpl - FileChannelManager removed spill file directory /tmp/flink-io-8f14e329-94dd-40a5-b88c-0203457a3553
[FileChannelManagerImpl-io shutdown hook] INFO org.apache.flink.runtime.io.disk.FileChannelManagerImpl - FileChannelManager removed spill file directory /tmp/flink-io-07c72ecf-29c9-40a3-9cf3-2074bc82f431
[IOManagerAsync shutdown hook] INFO org.apache.flink.runtime.io.disk.FileChannelManagerImpl - FileChannelManager removed spill file directory /tmp/flink-io-8046aa33-8a8b-4c43-8f5f-9f4a1a6bb80d
[IOManagerAsync shutdown hook] INFO org.apache.flink.runtime.io.disk.FileChannelManagerImpl - FileChannelManager removed spill file directory /tmp/flink-io-e73d8930-ed11-4069-9bd7-1df1d40b91d3
[FileChannelManagerImpl-io shutdown hook] INFO org.apache.flink.runtime.io.disk.FileChannelManagerImpl - FileChannelManager removed spill file directory /tmp/flink-io-59fbf134-abed-440b-8cf7-fd78987d16fa
[FileChannelManagerImpl-io shutdown hook] INFO org.apache.flink.runtime.io.disk.FileChannelManagerImpl - FileChannelManager removed spill file directory /tmp/flink-io-cd871365-1dc2-4fc9-8a26-184d9e212b89
[FileChannelManagerImpl-io shutdown hook] INFO org.apache.flink.runtime.io.disk.FileChannelManagerImpl - FileChannelManager removed spill file directory /tmp/flink-io-dc85c177-459e-4a08-9a48-7ba8d99be570
[IOManagerAsync shutdown hook] INFO org.apache.flink.runtime.io.disk.FileChannelManagerImpl - FileChannelManager removed spill file directory /tmp/flink-io-0529ee1c-cf6c-4fa4-bf1c-84236cec34d3
[IOManagerAsync shutdown hook] INFO org.apache.flink.runtime.io.disk.FileChannelManagerImpl - FileChannelManager removed spill file directory /tmp/flink-io-4e5706c3-fd25-4347-8e60-9cb8aec658b8
[IOManagerAsync shutdown hook] INFO org.apache.flink.runtime.io.disk.FileChannelManagerImpl - FileChannelManager removed spill file directory /tmp/flink-io-ad6de8c6-1eed-48a7-b945-1bae66b1d2ed
[IOManagerAsync shutdown hook] INFO org.apache.flink.runtime.io.disk.FileChannelManagerImpl - FileChannelManager removed spill file directory /tmp/flink-io-f55abe8a-71f4-486c-b745-62d442e33a23
[IOManagerAsync shutdown hook] INFO org.apache.flink.runtime.io.disk.FileChannelManagerImpl - FileChannelManager removed spill file directory /tmp/flink-io-21b0059a-45f4-4bcc-b90a-c1e51c4cbdf4
[IOManagerAsync shutdown hook] INFO org.apache.flink.runtime.io.disk.FileChannelManagerImpl - FileChannelManager removed spill file directory /tmp/flink-io-cf27f7d1-d363-4787-8dc5-a93fc912f8e7
[FileChannelManagerImpl-io shutdown hook] INFO org.apache.flink.runtime.io.disk.FileChannelManagerImpl - FileChannelManager removed spill file directory /tmp/flink-io-93849399-b4f0-44d1-8f89-583c46f3b234
[IOManagerAsync shutdown hook] INFO org.apache.flink.runtime.io.disk.FileChannelManagerImpl - FileChannelManager removed spill file directory /tmp/flink-io-f64b4c58-7495-4444-903c-6030a713cad4
[IOManagerAsync shutdown hook] INFO org.apache.flink.runtime.io.disk.FileChannelManagerImpl - FileChannelManager removed spill file directory /tmp/flink-io-b6400b02-5e69-45e8-9a37-6a0e6d03a446
[IOManagerAsync shutdown hook] INFO org.apache.flink.runtime.io.disk.FileChannelManagerImpl - FileChannelManager removed spill file directory /tmp/flink-io-ae5c37aa-24de-4b0b-a2e6-20e3952461a4
[IOManagerAsync shutdown hook] INFO org.apache.flink.runtime.io.disk.FileChannelManagerImpl - FileChannelManager removed spill file directory /tmp/flink-io-02cdcbd1-5454-4687-9eed-ab19a16386bf
[IOManagerAsync shutdown hook] INFO org.apache.flink.runtime.io.disk.FileChannelManagerImpl - FileChannelManager removed spill file directory /tmp/flink-io-5bf9b3ab-4292-4c80-8817-7e03292705cc
[IOManagerAsync shutdown hook] INFO org.apache.flink.runtime.io.disk.FileChannelManagerImpl - FileChannelManager removed spill file directory /tmp/flink-io-5c053424-a25d-4fcc-bd6e-7b7ae029d3e0
[IOManagerAsync shutdown hook] INFO org.apache.flink.runtime.io.disk.FileChannelManagerImpl - FileChannelManager removed spill file directory /tmp/flink-io-4a451e60-d6b7-447d-b802-3a8e3e9c4269
[IOManagerAsync shutdown hook] INFO org.apache.flink.runtime.io.disk.FileChannelManagerImpl - FileChannelManager removed spill file directory /tmp/flink-io-cfb81106-9514-406e-b651-23a69ad126ab
[FileChannelManagerImpl-io shutdown hook] INFO org.apache.flink.runtime.io.disk.FileChannelManagerImpl - FileChannelManager removed spill file directory /tmp/flink-io-77dfe48f-240c-4b70-9151-4c79f78c947d
[FileChannelManagerImpl-io shutdown hook] INFO org.apache.flink.runtime.io.disk.FileChannelManagerImpl - FileChannelManager removed spill file directory /tmp/flink-io-e4a77395-9990-438d-ab1f-79303b50e732
[FileChannelManagerImpl-io shutdown hook] INFO org.apache.flink.runtime.io.disk.FileChannelManagerImpl - FileChannelManager removed spill file directory /tmp/flink-io-42854817-0bb0-414f-b169-0b87ab127b24
[FileChannelManagerImpl-io shutdown hook] INFO org.apache.flink.runtime.io.disk.FileChannelManagerImpl - FileChannelManager removed spill file directory /tmp/flink-io-b3cf0d20-43fb-4ffa-a19c-fabe0aeef236
[FileChannelManagerImpl-io shutdown hook] INFO org.apache.flink.runtime.io.disk.FileChannelManagerImpl - FileChannelManager removed spill file directory /tmp/flink-io-0f40773c-a744-4e24-b73a-95339d74d6da
[FileChannelManagerImpl-io shutdown hook] INFO org.apache.flink.runtime.io.disk.FileChannelManagerImpl - FileChannelManager removed spill file directory /tmp/flink-io-04d61010-e4e2-43ad-98a8-ea77290582e4
[FileChannelManagerImpl-io shutdown hook] INFO org.apache.flink.runtime.io.disk.FileChannelManagerImpl - FileChannelManager removed spill file directory /tmp/flink-io-cce297d8-9ea3-41ee-9168-2351812e20ee
[FileChannelManagerImpl-io shutdown hook] INFO org.apache.flink.runtime.io.disk.FileChannelManagerImpl - FileChannelManager removed spill file directory /tmp/flink-io-4f18a9be-7b0d-4af5-97cc-4c021fb99f3b
[IOManagerAsync shutdown hook] INFO org.apache.flink.runtime.io.disk.FileChannelManagerImpl - FileChannelManager removed spill file directory /tmp/flink-io-30e7db06-4b4f-44be-813d-fc9cef356033
[IOManagerAsync shutdown hook] INFO org.apache.flink.runtime.io.disk.FileChannelManagerImpl - FileChannelManager removed spill file directory /tmp/flink-io-a955311b-984b-420d-8c84-0c827fa1f9ef
[IOManagerAsync shutdown hook] INFO org.apache.flink.runtime.io.disk.FileChannelManagerImpl - FileChannelManager removed spill file directory /tmp/flink-io-abec8268-023b-4358-b8a5-50877eadaa32
[FileChannelManagerImpl-io shutdown hook] INFO org.apache.flink.runtime.io.disk.FileChannelManagerImpl - FileChannelManager removed spill file directory /tmp/flink-io-071af0c2-c54d-40aa-aefd-e4e1ba47df17
[FileChannelManagerImpl-io shutdown hook] INFO org.apache.flink.runtime.io.disk.FileChannelManagerImpl - FileChannelManager removed spill file directory /tmp/flink-io-4cd567dd-a614-446a-82d5-fac9859db1d5
[FileChannelManagerImpl-io shutdown hook] INFO org.apache.flink.runtime.io.disk.FileChannelManagerImpl - FileChannelManager removed spill file directory /tmp/flink-io-99eab94c-3939-4ce6-9a81-85ff5e4fce10
[FileChannelManagerImpl-io shutdown hook] INFO org.apache.flink.runtime.io.disk.FileChannelManagerImpl - FileChannelManager removed spill file directory /tmp/flink-io-484bbb55-7aa5-4752-89e4-97479a647b6c
[FileChannelManagerImpl-io shutdown hook] INFO org.apache.flink.runtime.io.disk.FileChannelManagerImpl - FileChannelManager removed spill file directory /tmp/flink-io-9bc5d72c-57ba-43d9-a830-ff6a975c2ddd
[IOManagerAsync shutdown hook] INFO org.apache.flink.runtime.io.disk.FileChannelManagerImpl - FileChannelManager removed spill file directory /tmp/flink-io-2f12b41f-92a3-4d92-8472-ccd07e568016
[IOManagerAsync shutdown hook] INFO org.apache.flink.runtime.io.disk.FileChannelManagerImpl - FileChannelManager removed spill file directory /tmp/flink-io-aa310d45-a635-41e3-88ea-85d0954417b9
[IOManagerAsync shutdown hook] INFO org.apache.flink.runtime.io.disk.FileChannelManagerImpl - FileChannelManager removed spill file directory /tmp/flink-io-5b488f38-e495-48cb-bafb-ee759daefde4
[IOManagerAsync shutdown hook] INFO org.apache.flink.runtime.io.disk.FileChannelManagerImpl - FileChannelManager removed spill file directory /tmp/flink-io-8bcda276-cdd4-4890-8dbf-c5be7e1be5d1
[IOManagerAsync shutdown hook] INFO org.apache.flink.runtime.io.disk.FileChannelManagerImpl - FileChannelManager removed spill file directory /tmp/flink-io-ef2677c4-9405-4508-a348-492a91e919b0
[IOManagerAsync shutdown hook] INFO org.apache.flink.runtime.io.disk.FileChannelManagerImpl - FileChannelManager removed spill file directory /tmp/flink-io-b278af96-4203-4d2b-b6e9-d1c41d511a71
[IOManagerAsync shutdown hook] INFO org.apache.flink.runtime.io.disk.FileChannelManagerImpl - FileChannelManager removed spill file directory /tmp/flink-io-84bf3134-c27d-45c2-a127-0bf85ff0e5fa
[IOManagerAsync shutdown hook] INFO org.apache.flink.runtime.io.disk.FileChannelManagerImpl - FileChannelManager removed spill file directory /tmp/flink-io-5808d8cb-2fcf-4388-92f9-8155c5d02705
[IOManagerAsync shutdown hook] INFO org.apache.flink.runtime.io.disk.FileChannelManagerImpl - FileChannelManager removed spill file directory /tmp/flink-io-667d66b7-9027-407a-b84e-f4930105b76d
[IOManagerAsync shutdown hook] INFO org.apache.flink.runtime.io.disk.FileChannelManagerImpl - FileChannelManager removed spill file directory /tmp/flink-io-98aeb836-7fd1-4f10-8faa-a7bff01946d2
[FileChannelManagerImpl-io shutdown hook] INFO org.apache.flink.runtime.io.disk.FileChannelManagerImpl - FileChannelManager removed spill file directory /tmp/flink-io-7f0d6e23-ed0a-470b-a76b-e670f86cca75
[FileChannelManagerImpl-io shutdown hook] INFO org.apache.flink.runtime.io.disk.FileChannelManagerImpl - FileChannelManager removed spill file directory /tmp/flink-io-886aada6-0759-4138-bece-39715aa991f6
[FileChannelManagerImpl-io shutdown hook] INFO org.apache.flink.runtime.io.disk.FileChannelManagerImpl - FileChannelManager removed spill file directory /tmp/flink-io-ef93bed1-1066-4e99-bd18-2c1ce7e1c72b
[FileChannelManagerImpl-io shutdown hook] INFO org.apache.flink.runtime.io.disk.FileChannelManagerImpl - FileChannelManager removed spill file directory /tmp/flink-io-5c031355-ccc8-4cd7-be9d-a8f454be1eb8
[FileChannelManagerImpl-io shutdown hook] INFO org.apache.flink.runtime.io.disk.FileChannelManagerImpl - FileChannelManager removed spill file directory /tmp/flink-io-788b17ef-71ad-4f70-93aa-f03bae07948f
[IOManagerAsync shutdown hook] INFO org.apache.flink.runtime.io.disk.FileChannelManagerImpl - FileChannelManager removed spill file directory /tmp/flink-io-8df08d11-1b7e-4fda-b3eb-089d9744fccd
[FileChannelManagerImpl-io shutdown hook] INFO org.apache.flink.runtime.io.disk.FileChannelManagerImpl - FileChannelManager removed spill file directory /tmp/flink-io-2334623a-d871-4113-80d9-d2aa86d15f3e
[FileChannelManagerImpl-io shutdown hook] INFO org.apache.flink.runtime.io.disk.FileChannelManagerImpl - FileChannelManager removed spill file directory /tmp/flink-io-2db08b58-96ab-4ef4-9996-c8a0f2f08308
[FileChannelManagerImpl-io shutdown hook] INFO org.apache.flink.runtime.io.disk.FileChannelManagerImpl - FileChannelManager removed spill file directory /tmp/flink-io-0ea13b92-761a-4def-85a7-d4729d56bb15
[FileChannelManagerImpl-io shutdown hook] INFO org.apache.flink.runtime.io.disk.FileChannelManagerImpl - FileChannelManager removed spill file directory /tmp/flink-io-f7eb3f2a-4f29-4d43-86a2-ff84a98a851c
[FileChannelManagerImpl-io shutdown hook] INFO org.apache.flink.runtime.io.disk.FileChannelManagerImpl - FileChannelManager removed spill file directory /tmp/flink-io-4c720abd-e9d3-4484-b438-c46cdfe24803
[FileChannelManagerImpl-io shutdown hook] INFO org.apache.flink.runtime.io.disk.FileChannelManagerImpl - FileChannelManager removed spill file directory /tmp/flink-io-2fe4b434-f7fc-4119-94fb-6a573e77234d
[FileChannelManagerImpl-io shutdown hook] INFO org.apache.flink.runtime.io.disk.FileChannelManagerImpl - FileChannelManager removed spill file directory /tmp/flink-io-2ff643cf-dc9e-44b3-a478-82a00dee0c60
[IOManagerAsync shutdown hook] INFO org.apache.flink.runtime.io.disk.FileChannelManagerImpl - FileChannelManager removed spill file directory /tmp/flink-io-697d9eba-a4fe-4538-b077-05e69c410ff0
[IOManagerAsync shutdown hook] INFO org.apache.flink.runtime.io.disk.FileChannelManagerImpl - FileChannelManager removed spill file directory /tmp/flink-io-66a857f1-28c5-4542-b52a-94d5a3d08730
[FileChannelManagerImpl-io shutdown hook] INFO org.apache.flink.runtime.io.disk.FileChannelManagerImpl - FileChannelManager removed spill file directory /tmp/flink-io-0fc2d0fd-c9e6-4f6c-abc9-17ea06d068e1
[FileChannelManagerImpl-io shutdown hook] INFO org.apache.flink.runtime.io.disk.FileChannelManagerImpl - FileChannelManager removed spill file directory /tmp/flink-io-acbb942f-1220-4491-a0a7-9e29d6deecea
[FileChannelManagerImpl-io shutdown hook] INFO org.apache.flink.runtime.io.disk.FileChannelManagerImpl - FileChannelManager removed spill file directory /tmp/flink-io-47b03717-fe06-4e31-82b2-bad7a658c1aa
[FileChannelManagerImpl-io shutdown hook] INFO org.apache.flink.runtime.io.disk.FileChannelManagerImpl - FileChannelManager removed spill file directory /tmp/flink-io-879ec437-9c71-4bbc-9a96-66f98bc54d1c
[IOManagerAsync shutdown hook] INFO org.apache.flink.runtime.io.disk.FileChannelManagerImpl - FileChannelManager removed spill file directory /tmp/flink-io-a5c061e1-b718-45ed-8fd3-dceb1e525902
[IOManagerAsync shutdown hook] INFO org.apache.flink.runtime.io.disk.FileChannelManagerImpl - FileChannelManager removed spill file directory /tmp/flink-io-361ad166-dca7-4619-aaea-d52313cc120b
[IOManagerAsync shutdown hook] INFO org.apache.flink.runtime.io.disk.FileChannelManagerImpl - FileChannelManager removed spill file directory /tmp/flink-io-c303f65f-feca-4dc1-8008-fb4eaa302a60
[IOManagerAsync shutdown hook] INFO org.apache.flink.runtime.io.disk.FileChannelManagerImpl - FileChannelManager removed spill file directory /tmp/flink-io-d7623324-fa7e-477d-8dd5-223a5fb40fbe
[FileChannelManagerImpl-io shutdown hook] INFO org.apache.flink.runtime.io.disk.FileChannelManagerImpl - FileChannelManager removed spill file directory /tmp/flink-io-f0c2fab5-ede8-453c-837c-579a3d4a8424
[FileChannelManagerImpl-io shutdown hook] INFO org.apache.flink.runtime.io.disk.FileChannelManagerImpl - FileChannelManager removed spill file directory /tmp/flink-io-e4a70ceb-27a5-4dc3-b50a-6f9f0509da79
[FileChannelManagerImpl-io shutdown hook] INFO org.apache.flink.runtime.io.disk.FileChannelManagerImpl - FileChannelManager removed spill file directory /tmp/flink-io-b94c8e1a-180e-4d03-a43a-d05f170efc14
[IOManagerAsync shutdown hook] INFO org.apache.flink.runtime.io.disk.FileChannelManagerImpl - FileChannelManager removed spill file directory /tmp/flink-io-8fb818b9-8dce-4780-9ab3-b14b1d8adb45
[IOManagerAsync shutdown hook] INFO org.apache.flink.runtime.io.disk.FileChannelManagerImpl - FileChannelManager removed spill file directory /tmp/flink-io-3641afd7-2cfe-45ea-9e7b-e1b1b2d46c34
[FileChannelManagerImpl-io shutdown hook] INFO org.apache.flink.runtime.io.disk.FileChannelManagerImpl - FileChannelManager removed spill file directory /tmp/flink-io-4c6aefe0-8aaa-43e0-ac2f-6718e1a5b4a3
[IOManagerAsync shutdown hook] INFO org.apache.flink.runtime.io.disk.FileChannelManagerImpl - FileChannelManager removed spill file directory /tmp/flink-io-87641a7c-d937-4a0c-8c9b-5664d8acf256
[IOManagerAsync shutdown hook] INFO org.apache.flink.runtime.io.disk.FileChannelManagerImpl - FileChannelManager removed spill file directory /tmp/flink-io-2b70aa03-1f4c-4bb3-8815-059df36fa1f5
[IOManagerAsync shutdown hook] INFO org.apache.flink.runtime.io.disk.FileChannelManagerImpl - FileChannelManager removed spill file directory /tmp/flink-io-1881bb90-5c7e-489d-99b7-8085c6ab1cde
[IOManagerAsync shutdown hook] INFO org.apache.flink.runtime.io.disk.FileChannelManagerImpl - FileChannelManager removed spill file directory /tmp/flink-io-d7201ead-e07f-47cd-82d8-75e21ba54bd2
[IOManagerAsync shutdown hook] INFO org.apache.flink.runtime.io.disk.FileChannelManagerImpl - FileChannelManager removed spill file directory /tmp/flink-io-dee4ff24-637a-4cf4-976b-a83aa98f1d80
[FileChannelManagerImpl-io shutdown hook] INFO org.apache.flink.runtime.io.disk.FileChannelManagerImpl - FileChannelManager removed spill file directory /tmp/flink-io-dc329b27-89ba-4fdb-83f2-1f35513f9cb3
[FileChannelManagerImpl-io shutdown hook] INFO org.apache.flink.runtime.io.disk.FileChannelManagerImpl - FileChannelManager removed spill file directory /tmp/flink-io-10120938-fc8f-48fc-90ed-a1ae66a997c4
[FileChannelManagerImpl-io shutdown hook] INFO org.apache.flink.runtime.io.disk.FileChannelManagerImpl - FileChannelManager removed spill file directory /tmp/flink-io-ed921780-24c0-4d7e-a6ad-4bc056e58372
[FileChannelManagerImpl-io shutdown hook] INFO org.apache.flink.runtime.io.disk.FileChannelManagerImpl - FileChannelManager removed spill file directory /tmp/flink-io-02b79667-24d6-4e78-bfd4-42970e5204cb
[FileChannelManagerImpl-io shutdown hook] INFO org.apache.flink.runtime.io.disk.FileChannelManagerImpl - FileChannelManager removed spill file directory /tmp/flink-io-4834910d-ff32-4ecd-a7b5-408a6269a116
[FileChannelManagerImpl-io shutdown hook] INFO org.apache.flink.runtime.io.disk.FileChannelManagerImpl - FileChannelManager removed spill file directory /tmp/flink-io-0f0040ff-d139-429a-a46b-84231562bde0
[FileChannelManagerImpl-io shutdown hook] INFO org.apache.flink.runtime.io.disk.FileChannelManagerImpl - FileChannelManager removed spill file directory /tmp/flink-io-2e4f30ea-a989-43e8-9d69-48eff7d47ecc
[FileChannelManagerImpl-io shutdown hook] INFO org.apache.flink.runtime.io.disk.FileChannelManagerImpl - FileChannelManager removed spill file directory /tmp/flink-io-ef93bc58-d721-4604-bb4a-bf443f563509
[FileChannelManagerImpl-io shutdown hook] INFO org.apache.flink.runtime.io.disk.FileChannelManagerImpl - FileChannelManager removed spill file directory /tmp/flink-io-93f4ae24-1fc6-429b-9b5c-774a328afda0
[FileChannelManagerImpl-io shutdown hook] INFO org.apache.flink.runtime.io.disk.FileChannelManagerImpl - FileChannelManager removed spill file directory /tmp/flink-io-e4ce779b-1f4f-49bd-921f-b7f4d8e22935
[IOManagerAsync shutdown hook] INFO org.apache.flink.runtime.io.disk.FileChannelManagerImpl - FileChannelManager removed spill file directory /tmp/flink-io-09404afd-257e-4eef-a52f-911581c49d72
[IOManagerAsync shutdown hook] INFO org.apache.flink.runtime.io.disk.FileChannelManagerImpl - FileChannelManager removed spill file directory /tmp/flink-io-08fc19df-949e-47e2-b890-65458db2bd9c
[FileChannelManagerImpl-io shutdown hook] INFO org.apache.flink.runtime.io.disk.FileChannelManagerImpl - FileChannelManager removed spill file directory /tmp/flink-io-e0635ceb-af64-47c0-92c1-4e542e527df5
[FileChannelManagerImpl-io shutdown hook] INFO org.apache.flink.runtime.io.disk.FileChannelManagerImpl - FileChannelManager removed spill file directory /tmp/flink-io-29421013-bb00-485e-9c64-f1f840e99e0a
[FileChannelManagerImpl-io shutdown hook] INFO org.apache.flink.runtime.io.disk.FileChannelManagerImpl - FileChannelManager removed spill file directory /tmp/flink-io-4915a05d-535a-494f-9117-b2ce29681f6b
[FileChannelManagerImpl-io shutdown hook] INFO org.apache.flink.runtime.io.disk.FileChannelManagerImpl - FileChannelManager removed spill file directory /tmp/flink-io-7a5ca494-a21b-4459-893d-3c00c9f985f4
[FileChannelManagerImpl-io shutdown hook] INFO org.apache.flink.runtime.io.disk.FileChannelManagerImpl - FileChannelManager removed spill file directory /tmp/flink-io-82e56479-b4f3-432f-a63a-82fd72977c48
[FileChannelManagerImpl-io shutdown hook] INFO org.apache.flink.runtime.io.disk.FileChannelManagerImpl - FileChannelManager removed spill file directory /tmp/flink-io-b9970557-9937-423a-9b21-bcd584979129
[FileChannelManagerImpl-io shutdown hook] INFO org.apache.flink.runtime.io.disk.FileChannelManagerImpl - FileChannelManager removed spill file directory /tmp/flink-io-c37f8e4d-01a2-4624-9dbc-fdab23d669b8
[FileChannelManagerImpl-io shutdown hook] INFO org.apache.flink.runtime.io.disk.FileChannelManagerImpl - FileChannelManager removed spill file directory /tmp/flink-io-2b82180e-f8c6-4a0b-af05-be279ea6fc34
[FileChannelManagerImpl-io shutdown hook] INFO org.apache.flink.runtime.io.disk.FileChannelManagerImpl - FileChannelManager removed spill file directory /tmp/flink-io-48a1ad7c-5088-4184-bd3b-22f3b74e5df9
[FileChannelManagerImpl-io shutdown hook] INFO org.apache.flink.runtime.io.disk.FileChannelManagerImpl - FileChannelManager removed spill file directory /tmp/flink-io-cae7a038-58ea-4204-88dc-7cf0a9f616b7
[IOManagerAsync shutdown hook] INFO org.apache.flink.runtime.io.disk.FileChannelManagerImpl - FileChannelManager removed spill file directory /tmp/flink-io-9e2c0af8-b018-4404-b217-53e26d1db074
[FileChannelManagerImpl-io shutdown hook] INFO org.apache.flink.runtime.io.disk.FileChannelManagerImpl - FileChannelManager removed spill file directory /tmp/flink-io-0b95ff89-aa80-4b17-9fad-4bdfac36ad94
[FileChannelManagerImpl-io shutdown hook] INFO org.apache.flink.runtime.io.disk.FileChannelManagerImpl - FileChannelManager removed spill file directory /tmp/flink-io-13371b79-3f08-4842-b16d-844247cc4990
[FileChannelManagerImpl-io shutdown hook] INFO org.apache.flink.runtime.io.disk.FileChannelManagerImpl - FileChannelManager removed spill file directory /tmp/flink-io-31493bd3-0373-42ab-a70f-262063af1251
[IOManagerAsync shutdown hook] INFO org.apache.flink.runtime.io.disk.FileChannelManagerImpl - FileChannelManager removed spill file directory /tmp/flink-io-a061236b-9879-4b91-81d1-6cb53737f7b3
[IOManagerAsync shutdown hook] INFO org.apache.flink.runtime.io.disk.FileChannelManagerImpl - FileChannelManager removed spill file directory /tmp/flink-io-3b8196e8-a7c1-498e-abac-2f249ea04815
[FileChannelManagerImpl-io shutdown hook] INFO org.apache.flink.runtime.io.disk.FileChannelManagerImpl - FileChannelManager removed spill file directory /tmp/flink-io-e497d0e2-c9b3-422e-9f43-cd3ba6170722
[FileChannelManagerImpl-io shutdown hook] INFO org.apache.flink.runtime.io.disk.FileChannelManagerImpl - FileChannelManager removed spill file directory /tmp/flink-io-ad57d671-2d74-4776-b924-d742f55062de
[FileChannelManagerImpl-io shutdown hook] INFO org.apache.flink.runtime.io.disk.FileChannelManagerImpl - FileChannelManager removed spill file directory /tmp/flink-io-5ac99c39-dfc1-4ab4-8c0d-7e8fa251d56c
> Task :runners:flink:1.14:check
> Task :runners:flink:1.14:build
> Task :runners:flink:1.14:buildDependents
> Task :runners:samza:job-server:startShadowScripts
> Task :runners:samza:job-server:shadowDistTar
> Task :runners:samza:job-server:shadowDistZip
> Task :runners:samza:job-server:assemble
> Task :runners:samza:job-server:analyzeClassesDependencies
> Task :runners:samza:job-server:analyzeTestClassesDependencies SKIPPED
> Task :runners:samza:job-server:analyzeDependencies
> Task :runners:samza:job-server:checkstyleMain NO-SOURCE
> Task :runners:samza:job-server:checkstyleTest NO-SOURCE
> Task :runners:samza:job-server:javadoc NO-SOURCE
> Task :runners:samza:job-server:spotbugsMain NO-SOURCE
> Task :runners:samza:job-server:spotbugsTest SKIPPED
> Task :runners:samza:job-server:test NO-SOURCE
> Task :runners:samza:job-server:check
> Task :runners:samza:job-server:build
> Task :runners:samza:job-server:buildDependents
> Task :runners:samza:buildDependents
> Task :runners:java-job-service:buildDependents
> Task :sdks:java:testing:nexmark:check
> Task :sdks:java:testing:nexmark:build
> Task :sdks:java:testing:nexmark:buildDependents
> Task :sdks:java:extensions:sql:zetasql:buildDependents
> Task :sdks:java:extensions:sql:buildDependents
> Task :sdks:java:extensions:join-library:buildDependents
> Task :sdks:java:io:kafka:buildDependents
> Task :sdks:java:io:mongodb:buildDependents
> Task :sdks:java:io:parquet:buildDependents
> Task :sdks:java:io:synthetic:buildDependents
> Task :sdks:java:io:thrift:buildDependents
> Task :sdks:java:io:hadoop-common:buildDependents
FAILURE: Build failed with an exception.
* What went wrong:
Execution failed for task ':sdks:java:io:google-cloud-platform:test'.
> There were failing tests. See the report at: file://<https://ci-beam.apache.org/job/beam_PreCommit_Java_Cron/ws/src/sdks/java/io/google-cloud-platform/build/reports/tests/test/index.html>
* Try:
> Run with --stacktrace option to get the stack trace.
> Run with --info or --debug option to get more log output.
> Run with --scan to get full insights.
* Get more help at https://help.gradle.org
Deprecated Gradle features were used in this build, making it incompatible with Gradle 8.0.
You can use '--warning-mode all' to show the individual deprecation warnings and determine if they come from your own scripts or plugins.
See https://docs.gradle.org/7.3.2/userguide/command_line_interface.html#sec:command_line_warnings
Execution optimizations have been disabled for 1 invalid unit(s) of work during this build to ensure correctness.
Please consult deprecation warnings for more details.
BUILD FAILED in 47m 20s
1264 actionable tasks: 986 executed, 276 from cache, 2 up-to-date
Publishing build scan...
https://gradle.com/s/xl4ow6jkrncxo
Build step 'Invoke Gradle script' changed build result to FAILURE
Build step 'Invoke Gradle script' marked build as failure
---------------------------------------------------------------------
To unsubscribe, e-mail: builds-unsubscribe@beam.apache.org
For additional commands, e-mail: builds-help@beam.apache.org
beam_PreCommit_Java_Cron - Build # 5153 - Aborted!
Posted by Apache Jenkins Server <je...@builds.apache.org>.
beam_PreCommit_Java_Cron - Build # 5153 - Aborted:
Check console output at https://ci-beam.apache.org/job/beam_PreCommit_Java_Cron/5153/ to view the results.
Build failed in Jenkins: beam_PreCommit_Java_Cron #5152
Posted by Apache Jenkins Server <je...@builds.apache.org>.
See <https://ci-beam.apache.org/job/beam_PreCommit_Java_Cron/5152/display/redirect>
Changes:
------------------------------------------
[...truncated 2.69 MB...]
INFO: Opening writer 3a5a155e-2b80-43dc-b017-9f072ea0dfce for window org.apache.beam.sdk.transforms.windowing.GlobalWindow@7c8f8206 pane PaneInfo.NO_FIRING destination null
Feb 28, 2022 6:20:29 AM org.apache.beam.sdk.io.FileBasedSink$Writer close
INFO: Successfully wrote temporary file /tmp/junit9103712029810309664/.temp-beam-d1e394ee-d2ee-4eb1-a406-eb5f4e0b498e/9b412c1dec6b708f-85aa-48ae-aec5-aad34552799a
Feb 28, 2022 6:20:29 AM org.apache.beam.sdk.io.FileBasedSink$Writer close
INFO: Successfully wrote temporary file /tmp/junit9103712029810309664/.temp-beam-d1e394ee-d2ee-4eb1-a406-eb5f4e0b498e/fe0d794cdaf762da-6121-42aa-b305-d0da2a78fcef
Feb 28, 2022 6:20:29 AM org.apache.beam.sdk.io.FileBasedSink$Writer close
INFO: Successfully wrote temporary file /tmp/junit9103712029810309664/.temp-beam-d1e394ee-d2ee-4eb1-a406-eb5f4e0b498e/7bd7464a3a5a155e-2b80-43dc-b017-9f072ea0dfce
Feb 28, 2022 6:20:29 AM org.apache.beam.sdk.io.WriteFiles$WriteUnshardedTempFilesFn processElement
INFO: Opening writer 3a42db25-a1aa-4531-bb62-eba68ae61275 for window org.apache.beam.sdk.transforms.windowing.GlobalWindow@7c8f8206 pane PaneInfo.NO_FIRING destination null
Feb 28, 2022 6:20:29 AM org.apache.beam.sdk.io.FileBasedSink$Writer close
INFO: Successfully wrote temporary file /tmp/junit9103712029810309664/.temp-beam-d1e394ee-d2ee-4eb1-a406-eb5f4e0b498e/ed01df85b32321e5-c95c-45c9-9778-40545ccb3fb7
Feb 28, 2022 6:20:29 AM org.apache.beam.sdk.io.WriteFiles$WriteUnshardedTempFilesFn processElement
INFO: Opening writer 3894d646-3df3-455d-b7a4-222865315010 for window org.apache.beam.sdk.transforms.windowing.GlobalWindow@7c8f8206 pane PaneInfo.NO_FIRING destination null
Feb 28, 2022 6:20:29 AM org.apache.beam.sdk.io.FileBasedSink$Writer close
INFO: Successfully wrote temporary file /tmp/junit9103712029810309664/.temp-beam-d1e394ee-d2ee-4eb1-a406-eb5f4e0b498e/979f52db3894d646-3df3-455d-b7a4-222865315010
Feb 28, 2022 6:20:29 AM org.apache.beam.sdk.io.WriteFiles$WriteUnshardedTempFilesFn processElement
INFO: Opening writer ffe8c7de-6e9a-4a92-a547-5fa5d8054141 for window org.apache.beam.sdk.transforms.windowing.GlobalWindow@7c8f8206 pane PaneInfo.NO_FIRING destination null
Feb 28, 2022 6:20:29 AM org.apache.beam.sdk.io.FileBasedSink$Writer close
INFO: Successfully wrote temporary file /tmp/junit9103712029810309664/.temp-beam-d1e394ee-d2ee-4eb1-a406-eb5f4e0b498e/ca976058ffe8c7de-6e9a-4a92-a547-5fa5d8054141
Feb 28, 2022 6:20:29 AM org.apache.beam.sdk.io.WriteFiles$WriteUnshardedTempFilesFn processElement
INFO: Opening writer 1ecbee6c-cf54-4bf2-8eab-aa62b3d1ad89 for window org.apache.beam.sdk.transforms.windowing.GlobalWindow@7c8f8206 pane PaneInfo.NO_FIRING destination null
Feb 28, 2022 6:20:29 AM org.apache.beam.sdk.io.FileBasedSink$Writer close
INFO: Successfully wrote temporary file /tmp/junit9103712029810309664/.temp-beam-d1e394ee-d2ee-4eb1-a406-eb5f4e0b498e/9bb545c81ecbee6c-cf54-4bf2-8eab-aa62b3d1ad89
Feb 28, 2022 6:20:29 AM org.apache.beam.sdk.io.WriteFiles$WriteUnshardedTempFilesFn processElement
INFO: Opening writer 2fa5e771-fe3e-43cf-9a1a-02ea907f07f7 for window org.apache.beam.sdk.transforms.windowing.GlobalWindow@7c8f8206 pane PaneInfo.NO_FIRING destination null
Feb 28, 2022 6:20:29 AM org.apache.beam.sdk.io.FileBasedSink$Writer close
INFO: Successfully wrote temporary file /tmp/junit9103712029810309664/.temp-beam-d1e394ee-d2ee-4eb1-a406-eb5f4e0b498e/6f3cf8292fa5e771-fe3e-43cf-9a1a-02ea907f07f7
Feb 28, 2022 6:20:29 AM org.apache.beam.sdk.io.WriteFiles$WriteUnshardedTempFilesFn processElement
INFO: Opening writer 3a7796b0-be25-48aa-bb83-928f78d1d2ec for window org.apache.beam.sdk.transforms.windowing.GlobalWindow@7c8f8206 pane PaneInfo.NO_FIRING destination null
Feb 28, 2022 6:20:29 AM org.apache.beam.sdk.io.FileBasedSink$Writer close
INFO: Successfully wrote temporary file /tmp/junit9103712029810309664/.temp-beam-d1e394ee-d2ee-4eb1-a406-eb5f4e0b498e/14db3ebd3a7796b0-be25-48aa-bb83-928f78d1d2ec
Feb 28, 2022 6:20:29 AM org.apache.beam.sdk.io.WriteFiles$WriteUnshardedTempFilesFn processElement
INFO: Opening writer fc1bc09e-8340-447e-a209-3f51da5a22d0 for window org.apache.beam.sdk.transforms.windowing.GlobalWindow@7c8f8206 pane PaneInfo.NO_FIRING destination null
Feb 28, 2022 6:20:29 AM org.apache.beam.sdk.io.FileBasedSink$Writer close
INFO: Successfully wrote temporary file /tmp/junit9103712029810309664/.temp-beam-d1e394ee-d2ee-4eb1-a406-eb5f4e0b498e/37b34248fc1bc09e-8340-447e-a209-3f51da5a22d0
Feb 28, 2022 6:20:29 AM org.apache.beam.sdk.io.FileBasedSink$Writer close
INFO: Successfully wrote temporary file /tmp/junit9103712029810309664/.temp-beam-d1e394ee-d2ee-4eb1-a406-eb5f4e0b498e/92d51d4b3a42db25-a1aa-4531-bb62-eba68ae61275
Feb 28, 2022 6:20:29 AM org.apache.beam.sdk.io.WriteFiles$WriteUnshardedTempFilesFn processElement
INFO: Opening writer c0baad8f-2eab-45a1-8817-b4bc10d149e1 for window org.apache.beam.sdk.transforms.windowing.GlobalWindow@7c8f8206 pane PaneInfo.NO_FIRING destination null
Feb 28, 2022 6:20:29 AM org.apache.beam.sdk.io.FileBasedSink$Writer close
INFO: Successfully wrote temporary file /tmp/junit9103712029810309664/.temp-beam-d1e394ee-d2ee-4eb1-a406-eb5f4e0b498e/55a3bfe4c0baad8f-2eab-45a1-8817-b4bc10d149e1
Feb 28, 2022 6:20:29 AM org.apache.beam.sdk.io.WriteFiles$WriteUnshardedTempFilesFn processElement
INFO: Opening writer 9861e9e3-5536-48ff-9132-8448b3fa994c for window org.apache.beam.sdk.transforms.windowing.GlobalWindow@7c8f8206 pane PaneInfo.NO_FIRING destination null
Feb 28, 2022 6:20:29 AM org.apache.beam.sdk.io.WriteFiles$WriteUnshardedTempFilesFn processElement
INFO: Opening writer 21a2a16d-8ebe-47c7-acc5-a8acc9a38f4b for window org.apache.beam.sdk.transforms.windowing.GlobalWindow@7c8f8206 pane PaneInfo.NO_FIRING destination null
Feb 28, 2022 6:20:29 AM org.apache.beam.sdk.io.FileBasedSink$Writer close
INFO: Successfully wrote temporary file /tmp/junit9103712029810309664/.temp-beam-d1e394ee-d2ee-4eb1-a406-eb5f4e0b498e/415c4f9e21a2a16d-8ebe-47c7-acc5-a8acc9a38f4b
Feb 28, 2022 6:20:29 AM org.apache.beam.sdk.io.FileBasedSink$Writer close
INFO: Successfully wrote temporary file /tmp/junit9103712029810309664/.temp-beam-d1e394ee-d2ee-4eb1-a406-eb5f4e0b498e/4ac948e19861e9e3-5536-48ff-9132-8448b3fa994c
Feb 28, 2022 6:20:29 AM org.apache.beam.sdk.io.WriteFiles$WriteUnshardedTempFilesFn processElement
INFO: Opening writer b5ac5440-7a90-4004-b1d4-73a132b9de0d for window org.apache.beam.sdk.transforms.windowing.GlobalWindow@7c8f8206 pane PaneInfo.NO_FIRING destination null
Feb 28, 2022 6:20:29 AM org.apache.beam.sdk.io.FileBasedSink$Writer close
INFO: Successfully wrote temporary file /tmp/junit9103712029810309664/.temp-beam-d1e394ee-d2ee-4eb1-a406-eb5f4e0b498e/5f58d707b5ac5440-7a90-4004-b1d4-73a132b9de0d
Feb 28, 2022 6:20:29 AM org.apache.beam.sdk.io.WriteFiles$WriteUnshardedTempFilesFn processElement
INFO: Opening writer d8919f6b-c92c-4d39-89fc-233856bc7f63 for window org.apache.beam.sdk.transforms.windowing.GlobalWindow@7c8f8206 pane PaneInfo.NO_FIRING destination null
Feb 28, 2022 6:20:29 AM org.apache.beam.sdk.io.FileBasedSink$Writer close
INFO: Successfully wrote temporary file /tmp/junit9103712029810309664/.temp-beam-d1e394ee-d2ee-4eb1-a406-eb5f4e0b498e/b9a1500ad8919f6b-c92c-4d39-89fc-233856bc7f63
Feb 28, 2022 6:20:29 AM org.apache.beam.sdk.io.WriteFiles$WriteUnshardedTempFilesFn processElement
INFO: Opening writer 8af64e20-3cf7-40f4-b5e3-3951ca364497 for window org.apache.beam.sdk.transforms.windowing.GlobalWindow@7c8f8206 pane PaneInfo.NO_FIRING destination null
Feb 28, 2022 6:20:29 AM org.apache.beam.sdk.io.WriteFiles$WriteUnshardedTempFilesFn processElement
INFO: Opening writer b56d8a21-0b10-479b-914d-dfb7262deefd for window org.apache.beam.sdk.transforms.windowing.GlobalWindow@7c8f8206 pane PaneInfo.NO_FIRING destination null
Feb 28, 2022 6:20:29 AM org.apache.beam.sdk.io.FileBasedSink$Writer close
INFO: Successfully wrote temporary file /tmp/junit9103712029810309664/.temp-beam-d1e394ee-d2ee-4eb1-a406-eb5f4e0b498e/df5016f18af64e20-3cf7-40f4-b5e3-3951ca364497
Feb 28, 2022 6:20:29 AM org.apache.beam.sdk.io.FileBasedSink$Writer close
INFO: Successfully wrote temporary file /tmp/junit9103712029810309664/.temp-beam-d1e394ee-d2ee-4eb1-a406-eb5f4e0b498e/ea020527b56d8a21-0b10-479b-914d-dfb7262deefd
Feb 28, 2022 6:20:29 AM org.apache.beam.sdk.io.WriteFiles$WriteUnshardedTempFilesFn processElement
INFO: Opening writer 5f93e15a-c2a3-456e-8ceb-dc294b4056af for window org.apache.beam.sdk.transforms.windowing.GlobalWindow@7c8f8206 pane PaneInfo.NO_FIRING destination null
Feb 28, 2022 6:20:29 AM org.apache.beam.sdk.io.FileBasedSink$Writer close
INFO: Successfully wrote temporary file /tmp/junit9103712029810309664/.temp-beam-d1e394ee-d2ee-4eb1-a406-eb5f4e0b498e/aaa5fa005f93e15a-c2a3-456e-8ceb-dc294b4056af
Feb 28, 2022 6:20:29 AM org.apache.beam.sdk.io.WriteFiles$WriteUnshardedTempFilesFn processElement
INFO: Opening writer 9ad6fdac-138c-42b5-99d5-fa68a1f783bf for window org.apache.beam.sdk.transforms.windowing.GlobalWindow@7c8f8206 pane PaneInfo.NO_FIRING destination null
Feb 28, 2022 6:20:29 AM org.apache.beam.sdk.io.FileBasedSink$Writer close
INFO: Successfully wrote temporary file /tmp/junit9103712029810309664/.temp-beam-d1e394ee-d2ee-4eb1-a406-eb5f4e0b498e/34607d0a9ad6fdac-138c-42b5-99d5-fa68a1f783bf
Feb 28, 2022 6:20:29 AM org.apache.beam.sdk.io.WriteFiles$WriteUnshardedTempFilesFn processElement
INFO: Opening writer 436f79ea-d1f0-46a6-b9b5-f70f3f3b2ba7 for window org.apache.beam.sdk.transforms.windowing.GlobalWindow@7c8f8206 pane PaneInfo.NO_FIRING destination null
Feb 28, 2022 6:20:29 AM org.apache.beam.sdk.io.FileBasedSink$Writer close
INFO: Successfully wrote temporary file /tmp/junit9103712029810309664/.temp-beam-d1e394ee-d2ee-4eb1-a406-eb5f4e0b498e/f26091d2436f79ea-d1f0-46a6-b9b5-f70f3f3b2ba7
Feb 28, 2022 6:20:29 AM org.apache.beam.sdk.io.WriteFiles$WriteUnshardedTempFilesFn processElement
INFO: Opening writer ad4248cc-0279-41e4-babb-22115efe0fdd for window org.apache.beam.sdk.transforms.windowing.GlobalWindow@7c8f8206 pane PaneInfo.NO_FIRING destination null
Feb 28, 2022 6:20:29 AM org.apache.beam.sdk.io.WriteFiles$WriteUnshardedTempFilesFn processElement
INFO: Opening writer 275bb5f1-24d8-4555-8a88-4070fd925302 for window org.apache.beam.sdk.transforms.windowing.GlobalWindow@7c8f8206 pane PaneInfo.NO_FIRING destination null
Feb 28, 2022 6:20:29 AM org.apache.beam.sdk.io.FileBasedSink$Writer close
INFO: Successfully wrote temporary file /tmp/junit9103712029810309664/.temp-beam-d1e394ee-d2ee-4eb1-a406-eb5f4e0b498e/11e22913ad4248cc-0279-41e4-babb-22115efe0fdd
Feb 28, 2022 6:20:29 AM org.apache.beam.sdk.io.FileBasedSink$Writer close
INFO: Successfully wrote temporary file /tmp/junit9103712029810309664/.temp-beam-d1e394ee-d2ee-4eb1-a406-eb5f4e0b498e/4f0cb0be275bb5f1-24d8-4555-8a88-4070fd925302
Feb 28, 2022 6:20:29 AM org.apache.beam.sdk.io.WriteFiles$WriteUnshardedTempFilesFn processElement
INFO: Opening writer 6c1e2137-2f76-44a3-b77c-d2a502152876 for window org.apache.beam.sdk.transforms.windowing.GlobalWindow@7c8f8206 pane PaneInfo.NO_FIRING destination null
Feb 28, 2022 6:20:29 AM org.apache.beam.sdk.io.WriteFiles$WriteUnshardedTempFilesFn processElement
INFO: Opening writer 1319806f-814c-49ae-93d3-cdeef9a19170 for window org.apache.beam.sdk.transforms.windowing.GlobalWindow@7c8f8206 pane PaneInfo.NO_FIRING destination null
Feb 28, 2022 6:20:29 AM org.apache.beam.sdk.io.FileBasedSink$Writer close
INFO: Successfully wrote temporary file /tmp/junit9103712029810309664/.temp-beam-d1e394ee-d2ee-4eb1-a406-eb5f4e0b498e/b3cd37af6c1e2137-2f76-44a3-b77c-d2a502152876
Feb 28, 2022 6:20:29 AM org.apache.beam.sdk.io.WriteFiles$WriteUnshardedTempFilesFn processElement
INFO: Opening writer 0b050039-f020-4132-928f-a5e01ad6ab7e for window org.apache.beam.sdk.transforms.windowing.GlobalWindow@7c8f8206 pane PaneInfo.NO_FIRING destination null
Feb 28, 2022 6:20:29 AM org.apache.beam.sdk.io.WriteFiles$WriteUnshardedTempFilesFn processElement
INFO: Opening writer ac5164f2-41da-447d-adb0-3dadb31e3db2 for window org.apache.beam.sdk.transforms.windowing.GlobalWindow@7c8f8206 pane PaneInfo.NO_FIRING destination null
Feb 28, 2022 6:20:29 AM org.apache.beam.sdk.io.FileBasedSink$Writer close
INFO: Successfully wrote temporary file /tmp/junit9103712029810309664/.temp-beam-d1e394ee-d2ee-4eb1-a406-eb5f4e0b498e/15459b44ac5164f2-41da-447d-adb0-3dadb31e3db2
Feb 28, 2022 6:20:29 AM org.apache.beam.sdk.io.FileBasedSink$Writer close
INFO: Successfully wrote temporary file /tmp/junit9103712029810309664/.temp-beam-d1e394ee-d2ee-4eb1-a406-eb5f4e0b498e/d178ccfa0b050039-f020-4132-928f-a5e01ad6ab7e
Feb 28, 2022 6:20:29 AM org.apache.beam.sdk.io.FileBasedSink$Writer close
INFO: Successfully wrote temporary file /tmp/junit9103712029810309664/.temp-beam-d1e394ee-d2ee-4eb1-a406-eb5f4e0b498e/b195ec5f1319806f-814c-49ae-93d3-cdeef9a19170
Feb 28, 2022 6:20:29 AM org.apache.beam.sdk.io.WriteFiles$FinalizeTempFileBundles$FinalizeFn process
INFO: Finalizing 33 file results
Feb 28, 2022 6:20:29 AM org.apache.beam.sdk.io.FileBasedSink$WriteOperation createMissingEmptyShards
INFO: Finalizing for destination null num shards 33.
Feb 28, 2022 6:20:29 AM org.apache.beam.sdk.io.FileBasedSink$WriteOperation moveToOutputFiles
INFO: Will copy temporary file FileResult{tempFilename=/tmp/junit9103712029810309664/.temp-beam-d1e394ee-d2ee-4eb1-a406-eb5f4e0b498e/3bce47813e49d53b-7172-461b-8943-b5d8f8dd2eee, shard=0, window=org.apache.beam.sdk.transforms.windowing.GlobalWindow@7c8f8206, paneInfo=PaneInfo.NO_FIRING} to final location /tmp/junit9103712029810309664/file.txt-00000-of-00033
Feb 28, 2022 6:20:29 AM org.apache.beam.sdk.io.FileBasedSink$WriteOperation moveToOutputFiles
INFO: Will copy temporary file FileResult{tempFilename=/tmp/junit9103712029810309664/.temp-beam-d1e394ee-d2ee-4eb1-a406-eb5f4e0b498e/34607d0a9ad6fdac-138c-42b5-99d5-fa68a1f783bf, shard=1, window=org.apache.beam.sdk.transforms.windowing.GlobalWindow@7c8f8206, paneInfo=PaneInfo.NO_FIRING} to final location /tmp/junit9103712029810309664/file.txt-00001-of-00033
Feb 28, 2022 6:20:29 AM org.apache.beam.sdk.io.FileBasedSink$WriteOperation moveToOutputFiles
INFO: Will copy temporary file FileResult{tempFilename=/tmp/junit9103712029810309664/.temp-beam-d1e394ee-d2ee-4eb1-a406-eb5f4e0b498e/aaa5fa005f93e15a-c2a3-456e-8ceb-dc294b4056af, shard=2, window=org.apache.beam.sdk.transforms.windowing.GlobalWindow@7c8f8206, paneInfo=PaneInfo.NO_FIRING} to final location /tmp/junit9103712029810309664/file.txt-00002-of-00033
Feb 28, 2022 6:20:29 AM org.apache.beam.sdk.io.FileBasedSink$WriteOperation moveToOutputFiles
INFO: Will copy temporary file FileResult{tempFilename=/tmp/junit9103712029810309664/.temp-beam-d1e394ee-d2ee-4eb1-a406-eb5f4e0b498e/ca976058ffe8c7de-6e9a-4a92-a547-5fa5d8054141, shard=3, window=org.apache.beam.sdk.transforms.windowing.GlobalWindow@7c8f8206, paneInfo=PaneInfo.NO_FIRING} to final location /tmp/junit9103712029810309664/file.txt-00003-of-00033
Feb 28, 2022 6:20:29 AM org.apache.beam.sdk.io.FileBasedSink$WriteOperation moveToOutputFiles
INFO: Will copy temporary file FileResult{tempFilename=/tmp/junit9103712029810309664/.temp-beam-d1e394ee-d2ee-4eb1-a406-eb5f4e0b498e/5f58d707b5ac5440-7a90-4004-b1d4-73a132b9de0d, shard=4, window=org.apache.beam.sdk.transforms.windowing.GlobalWindow@7c8f8206, paneInfo=PaneInfo.NO_FIRING} to final location /tmp/junit9103712029810309664/file.txt-00004-of-00033
Feb 28, 2022 6:20:29 AM org.apache.beam.sdk.io.FileBasedSink$WriteOperation moveToOutputFiles
INFO: Will copy temporary file FileResult{tempFilename=/tmp/junit9103712029810309664/.temp-beam-d1e394ee-d2ee-4eb1-a406-eb5f4e0b498e/b3cd37af6c1e2137-2f76-44a3-b77c-d2a502152876, shard=5, window=org.apache.beam.sdk.transforms.windowing.GlobalWindow@7c8f8206, paneInfo=PaneInfo.NO_FIRING} to final location /tmp/junit9103712029810309664/file.txt-00005-of-00033
Feb 28, 2022 6:20:29 AM org.apache.beam.sdk.io.FileBasedSink$WriteOperation moveToOutputFiles
INFO: Will copy temporary file FileResult{tempFilename=/tmp/junit9103712029810309664/.temp-beam-d1e394ee-d2ee-4eb1-a406-eb5f4e0b498e/55a3bfe4c0baad8f-2eab-45a1-8817-b4bc10d149e1, shard=6, window=org.apache.beam.sdk.transforms.windowing.GlobalWindow@7c8f8206, paneInfo=PaneInfo.NO_FIRING} to final location /tmp/junit9103712029810309664/file.txt-00006-of-00033
Feb 28, 2022 6:20:29 AM org.apache.beam.sdk.io.FileBasedSink$WriteOperation moveToOutputFiles
INFO: Will copy temporary file FileResult{tempFilename=/tmp/junit9103712029810309664/.temp-beam-d1e394ee-d2ee-4eb1-a406-eb5f4e0b498e/4ac948e19861e9e3-5536-48ff-9132-8448b3fa994c, shard=7, window=org.apache.beam.sdk.transforms.windowing.GlobalWindow@7c8f8206, paneInfo=PaneInfo.NO_FIRING} to final location /tmp/junit9103712029810309664/file.txt-00007-of-00033
Feb 28, 2022 6:20:29 AM org.apache.beam.sdk.io.FileBasedSink$WriteOperation moveToOutputFiles
INFO: Will copy temporary file FileResult{tempFilename=/tmp/junit9103712029810309664/.temp-beam-d1e394ee-d2ee-4eb1-a406-eb5f4e0b498e/979f52db3894d646-3df3-455d-b7a4-222865315010, shard=8, window=org.apache.beam.sdk.transforms.windowing.GlobalWindow@7c8f8206, paneInfo=PaneInfo.NO_FIRING} to final location /tmp/junit9103712029810309664/file.txt-00008-of-00033
Feb 28, 2022 6:20:29 AM org.apache.beam.sdk.io.FileBasedSink$WriteOperation moveToOutputFiles
INFO: Will copy temporary file FileResult{tempFilename=/tmp/junit9103712029810309664/.temp-beam-d1e394ee-d2ee-4eb1-a406-eb5f4e0b498e/73ee678b5da42dcc-3c55-44d5-b519-c967791978f5, shard=9, window=org.apache.beam.sdk.transforms.windowing.GlobalWindow@7c8f8206, paneInfo=PaneInfo.NO_FIRING} to final location /tmp/junit9103712029810309664/file.txt-00009-of-00033
Feb 28, 2022 6:20:29 AM org.apache.beam.sdk.io.FileBasedSink$WriteOperation moveToOutputFiles
INFO: Will copy temporary file FileResult{tempFilename=/tmp/junit9103712029810309664/.temp-beam-d1e394ee-d2ee-4eb1-a406-eb5f4e0b498e/ed01df85b32321e5-c95c-45c9-9778-40545ccb3fb7, shard=10, window=org.apache.beam.sdk.transforms.windowing.GlobalWindow@7c8f8206, paneInfo=PaneInfo.NO_FIRING} to final location /tmp/junit9103712029810309664/file.txt-00010-of-00033
Feb 28, 2022 6:20:29 AM org.apache.beam.sdk.io.FileBasedSink$WriteOperation moveToOutputFiles
INFO: Will copy temporary file FileResult{tempFilename=/tmp/junit9103712029810309664/.temp-beam-d1e394ee-d2ee-4eb1-a406-eb5f4e0b498e/415c4f9e21a2a16d-8ebe-47c7-acc5-a8acc9a38f4b, shard=11, window=org.apache.beam.sdk.transforms.windowing.GlobalWindow@7c8f8206, paneInfo=PaneInfo.NO_FIRING} to final location /tmp/junit9103712029810309664/file.txt-00011-of-00033
Feb 28, 2022 6:20:29 AM org.apache.beam.sdk.io.FileBasedSink$WriteOperation moveToOutputFiles
INFO: Will copy temporary file FileResult{tempFilename=/tmp/junit9103712029810309664/.temp-beam-d1e394ee-d2ee-4eb1-a406-eb5f4e0b498e/d178ccfa0b050039-f020-4132-928f-a5e01ad6ab7e, shard=12, window=org.apache.beam.sdk.transforms.windowing.GlobalWindow@7c8f8206, paneInfo=PaneInfo.NO_FIRING} to final location /tmp/junit9103712029810309664/file.txt-00012-of-00033
Feb 28, 2022 6:20:29 AM org.apache.beam.sdk.io.FileBasedSink$WriteOperation moveToOutputFiles
INFO: Will copy temporary file FileResult{tempFilename=/tmp/junit9103712029810309664/.temp-beam-d1e394ee-d2ee-4eb1-a406-eb5f4e0b498e/208e4b3b20c8a8b5-2ed2-4224-b14b-3ee3a3dce077, shard=13, window=org.apache.beam.sdk.transforms.windowing.GlobalWindow@7c8f8206, paneInfo=PaneInfo.NO_FIRING} to final location /tmp/junit9103712029810309664/file.txt-00013-of-00033
Feb 28, 2022 6:20:29 AM org.apache.beam.sdk.io.FileBasedSink$WriteOperation moveToOutputFiles
INFO: Will copy temporary file FileResult{tempFilename=/tmp/junit9103712029810309664/.temp-beam-d1e394ee-d2ee-4eb1-a406-eb5f4e0b498e/9bb545c81ecbee6c-cf54-4bf2-8eab-aa62b3d1ad89, shard=14, window=org.apache.beam.sdk.transforms.windowing.GlobalWindow@7c8f8206, paneInfo=PaneInfo.NO_FIRING} to final location /tmp/junit9103712029810309664/file.txt-00014-of-00033
Feb 28, 2022 6:20:29 AM org.apache.beam.sdk.io.FileBasedSink$WriteOperation moveToOutputFiles
INFO: Will copy temporary file FileResult{tempFilename=/tmp/junit9103712029810309664/.temp-beam-d1e394ee-d2ee-4eb1-a406-eb5f4e0b498e/9b412c1dec6b708f-85aa-48ae-aec5-aad34552799a, shard=15, window=org.apache.beam.sdk.transforms.windowing.GlobalWindow@7c8f8206, paneInfo=PaneInfo.NO_FIRING} to final location /tmp/junit9103712029810309664/file.txt-00015-of-00033
Feb 28, 2022 6:20:29 AM org.apache.beam.sdk.io.FileBasedSink$WriteOperation moveToOutputFiles
INFO: Will copy temporary file FileResult{tempFilename=/tmp/junit9103712029810309664/.temp-beam-d1e394ee-d2ee-4eb1-a406-eb5f4e0b498e/92d51d4b3a42db25-a1aa-4531-bb62-eba68ae61275, shard=16, window=org.apache.beam.sdk.transforms.windowing.GlobalWindow@7c8f8206, paneInfo=PaneInfo.NO_FIRING} to final location /tmp/junit9103712029810309664/file.txt-00016-of-00033
Feb 28, 2022 6:20:29 AM org.apache.beam.sdk.io.FileBasedSink$WriteOperation moveToOutputFiles
INFO: Will copy temporary file FileResult{tempFilename=/tmp/junit9103712029810309664/.temp-beam-d1e394ee-d2ee-4eb1-a406-eb5f4e0b498e/7bd7464a3a5a155e-2b80-43dc-b017-9f072ea0dfce, shard=17, window=org.apache.beam.sdk.transforms.windowing.GlobalWindow@7c8f8206, paneInfo=PaneInfo.NO_FIRING} to final location /tmp/junit9103712029810309664/file.txt-00017-of-00033
Feb 28, 2022 6:20:29 AM org.apache.beam.sdk.io.FileBasedSink$WriteOperation moveToOutputFiles
INFO: Will copy temporary file FileResult{tempFilename=/tmp/junit9103712029810309664/.temp-beam-d1e394ee-d2ee-4eb1-a406-eb5f4e0b498e/7c9b531af59cdc86-9faf-496a-bb26-7b285896c309, shard=18, window=org.apache.beam.sdk.transforms.windowing.GlobalWindow@7c8f8206, paneInfo=PaneInfo.NO_FIRING} to final location /tmp/junit9103712029810309664/file.txt-00018-of-00033
Feb 28, 2022 6:20:29 AM org.apache.beam.sdk.io.FileBasedSink$WriteOperation moveToOutputFiles
INFO: Will copy temporary file FileResult{tempFilename=/tmp/junit9103712029810309664/.temp-beam-d1e394ee-d2ee-4eb1-a406-eb5f4e0b498e/df5016f18af64e20-3cf7-40f4-b5e3-3951ca364497, shard=19, window=org.apache.beam.sdk.transforms.windowing.GlobalWindow@7c8f8206, paneInfo=PaneInfo.NO_FIRING} to final location /tmp/junit9103712029810309664/file.txt-00019-of-00033
Feb 28, 2022 6:20:29 AM org.apache.beam.sdk.io.FileBasedSink$WriteOperation moveToOutputFiles
INFO: Will copy temporary file FileResult{tempFilename=/tmp/junit9103712029810309664/.temp-beam-d1e394ee-d2ee-4eb1-a406-eb5f4e0b498e/a9dfd4ad3cdf836a-937e-4a82-b68b-76e2657028f0, shard=20, window=org.apache.beam.sdk.transforms.windowing.GlobalWindow@7c8f8206, paneInfo=PaneInfo.NO_FIRING} to final location /tmp/junit9103712029810309664/file.txt-00020-of-00033
Feb 28, 2022 6:20:29 AM org.apache.beam.sdk.io.FileBasedSink$WriteOperation moveToOutputFiles
INFO: Will copy temporary file FileResult{tempFilename=/tmp/junit9103712029810309664/.temp-beam-d1e394ee-d2ee-4eb1-a406-eb5f4e0b498e/b9a1500ad8919f6b-c92c-4d39-89fc-233856bc7f63, shard=21, window=org.apache.beam.sdk.transforms.windowing.GlobalWindow@7c8f8206, paneInfo=PaneInfo.NO_FIRING} to final location /tmp/junit9103712029810309664/file.txt-00021-of-00033
Feb 28, 2022 6:20:29 AM org.apache.beam.sdk.io.FileBasedSink$WriteOperation moveToOutputFiles
INFO: Will copy temporary file FileResult{tempFilename=/tmp/junit9103712029810309664/.temp-beam-d1e394ee-d2ee-4eb1-a406-eb5f4e0b498e/f26091d2436f79ea-d1f0-46a6-b9b5-f70f3f3b2ba7, shard=22, window=org.apache.beam.sdk.transforms.windowing.GlobalWindow@7c8f8206, paneInfo=PaneInfo.NO_FIRING} to final location /tmp/junit9103712029810309664/file.txt-00022-of-00033
Feb 28, 2022 6:20:29 AM org.apache.beam.sdk.io.FileBasedSink$WriteOperation moveToOutputFiles
INFO: Will copy temporary file FileResult{tempFilename=/tmp/junit9103712029810309664/.temp-beam-d1e394ee-d2ee-4eb1-a406-eb5f4e0b498e/ea020527b56d8a21-0b10-479b-914d-dfb7262deefd, shard=23, window=org.apache.beam.sdk.transforms.windowing.GlobalWindow@7c8f8206, paneInfo=PaneInfo.NO_FIRING} to final location /tmp/junit9103712029810309664/file.txt-00023-of-00033
Feb 28, 2022 6:20:29 AM org.apache.beam.sdk.io.FileBasedSink$WriteOperation moveToOutputFiles
INFO: Will copy temporary file FileResult{tempFilename=/tmp/junit9103712029810309664/.temp-beam-d1e394ee-d2ee-4eb1-a406-eb5f4e0b498e/11e22913ad4248cc-0279-41e4-babb-22115efe0fdd, shard=24, window=org.apache.beam.sdk.transforms.windowing.GlobalWindow@7c8f8206, paneInfo=PaneInfo.NO_FIRING} to final location /tmp/junit9103712029810309664/file.txt-00024-of-00033
Feb 28, 2022 6:20:29 AM org.apache.beam.sdk.io.FileBasedSink$WriteOperation moveToOutputFiles
INFO: Will copy temporary file FileResult{tempFilename=/tmp/junit9103712029810309664/.temp-beam-d1e394ee-d2ee-4eb1-a406-eb5f4e0b498e/4f0cb0be275bb5f1-24d8-4555-8a88-4070fd925302, shard=25, window=org.apache.beam.sdk.transforms.windowing.GlobalWindow@7c8f8206, paneInfo=PaneInfo.NO_FIRING} to final location /tmp/junit9103712029810309664/file.txt-00025-of-00033
Feb 28, 2022 6:20:29 AM org.apache.beam.sdk.io.FileBasedSink$WriteOperation moveToOutputFiles
INFO: Will copy temporary file FileResult{tempFilename=/tmp/junit9103712029810309664/.temp-beam-d1e394ee-d2ee-4eb1-a406-eb5f4e0b498e/2072a5ea522be158-dbfc-47ed-8312-d0155dd39d7a, shard=26, window=org.apache.beam.sdk.transforms.windowing.GlobalWindow@7c8f8206, paneInfo=PaneInfo.NO_FIRING} to final location /tmp/junit9103712029810309664/file.txt-00026-of-00033
Feb 28, 2022 6:20:29 AM org.apache.beam.sdk.io.FileBasedSink$WriteOperation moveToOutputFiles
INFO: Will copy temporary file FileResult{tempFilename=/tmp/junit9103712029810309664/.temp-beam-d1e394ee-d2ee-4eb1-a406-eb5f4e0b498e/fe0d794cdaf762da-6121-42aa-b305-d0da2a78fcef, shard=27, window=org.apache.beam.sdk.transforms.windowing.GlobalWindow@7c8f8206, paneInfo=PaneInfo.NO_FIRING} to final location /tmp/junit9103712029810309664/file.txt-00027-of-00033
Feb 28, 2022 6:20:29 AM org.apache.beam.sdk.io.FileBasedSink$WriteOperation moveToOutputFiles
INFO: Will copy temporary file FileResult{tempFilename=/tmp/junit9103712029810309664/.temp-beam-d1e394ee-d2ee-4eb1-a406-eb5f4e0b498e/15459b44ac5164f2-41da-447d-adb0-3dadb31e3db2, shard=28, window=org.apache.beam.sdk.transforms.windowing.GlobalWindow@7c8f8206, paneInfo=PaneInfo.NO_FIRING} to final location /tmp/junit9103712029810309664/file.txt-00028-of-00033
Feb 28, 2022 6:20:29 AM org.apache.beam.sdk.io.FileBasedSink$WriteOperation moveToOutputFiles
INFO: Will copy temporary file FileResult{tempFilename=/tmp/junit9103712029810309664/.temp-beam-d1e394ee-d2ee-4eb1-a406-eb5f4e0b498e/37b34248fc1bc09e-8340-447e-a209-3f51da5a22d0, shard=29, window=org.apache.beam.sdk.transforms.windowing.GlobalWindow@7c8f8206, paneInfo=PaneInfo.NO_FIRING} to final location /tmp/junit9103712029810309664/file.txt-00029-of-00033
Feb 28, 2022 6:20:29 AM org.apache.beam.sdk.io.FileBasedSink$WriteOperation moveToOutputFiles
INFO: Will copy temporary file FileResult{tempFilename=/tmp/junit9103712029810309664/.temp-beam-d1e394ee-d2ee-4eb1-a406-eb5f4e0b498e/6f3cf8292fa5e771-fe3e-43cf-9a1a-02ea907f07f7, shard=30, window=org.apache.beam.sdk.transforms.windowing.GlobalWindow@7c8f8206, paneInfo=PaneInfo.NO_FIRING} to final location /tmp/junit9103712029810309664/file.txt-00030-of-00033
Feb 28, 2022 6:20:29 AM org.apache.beam.sdk.io.FileBasedSink$WriteOperation moveToOutputFiles
INFO: Will copy temporary file FileResult{tempFilename=/tmp/junit9103712029810309664/.temp-beam-d1e394ee-d2ee-4eb1-a406-eb5f4e0b498e/b195ec5f1319806f-814c-49ae-93d3-cdeef9a19170, shard=31, window=org.apache.beam.sdk.transforms.windowing.GlobalWindow@7c8f8206, paneInfo=PaneInfo.NO_FIRING} to final location /tmp/junit9103712029810309664/file.txt-00031-of-00033
Feb 28, 2022 6:20:29 AM org.apache.beam.sdk.io.FileBasedSink$WriteOperation moveToOutputFiles
INFO: Will copy temporary file FileResult{tempFilename=/tmp/junit9103712029810309664/.temp-beam-d1e394ee-d2ee-4eb1-a406-eb5f4e0b498e/14db3ebd3a7796b0-be25-48aa-bb83-928f78d1d2ec, shard=32, window=org.apache.beam.sdk.transforms.windowing.GlobalWindow@7c8f8206, paneInfo=PaneInfo.NO_FIRING} to final location /tmp/junit9103712029810309664/file.txt-00032-of-00033
Feb 28, 2022 6:20:29 AM org.apache.beam.sdk.io.FileBasedSink$WriteOperation removeTemporaryFiles
WARNING: Failed to match temporary files under: [/tmp/junit9103712029810309664/.temp-beam-d1e394ee-d2ee-4eb1-a406-eb5f4e0b498e/].
> Task :runners:direct-java:assemble
> Task :runners:direct-java:analyzeTestClassesDependencies SKIPPED
> Task :runners:direct-java:analyzeDependencies
> Task :runners:direct-java:checkstyleTest
> Task :runners:direct-java:spotbugsTest SKIPPED
> Task :runners:direct-java:test FROM-CACHE
> Task :runners:direct-java:check
> Task :runners:direct-java:build
> Task :sdks:java:io:google-cloud-platform:check
> Task :sdks:java:io:google-cloud-platform:build
> Task :sdks:java:io:google-cloud-platform:buildDependents
> Task :sdks:java:testing:test-utils:buildDependents
> Task :runners:direct-java:buildDependents
> Task :sdks:java:expansion-service:buildDependents
> Task :runners:java-fn-execution:buildDependents
> Task :sdks:java:harness:buildDependents
> Task :sdks:java:extensions:google-cloud-platform-core:buildDependents
> Task :runners:core-java:buildDependents
> Task :runners:core-construction-java:buildDependents
> Task :runners:local-java:buildDependents
> Task :sdks:java:extensions:arrow:buildDependents
> Task :sdks:java:extensions:protobuf:buildDependents
> Task :sdks:java:io:common:buildDependents
FAILURE: Build completed with 2 failures.
1: Task failed with an exception.
-----------
* What went wrong:
Execution failed for task ':sdks:java:fn-execution:analyzeClassesDependencies'.
> Dependency analysis found issues.
usedUndeclaredArtifacts
- org.apache.avro:avro:1.8.2@jar
* Try:
> Run with --stacktrace option to get the stack trace.
> Run with --info or --debug option to get more log output.
> Run with --scan to get full insights.
==============================================================================
2: Task failed with an exception.
-----------
* What went wrong:
Execution failed for task ':sdks:java:fn-execution:checkstyleMain'.
> Checkstyle rule violations were found. See the report at: file://<https://ci-beam.apache.org/job/beam_PreCommit_Java_Cron/ws/src/sdks/java/fn-execution/build/reports/checkstyle/main.html>
Checkstyle files with violations: 1
Checkstyle violations by severity: [error:1]
* Try:
> Run with --stacktrace option to get the stack trace.
> Run with --info or --debug option to get more log output.
> Run with --scan to get full insights.
==============================================================================
* Get more help at https://help.gradle.org
Deprecated Gradle features were used in this build, making it incompatible with Gradle 8.0.
You can use '--warning-mode all' to show the individual deprecation warnings and determine if they come from your own scripts or plugins.
See https://docs.gradle.org/7.3.2/userguide/command_line_interface.html#sec:command_line_warnings
Execution optimizations have been disabled for 1 invalid unit(s) of work during this build to ensure correctness.
Please consult deprecation warnings for more details.
BUILD FAILED in 18m 7s
1264 actionable tasks: 781 executed, 481 from cache, 2 up-to-date
Publishing build scan...
https://gradle.com/s/kb5rfsfgg3h3u
Build step 'Invoke Gradle script' changed build result to FAILURE
Build step 'Invoke Gradle script' marked build as failure
---------------------------------------------------------------------
To unsubscribe, e-mail: builds-unsubscribe@beam.apache.org
For additional commands, e-mail: builds-help@beam.apache.org
beam_PreCommit_Java_Cron - Build # 5151 - Aborted!
Posted by Apache Jenkins Server <je...@builds.apache.org>.
beam_PreCommit_Java_Cron - Build # 5151 - Aborted:
Check console output at https://ci-beam.apache.org/job/beam_PreCommit_Java_Cron/5151/ to view the results.
Build failed in Jenkins: beam_PreCommit_Java_Cron #5150
Posted by Apache Jenkins Server <je...@builds.apache.org>.
See <https://ci-beam.apache.org/job/beam_PreCommit_Java_Cron/5150/display/redirect>
Changes:
------------------------------------------
[...truncated 2.90 MB...]
> Task :runners:flink:1.14:test
[IOManagerAsync shutdown hook] INFO org.apache.flink.runtime.io.disk.FileChannelManagerImpl - FileChannelManager removed spill file directory /tmp/flink-io-db0508f3-8e26-4b5d-9df0-159a281010b7
[IOManagerAsync shutdown hook] INFO org.apache.flink.runtime.io.disk.FileChannelManagerImpl - FileChannelManager removed spill file directory /tmp/flink-io-616fe313-d704-49e4-81e7-f696cf8fcce0
[IOManagerAsync shutdown hook] INFO org.apache.flink.runtime.io.disk.FileChannelManagerImpl - FileChannelManager removed spill file directory /tmp/flink-io-d872ac14-217e-418a-a0d0-fedc3660edb5
[IOManagerAsync shutdown hook] INFO org.apache.flink.runtime.io.disk.FileChannelManagerImpl - FileChannelManager removed spill file directory /tmp/flink-io-f871e364-586f-4390-8ab3-1a2c4de470c8
[IOManagerAsync shutdown hook] INFO org.apache.flink.runtime.io.disk.FileChannelManagerImpl - FileChannelManager removed spill file directory /tmp/flink-io-7b7ad6ad-0b9a-49f6-8b6d-43921c107bc1
[IOManagerAsync shutdown hook] INFO org.apache.flink.runtime.io.disk.FileChannelManagerImpl - FileChannelManager removed spill file directory /tmp/flink-io-1e8bb771-f313-4c91-8577-55ed8b14c60e
[FileChannelManagerImpl-io shutdown hook] INFO org.apache.flink.runtime.io.disk.FileChannelManagerImpl - FileChannelManager removed spill file directory /tmp/flink-io-ce6f03cc-5f3f-476e-bb53-ef5674a09eee
[FileChannelManagerImpl-io shutdown hook] INFO org.apache.flink.runtime.io.disk.FileChannelManagerImpl - FileChannelManager removed spill file directory /tmp/flink-io-71c33da7-6d40-43d5-a3e6-5fe2fc8e8aff
[FileChannelManagerImpl-io shutdown hook] INFO org.apache.flink.runtime.io.disk.FileChannelManagerImpl - FileChannelManager removed spill file directory /tmp/flink-io-d2ae2e99-95f5-402f-abb7-e13623045ff9
[FileChannelManagerImpl-io shutdown hook] INFO org.apache.flink.runtime.io.disk.FileChannelManagerImpl - FileChannelManager removed spill file directory /tmp/flink-io-f7948296-486b-4a8c-8660-c58b89383a1e
[FileChannelManagerImpl-io shutdown hook] INFO org.apache.flink.runtime.io.disk.FileChannelManagerImpl - FileChannelManager removed spill file directory /tmp/flink-io-9698916e-f5e9-4bea-a592-67033d8bc302
[FileChannelManagerImpl-io shutdown hook] INFO org.apache.flink.runtime.io.disk.FileChannelManagerImpl - FileChannelManager removed spill file directory /tmp/flink-io-7cedaffe-205f-4276-9d0c-12c7ab04f778
[FileChannelManagerImpl-io shutdown hook] INFO org.apache.flink.runtime.io.disk.FileChannelManagerImpl - FileChannelManager removed spill file directory /tmp/flink-io-0847b06f-1e9f-43fb-b0ca-28a34c04b224
[FileChannelManagerImpl-io shutdown hook] INFO org.apache.flink.runtime.io.disk.FileChannelManagerImpl - FileChannelManager removed spill file directory /tmp/flink-io-913f66e3-0c22-4a0a-b1c0-4d964d2154cc
[IOManagerAsync shutdown hook] INFO org.apache.flink.runtime.io.disk.FileChannelManagerImpl - FileChannelManager removed spill file directory /tmp/flink-io-9fb1e542-07fb-43f8-8f01-2ca940679602
[IOManagerAsync shutdown hook] INFO org.apache.flink.runtime.io.disk.FileChannelManagerImpl - FileChannelManager removed spill file directory /tmp/flink-io-6f61061b-688d-47e0-906c-6f3dbb5f256e
[IOManagerAsync shutdown hook] INFO org.apache.flink.runtime.io.disk.FileChannelManagerImpl - FileChannelManager removed spill file directory /tmp/flink-io-c71551f5-7e32-44f4-b3fd-ffb30ad7a5be
[IOManagerAsync shutdown hook] INFO org.apache.flink.runtime.io.disk.FileChannelManagerImpl - FileChannelManager removed spill file directory /tmp/flink-io-207b402f-a539-4e33-b874-9522a136c1eb
> Task :runners:flink:1.14:check
> Task :runners:flink:1.14:build
> Task :runners:flink:1.14:buildDependents
> Task :sdks:java:io:hadoop-common:spotbugsTest SKIPPED
> Task :sdks:java:io:azure:javadoc
> Task :sdks:java:io:common:test
> Task :sdks:java:io:azure:spotbugsTest SKIPPED
> Task :sdks:java:io:hadoop-common:test
> Task :sdks:java:io:common:check
> Task :sdks:java:io:common:build
> Task :sdks:java:javadoc:allJavadoc
> Task :sdks:java:io:hadoop-common:spotbugsMain
> Task :sdks:java:io:hadoop-common:check
> Task :sdks:java:io:hadoop-common:build
> Task :sdks:java:io:elasticsearch:spotbugsMain
> Task :sdks:java:io:elasticsearch:check
> Task :sdks:java:io:elasticsearch:build
> Task :sdks:java:container:java8:copyDockerfileDependencies
> Task :sdks:java:container:java8:copySdkHarnessLauncher
Execution optimizations have been disabled for task ':sdks:java:container:java8:copySdkHarnessLauncher' to ensure correctness due to the following reasons:
- Gradle detected a problem with the following location: '<https://ci-beam.apache.org/job/beam_PreCommit_Java_Cron/ws/src/sdks/java/container/build/target'.> Reason: Task ':sdks:java:container:java8:copySdkHarnessLauncher' uses this output of task ':sdks:java:container:downloadCloudProfilerAgent' without declaring an explicit or implicit dependency. This can lead to incorrect results being produced, depending on what order the tasks are executed. Please refer to https://docs.gradle.org/7.3.2/userguide/validation_problems.html#implicit_dependency for more details about this problem.
- Gradle detected a problem with the following location: '<https://ci-beam.apache.org/job/beam_PreCommit_Java_Cron/ws/src/sdks/java/container/build/target'.> Reason: Task ':sdks:java:container:java8:copySdkHarnessLauncher' uses this output of task ':sdks:java:container:pullLicenses' without declaring an explicit or implicit dependency. This can lead to incorrect results being produced, depending on what order the tasks are executed. Please refer to https://docs.gradle.org/7.3.2/userguide/validation_problems.html#implicit_dependency for more details about this problem.
> Task :sdks:java:container:pullLicenses
Copying already-fetched licenses from <https://ci-beam.apache.org/job/beam_PreCommit_Java_Cron/ws/src/sdks/java/container/build/reports/dependency-license> to <https://ci-beam.apache.org/job/beam_PreCommit_Java_Cron/ws/src/sdks/java/container/build/target/java_third_party_licenses>
> Task :sdks:java:core:spotbugsMain
> Task :sdks:java:core:test
> Task :sdks:java:io:azure:spotbugsMain
> Task :release:go-licenses:java:dockerRun
+ rm -rf '/output/*'
+ export GO111MODULE=off
+ GO111MODULE=off
+ go get github.com/apache/beam/sdks/java/container
> Task :runners:samza:job-server:startShadowScripts
> Task :sdks:java:container:pullLicenses
Collecting pip
Using cached pip-22.0.3-py3-none-any.whl (2.1 MB)
Collecting setuptools
Using cached setuptools-60.9.3-py3-none-any.whl (1.1 MB)
Collecting wheel
Using cached wheel-0.37.1-py2.py3-none-any.whl (35 kB)
Installing collected packages: pip, setuptools, wheel
Attempting uninstall: pip
Found existing installation: pip 20.0.2
Uninstalling pip-20.0.2:
Successfully uninstalled pip-20.0.2
> Task :runners:samza:job-server:shadowDistTar
> Task :sdks:java:container:pullLicenses
Attempting uninstall: setuptools
Found existing installation: setuptools 44.0.0
Uninstalling setuptools-44.0.0:
Successfully uninstalled setuptools-44.0.0
> Task :sdks:java:io:azure:test
> Task :sdks:java:io:azure:check
> Task :sdks:java:io:azure:build
> Task :sdks:java:io:azure:buildDependents
> Task :sdks:java:container:pullLicenses
Successfully installed pip-22.0.3 setuptools-60.9.3 wheel-0.37.1
Collecting beautifulsoup4<5.0,>=4.9.0
Using cached beautifulsoup4-4.10.0-py3-none-any.whl (97 kB)
Collecting pyyaml<6.0.0,>=3.12
Using cached PyYAML-5.4.1-cp38-cp38-manylinux1_x86_64.whl (662 kB)
Collecting tenacity<6.0,>=5.0.2
Using cached tenacity-5.1.5-py2.py3-none-any.whl (34 kB)
Collecting soupsieve>1.2
Using cached soupsieve-2.3.1-py3-none-any.whl (37 kB)
Collecting six>=1.9.0
Using cached six-1.16.0-py2.py3-none-any.whl (11 kB)
Installing collected packages: soupsieve, six, pyyaml, tenacity, beautifulsoup4
Successfully installed beautifulsoup4-4.10.0 pyyaml-5.4.1 six-1.16.0 soupsieve-2.3.1 tenacity-5.1.5
Executing python <https://ci-beam.apache.org/job/beam_PreCommit_Java_Cron/ws/src/sdks/java/container/license_scripts/pull_licenses_java.py> --license_index=<https://ci-beam.apache.org/job/beam_PreCommit_Java_Cron/ws/src/sdks/java/container/build/reports/dependency-license/index.json> --output_dir=<https://ci-beam.apache.org/job/beam_PreCommit_Java_Cron/ws/src/sdks/java/container/build/target/java_third_party_licenses> --dep_url_yaml=<https://ci-beam.apache.org/job/beam_PreCommit_Java_Cron/ws/src/sdks/java/container/license_scripts/dep_urls_java.yaml> --manual_license_path=<https://ci-beam.apache.org/job/beam_PreCommit_Java_Cron/ws/src/sdks/java/container/license_scripts/manual_licenses>
INFO:root:Pulling license for 220 dependencies using 16 threads.
INFO:root:Replaced local file URL with file://<https://ci-beam.apache.org/job/beam_PreCommit_Java_Cron/ws/src/sdks/java/container/license_scripts/manual_licenses/xz/COPYING> for xz-1.5
INFO:root:pull_licenses_java.py succeed. It took 7.252725 seconds with 16 threads.
Copying licenses from <https://ci-beam.apache.org/job/beam_PreCommit_Java_Cron/ws/src/sdks/java/container/build/target/java_third_party_licenses> to <https://ci-beam.apache.org/job/beam_PreCommit_Java_Cron/ws/src/sdks/java/container/build/target/third_party_licenses.>
Finished license_scripts.sh
> Task :sdks:java:container:java8:copyJavaThirdPartyLicenses
> Task :sdks:java:extensions:sql:jdbc:shadowJarTest
> Task :runners:samza:job-server:shadowDistZip
> Task :runners:samza:job-server:assemble
> Task :runners:samza:job-server:analyzeClassesDependencies
> Task :runners:samza:job-server:analyzeTestClassesDependencies SKIPPED
> Task :runners:samza:job-server:analyzeDependencies
> Task :runners:samza:job-server:checkstyleMain NO-SOURCE
> Task :runners:samza:job-server:checkstyleTest NO-SOURCE
> Task :runners:samza:job-server:javadoc NO-SOURCE
> Task :runners:samza:job-server:spotbugsMain NO-SOURCE
> Task :runners:samza:job-server:spotbugsTest SKIPPED
> Task :runners:samza:job-server:test NO-SOURCE
> Task :runners:samza:job-server:check
> Task :runners:samza:job-server:build
> Task :runners:samza:job-server:buildDependents
> Task :runners:samza:buildDependents
> Task :runners:java-job-service:buildDependents
> Task :sdks:java:extensions:sql:jdbc:preCommit
> Task :sdks:java:io:elasticsearch-tests:elasticsearch-tests-7:check
> Task :sdks:java:io:elasticsearch-tests:elasticsearch-tests-7:build
> Task :sdks:java:io:elasticsearch-tests:elasticsearch-tests-7:buildDependents
> Task :sdks:java:io:elasticsearch-tests:elasticsearch-tests-6:check
> Task :sdks:java:io:elasticsearch-tests:elasticsearch-tests-6:build
> Task :sdks:java:io:elasticsearch-tests:elasticsearch-tests-6:buildDependents
> Task :sdks:java:io:elasticsearch-tests:elasticsearch-tests-5:check
> Task :sdks:java:io:elasticsearch-tests:elasticsearch-tests-5:build
> Task :sdks:java:io:elasticsearch-tests:elasticsearch-tests-5:buildDependents
> Task :sdks:java:io:elasticsearch-tests:elasticsearch-tests-common:buildDependents
> Task :sdks:java:io:elasticsearch:buildDependents
> Task :sdks:java:core:validateShadedJarDoesntLeakNonProjectClasses
> Task :sdks:java:core:check
> Task :sdks:java:core:build
> Task :sdks:java:core:buildNeeded
> Task :release:go-licenses:java:dockerRun
+ go-licenses save github.com/apache/beam/sdks/java/container --save_path=/output/licenses
+ go-licenses csv github.com/apache/beam/sdks/java/container
+ tee /output/licenses/list.csv
github.com/golang/protobuf,https://github.com/golang/protobuf/blob/master/LICENSE,BSD-3-Clause
google.golang.org/genproto/googleapis/rpc/status,https://github.com/googleapis/go-genproto/blob/master/LICENSE,Apache-2.0
golang.org/x/text,https://go.googlesource.com/text/+/refs/heads/master/LICENSE,BSD-3-Clause
github.com/apache/beam/sdks/java/container,https://github.com/apache/beam/blob/master/LICENSE,Apache-2.0
github.com/apache/beam/sdks/go/pkg/beam,https://github.com/apache/beam/blob/master/sdks/go/README.md,Apache-2.0
google.golang.org/grpc,https://github.com/grpc/grpc-go/blob/master/LICENSE,Apache-2.0
golang.org/x/sys,https://go.googlesource.com/sys/+/refs/heads/master/LICENSE,BSD-3-Clause
golang.org/x/net,https://go.googlesource.com/net/+/refs/heads/master/LICENSE,BSD-3-Clause
google.golang.org/protobuf,https://go.googlesource.com/protobuf/+/refs/heads/master/LICENSE,BSD-3-Clause
+ chmod -R a+w /output/licenses
> Task :sdks:java:testing:nexmark:check
> Task :sdks:java:testing:nexmark:build
> Task :sdks:java:testing:nexmark:buildDependents
> Task :sdks:java:extensions:sql:zetasql:buildDependents
> Task :sdks:java:extensions:sql:buildDependents
> Task :sdks:java:extensions:join-library:buildDependents
> Task :sdks:java:io:kafka:buildDependents
> Task :sdks:java:io:mongodb:buildDependents
> Task :sdks:java:io:parquet:buildDependents
> Task :sdks:java:io:synthetic:buildDependents
> Task :sdks:java:io:thrift:buildDependents
> Task :sdks:java:io:hadoop-common:buildDependents
> Task :release:go-licenses:java:createLicenses
> Task :sdks:java:container:java8:copyGolangLicenses
> Task :sdks:java:container:java8:dockerPrepare
> Task :sdks:java:container:java8:docker
FAILURE: Build completed with 4 failures.
1: Task failed with an exception.
-----------
* What went wrong:
Execution failed for task ':sdks:java:io:clickhouse:test'.
> There were failing tests. See the report at: file://<https://ci-beam.apache.org/job/beam_PreCommit_Java_Cron/ws/src/sdks/java/io/clickhouse/build/reports/tests/test/index.html>
* Try:
> Run with --stacktrace option to get the stack trace.
> Run with --info or --debug option to get more log output.
> Run with --scan to get full insights.
==============================================================================
2: Task failed with an exception.
-----------
* What went wrong:
Execution failed for task ':sdks:java:io:google-cloud-platform:test'.
> There were failing tests. See the report at: file://<https://ci-beam.apache.org/job/beam_PreCommit_Java_Cron/ws/src/sdks/java/io/google-cloud-platform/build/reports/tests/test/index.html>
* Try:
> Run with --stacktrace option to get the stack trace.
> Run with --info or --debug option to get more log output.
> Run with --scan to get full insights.
==============================================================================
3: Task failed with an exception.
-----------
* What went wrong:
Execution failed for task ':sdks:java:fn-execution:analyzeClassesDependencies'.
> Dependency analysis found issues.
usedUndeclaredArtifacts
- org.apache.avro:avro:1.8.2@jar
* Try:
> Run with --stacktrace option to get the stack trace.
> Run with --info or --debug option to get more log output.
> Run with --scan to get full insights.
==============================================================================
4: Task failed with an exception.
-----------
* What went wrong:
Execution failed for task ':sdks:java:fn-execution:checkstyleMain'.
> Checkstyle rule violations were found. See the report at: file://<https://ci-beam.apache.org/job/beam_PreCommit_Java_Cron/ws/src/sdks/java/fn-execution/build/reports/checkstyle/main.html>
Checkstyle files with violations: 1
Checkstyle violations by severity: [error:1]
* Try:
> Run with --stacktrace option to get the stack trace.
> Run with --info or --debug option to get more log output.
> Run with --scan to get full insights.
==============================================================================
* Get more help at https://help.gradle.org
Deprecated Gradle features were used in this build, making it incompatible with Gradle 8.0.
You can use '--warning-mode all' to show the individual deprecation warnings and determine if they come from your own scripts or plugins.
See https://docs.gradle.org/7.3.2/userguide/command_line_interface.html#sec:command_line_warnings
Execution optimizations have been disabled for 1 invalid unit(s) of work during this build to ensure correctness.
Please consult deprecation warnings for more details.
BUILD FAILED in 40m 54s
1264 actionable tasks: 1159 executed, 103 from cache, 2 up-to-date
Publishing build scan...
https://gradle.com/s/tlqm4conzn7oo
Build step 'Invoke Gradle script' changed build result to FAILURE
Build step 'Invoke Gradle script' marked build as failure
---------------------------------------------------------------------
To unsubscribe, e-mail: builds-unsubscribe@beam.apache.org
For additional commands, e-mail: builds-help@beam.apache.org
beam_PreCommit_Java_Cron - Build # 5149 - Aborted!
Posted by Apache Jenkins Server <je...@builds.apache.org>.
beam_PreCommit_Java_Cron - Build # 5149 - Aborted:
Check console output at https://ci-beam.apache.org/job/beam_PreCommit_Java_Cron/5149/ to view the results.
beam_PreCommit_Java_Cron - Build # 5148 - Aborted!
Posted by Apache Jenkins Server <je...@builds.apache.org>.
beam_PreCommit_Java_Cron - Build # 5148 - Aborted:
Check console output at https://ci-beam.apache.org/job/beam_PreCommit_Java_Cron/5148/ to view the results.
Build failed in Jenkins: beam_PreCommit_Java_Cron #5147
Posted by Apache Jenkins Server <je...@builds.apache.org>.
See <https://ci-beam.apache.org/job/beam_PreCommit_Java_Cron/5147/display/redirect>
Changes:
------------------------------------------
[...truncated 3.21 MB...]
INFO: Successfully wrote temporary file /tmp/junit5344049447634916163/.temp-beam-c6d341bb-0966-4dcd-8c8b-fb715ecb28ce/e724ea8d7d5cd721-4517-4cfd-b211-40a399fcfb36
Feb 27, 2022 12:15:55 AM org.apache.beam.sdk.io.FileBasedSink$Writer close
INFO: Successfully wrote temporary file /tmp/junit5344049447634916163/.temp-beam-c6d341bb-0966-4dcd-8c8b-fb715ecb28ce/0cc81ab7fe574519-b0ac-488c-aa40-e520d0c71e9a
Feb 27, 2022 12:15:55 AM org.apache.beam.sdk.io.WriteFiles$WriteUnshardedTempFilesFn processElement
INFO: Opening writer 4cb9b4e1-3ced-46ba-ba44-cb3b23cb0da1 for window org.apache.beam.sdk.transforms.windowing.GlobalWindow@7c8f8206 pane PaneInfo.NO_FIRING destination null
Feb 27, 2022 12:15:55 AM org.apache.beam.sdk.io.WriteFiles$WriteUnshardedTempFilesFn processElement
INFO: Opening writer 8f43f4cf-2f56-4f6a-8fcb-484526aa02c6 for window org.apache.beam.sdk.transforms.windowing.GlobalWindow@7c8f8206 pane PaneInfo.NO_FIRING destination null
Feb 27, 2022 12:15:55 AM org.apache.beam.sdk.io.WriteFiles$WriteUnshardedTempFilesFn processElement
INFO: Opening writer fc65ef33-808c-400c-9593-87b365495934 for window org.apache.beam.sdk.transforms.windowing.GlobalWindow@7c8f8206 pane PaneInfo.NO_FIRING destination null
Feb 27, 2022 12:15:55 AM org.apache.beam.sdk.io.FileBasedSink$Writer close
INFO: Successfully wrote temporary file /tmp/junit5344049447634916163/.temp-beam-c6d341bb-0966-4dcd-8c8b-fb715ecb28ce/e83962494cb9b4e1-3ced-46ba-ba44-cb3b23cb0da1
Feb 27, 2022 12:15:55 AM org.apache.beam.sdk.io.FileBasedSink$Writer close
INFO: Successfully wrote temporary file /tmp/junit5344049447634916163/.temp-beam-c6d341bb-0966-4dcd-8c8b-fb715ecb28ce/dd27e1b78f43f4cf-2f56-4f6a-8fcb-484526aa02c6
Feb 27, 2022 12:15:55 AM org.apache.beam.sdk.io.FileBasedSink$Writer close
INFO: Successfully wrote temporary file /tmp/junit5344049447634916163/.temp-beam-c6d341bb-0966-4dcd-8c8b-fb715ecb28ce/d6461f8cfc65ef33-808c-400c-9593-87b365495934
Feb 27, 2022 12:15:55 AM org.apache.beam.sdk.io.WriteFiles$WriteUnshardedTempFilesFn processElement
INFO: Opening writer a08c5007-e704-4f53-96ce-7a202c31ef67 for window org.apache.beam.sdk.transforms.windowing.GlobalWindow@7c8f8206 pane PaneInfo.NO_FIRING destination null
Feb 27, 2022 12:15:55 AM org.apache.beam.sdk.io.FileBasedSink$Writer close
INFO: Successfully wrote temporary file /tmp/junit5344049447634916163/.temp-beam-c6d341bb-0966-4dcd-8c8b-fb715ecb28ce/acc165b0a08c5007-e704-4f53-96ce-7a202c31ef67
Feb 27, 2022 12:15:55 AM org.apache.beam.sdk.io.WriteFiles$WriteUnshardedTempFilesFn processElement
INFO: Opening writer e37c1892-e78b-4fde-b079-a32084c85af1 for window org.apache.beam.sdk.transforms.windowing.GlobalWindow@7c8f8206 pane PaneInfo.NO_FIRING destination null
Feb 27, 2022 12:15:55 AM org.apache.beam.sdk.io.WriteFiles$WriteUnshardedTempFilesFn processElement
INFO: Opening writer d6e7fc6b-3aa5-4494-8bcd-b34777bdfba9 for window org.apache.beam.sdk.transforms.windowing.GlobalWindow@7c8f8206 pane PaneInfo.NO_FIRING destination null
Feb 27, 2022 12:15:55 AM org.apache.beam.sdk.io.WriteFiles$WriteUnshardedTempFilesFn processElement
INFO: Opening writer 63538a1c-2ecd-4061-9413-8b5a73844c48 for window org.apache.beam.sdk.transforms.windowing.GlobalWindow@7c8f8206 pane PaneInfo.NO_FIRING destination null
Feb 27, 2022 12:15:55 AM org.apache.beam.sdk.io.FileBasedSink$Writer close
INFO: Successfully wrote temporary file /tmp/junit5344049447634916163/.temp-beam-c6d341bb-0966-4dcd-8c8b-fb715ecb28ce/3a312159e37c1892-e78b-4fde-b079-a32084c85af1
Feb 27, 2022 12:15:55 AM org.apache.beam.sdk.io.WriteFiles$WriteUnshardedTempFilesFn processElement
INFO: Opening writer f65fcac3-3cdf-4b7a-b334-f39cf1770ebf for window org.apache.beam.sdk.transforms.windowing.GlobalWindow@7c8f8206 pane PaneInfo.NO_FIRING destination null
Feb 27, 2022 12:15:55 AM org.apache.beam.sdk.io.FileBasedSink$Writer close
INFO: Successfully wrote temporary file /tmp/junit5344049447634916163/.temp-beam-c6d341bb-0966-4dcd-8c8b-fb715ecb28ce/711e4c05d6e7fc6b-3aa5-4494-8bcd-b34777bdfba9
Feb 27, 2022 12:15:55 AM org.apache.beam.sdk.io.FileBasedSink$Writer close
INFO: Successfully wrote temporary file /tmp/junit5344049447634916163/.temp-beam-c6d341bb-0966-4dcd-8c8b-fb715ecb28ce/744eab5d63538a1c-2ecd-4061-9413-8b5a73844c48
Feb 27, 2022 12:15:55 AM org.apache.beam.sdk.io.FileBasedSink$Writer close
INFO: Successfully wrote temporary file /tmp/junit5344049447634916163/.temp-beam-c6d341bb-0966-4dcd-8c8b-fb715ecb28ce/b4a0919ef65fcac3-3cdf-4b7a-b334-f39cf1770ebf
Feb 27, 2022 12:15:55 AM org.apache.beam.sdk.io.WriteFiles$WriteUnshardedTempFilesFn processElement
INFO: Opening writer 062ac345-e329-4c7f-b2a2-7ed66f2b75e5 for window org.apache.beam.sdk.transforms.windowing.GlobalWindow@7c8f8206 pane PaneInfo.NO_FIRING destination null
Feb 27, 2022 12:15:55 AM org.apache.beam.sdk.io.WriteFiles$WriteUnshardedTempFilesFn processElement
INFO: Opening writer 9faea8d5-81b9-4383-9427-013f4a82d885 for window org.apache.beam.sdk.transforms.windowing.GlobalWindow@7c8f8206 pane PaneInfo.NO_FIRING destination null
Feb 27, 2022 12:15:55 AM org.apache.beam.sdk.io.FileBasedSink$Writer close
INFO: Successfully wrote temporary file /tmp/junit5344049447634916163/.temp-beam-c6d341bb-0966-4dcd-8c8b-fb715ecb28ce/d6e024bc062ac345-e329-4c7f-b2a2-7ed66f2b75e5
Feb 27, 2022 12:15:55 AM org.apache.beam.sdk.io.FileBasedSink$Writer close
INFO: Successfully wrote temporary file /tmp/junit5344049447634916163/.temp-beam-c6d341bb-0966-4dcd-8c8b-fb715ecb28ce/aa785e4f9faea8d5-81b9-4383-9427-013f4a82d885
Feb 27, 2022 12:15:55 AM org.apache.beam.sdk.io.WriteFiles$WriteUnshardedTempFilesFn processElement
INFO: Opening writer eae78a82-0a12-4eb0-bc19-3439a2e36c19 for window org.apache.beam.sdk.transforms.windowing.GlobalWindow@7c8f8206 pane PaneInfo.NO_FIRING destination null
Feb 27, 2022 12:15:55 AM org.apache.beam.sdk.io.FileBasedSink$Writer close
INFO: Successfully wrote temporary file /tmp/junit5344049447634916163/.temp-beam-c6d341bb-0966-4dcd-8c8b-fb715ecb28ce/b2cd8490eae78a82-0a12-4eb0-bc19-3439a2e36c19
Feb 27, 2022 12:15:55 AM org.apache.beam.sdk.io.WriteFiles$WriteUnshardedTempFilesFn processElement
INFO: Opening writer 8e5d5a46-34dd-4219-bc3a-82a94066aeb9 for window org.apache.beam.sdk.transforms.windowing.GlobalWindow@7c8f8206 pane PaneInfo.NO_FIRING destination null
Feb 27, 2022 12:15:55 AM org.apache.beam.sdk.io.FileBasedSink$Writer close
INFO: Successfully wrote temporary file /tmp/junit5344049447634916163/.temp-beam-c6d341bb-0966-4dcd-8c8b-fb715ecb28ce/bf2697e98e5d5a46-34dd-4219-bc3a-82a94066aeb9
Feb 27, 2022 12:15:55 AM org.apache.beam.sdk.io.WriteFiles$WriteUnshardedTempFilesFn processElement
INFO: Opening writer e0e0737e-421d-4bd3-9924-08f7db2a57ff for window org.apache.beam.sdk.transforms.windowing.GlobalWindow@7c8f8206 pane PaneInfo.NO_FIRING destination null
Feb 27, 2022 12:15:55 AM org.apache.beam.sdk.io.FileBasedSink$Writer close
INFO: Successfully wrote temporary file /tmp/junit5344049447634916163/.temp-beam-c6d341bb-0966-4dcd-8c8b-fb715ecb28ce/ec10d152e0e0737e-421d-4bd3-9924-08f7db2a57ff
Feb 27, 2022 12:15:55 AM org.apache.beam.sdk.io.WriteFiles$WriteUnshardedTempFilesFn processElement
INFO: Opening writer 9319cae1-432e-44d5-9f37-0724ceed2fc5 for window org.apache.beam.sdk.transforms.windowing.GlobalWindow@7c8f8206 pane PaneInfo.NO_FIRING destination null
Feb 27, 2022 12:15:55 AM org.apache.beam.sdk.io.FileBasedSink$Writer close
INFO: Successfully wrote temporary file /tmp/junit5344049447634916163/.temp-beam-c6d341bb-0966-4dcd-8c8b-fb715ecb28ce/2a2c70ca9319cae1-432e-44d5-9f37-0724ceed2fc5
Feb 27, 2022 12:15:55 AM org.apache.beam.sdk.io.WriteFiles$WriteUnshardedTempFilesFn processElement
INFO: Opening writer d407b191-8bc8-4c63-a7bb-90779de68a00 for window org.apache.beam.sdk.transforms.windowing.GlobalWindow@7c8f8206 pane PaneInfo.NO_FIRING destination null
Feb 27, 2022 12:15:55 AM org.apache.beam.sdk.io.FileBasedSink$Writer close
INFO: Successfully wrote temporary file /tmp/junit5344049447634916163/.temp-beam-c6d341bb-0966-4dcd-8c8b-fb715ecb28ce/b349a491d407b191-8bc8-4c63-a7bb-90779de68a00
Feb 27, 2022 12:15:55 AM org.apache.beam.sdk.io.WriteFiles$WriteUnshardedTempFilesFn processElement
INFO: Opening writer 6adcf29e-3fd9-472a-b21c-80cf3f985a27 for window org.apache.beam.sdk.transforms.windowing.GlobalWindow@7c8f8206 pane PaneInfo.NO_FIRING destination null
Feb 27, 2022 12:15:55 AM org.apache.beam.sdk.io.FileBasedSink$Writer close
INFO: Successfully wrote temporary file /tmp/junit5344049447634916163/.temp-beam-c6d341bb-0966-4dcd-8c8b-fb715ecb28ce/92f993886adcf29e-3fd9-472a-b21c-80cf3f985a27
Feb 27, 2022 12:15:55 AM org.apache.beam.sdk.io.WriteFiles$WriteUnshardedTempFilesFn processElement
INFO: Opening writer 8fa80a99-a716-4e2c-8b29-8b20179ee798 for window org.apache.beam.sdk.transforms.windowing.GlobalWindow@7c8f8206 pane PaneInfo.NO_FIRING destination null
Feb 27, 2022 12:15:55 AM org.apache.beam.sdk.io.FileBasedSink$Writer close
INFO: Successfully wrote temporary file /tmp/junit5344049447634916163/.temp-beam-c6d341bb-0966-4dcd-8c8b-fb715ecb28ce/146bfc778fa80a99-a716-4e2c-8b29-8b20179ee798
Feb 27, 2022 12:15:55 AM org.apache.beam.sdk.io.WriteFiles$WriteUnshardedTempFilesFn processElement
INFO: Opening writer 54724881-0f95-42ff-b619-9d9c9a1ae46c for window org.apache.beam.sdk.transforms.windowing.GlobalWindow@7c8f8206 pane PaneInfo.NO_FIRING destination null
Feb 27, 2022 12:15:55 AM org.apache.beam.sdk.io.WriteFiles$WriteUnshardedTempFilesFn processElement
INFO: Opening writer 3a553afc-509c-4de2-9fb6-3934a4588817 for window org.apache.beam.sdk.transforms.windowing.GlobalWindow@7c8f8206 pane PaneInfo.NO_FIRING destination null
Feb 27, 2022 12:15:55 AM org.apache.beam.sdk.io.WriteFiles$WriteUnshardedTempFilesFn processElement
INFO: Opening writer 2a8884b9-d2e6-4d34-bfe9-06d92bff23b0 for window org.apache.beam.sdk.transforms.windowing.GlobalWindow@7c8f8206 pane PaneInfo.NO_FIRING destination null
Feb 27, 2022 12:15:55 AM org.apache.beam.sdk.io.FileBasedSink$Writer close
INFO: Successfully wrote temporary file /tmp/junit5344049447634916163/.temp-beam-c6d341bb-0966-4dcd-8c8b-fb715ecb28ce/ffaa277054724881-0f95-42ff-b619-9d9c9a1ae46c
Feb 27, 2022 12:15:55 AM org.apache.beam.sdk.io.FileBasedSink$Writer close
INFO: Successfully wrote temporary file /tmp/junit5344049447634916163/.temp-beam-c6d341bb-0966-4dcd-8c8b-fb715ecb28ce/b4d002133a553afc-509c-4de2-9fb6-3934a4588817
Feb 27, 2022 12:15:55 AM org.apache.beam.sdk.io.FileBasedSink$Writer close
INFO: Successfully wrote temporary file /tmp/junit5344049447634916163/.temp-beam-c6d341bb-0966-4dcd-8c8b-fb715ecb28ce/2c302c962a8884b9-d2e6-4d34-bfe9-06d92bff23b0
Feb 27, 2022 12:15:55 AM org.apache.beam.sdk.io.WriteFiles$FinalizeTempFileBundles$FinalizeFn process
INFO: Finalizing 35 file results
Feb 27, 2022 12:15:55 AM org.apache.beam.sdk.io.FileBasedSink$WriteOperation createMissingEmptyShards
INFO: Finalizing for destination null num shards 35.
Feb 27, 2022 12:15:55 AM org.apache.beam.sdk.io.FileBasedSink$WriteOperation moveToOutputFiles
INFO: Will copy temporary file FileResult{tempFilename=/tmp/junit5344049447634916163/.temp-beam-c6d341bb-0966-4dcd-8c8b-fb715ecb28ce/bf2697e98e5d5a46-34dd-4219-bc3a-82a94066aeb9, shard=0, window=org.apache.beam.sdk.transforms.windowing.GlobalWindow@7c8f8206, paneInfo=PaneInfo.NO_FIRING} to final location /tmp/junit5344049447634916163/file.txt-00000-of-00035
Feb 27, 2022 12:15:55 AM org.apache.beam.sdk.io.FileBasedSink$WriteOperation moveToOutputFiles
INFO: Will copy temporary file FileResult{tempFilename=/tmp/junit5344049447634916163/.temp-beam-c6d341bb-0966-4dcd-8c8b-fb715ecb28ce/3a312159e37c1892-e78b-4fde-b079-a32084c85af1, shard=1, window=org.apache.beam.sdk.transforms.windowing.GlobalWindow@7c8f8206, paneInfo=PaneInfo.NO_FIRING} to final location /tmp/junit5344049447634916163/file.txt-00001-of-00035
Feb 27, 2022 12:15:55 AM org.apache.beam.sdk.io.FileBasedSink$WriteOperation moveToOutputFiles
INFO: Will copy temporary file FileResult{tempFilename=/tmp/junit5344049447634916163/.temp-beam-c6d341bb-0966-4dcd-8c8b-fb715ecb28ce/4e9779f18b75b3c7-ce8d-4689-b5f2-4d0951aece1d, shard=2, window=org.apache.beam.sdk.transforms.windowing.GlobalWindow@7c8f8206, paneInfo=PaneInfo.NO_FIRING} to final location /tmp/junit5344049447634916163/file.txt-00002-of-00035
Feb 27, 2022 12:15:55 AM org.apache.beam.sdk.io.FileBasedSink$WriteOperation moveToOutputFiles
INFO: Will copy temporary file FileResult{tempFilename=/tmp/junit5344049447634916163/.temp-beam-c6d341bb-0966-4dcd-8c8b-fb715ecb28ce/d6e024bc062ac345-e329-4c7f-b2a2-7ed66f2b75e5, shard=3, window=org.apache.beam.sdk.transforms.windowing.GlobalWindow@7c8f8206, paneInfo=PaneInfo.NO_FIRING} to final location /tmp/junit5344049447634916163/file.txt-00003-of-00035
Feb 27, 2022 12:15:55 AM org.apache.beam.sdk.io.FileBasedSink$WriteOperation moveToOutputFiles
INFO: Will copy temporary file FileResult{tempFilename=/tmp/junit5344049447634916163/.temp-beam-c6d341bb-0966-4dcd-8c8b-fb715ecb28ce/cbe09bd303eab988-f2a1-4a5b-89f9-af438610baa4, shard=4, window=org.apache.beam.sdk.transforms.windowing.GlobalWindow@7c8f8206, paneInfo=PaneInfo.NO_FIRING} to final location /tmp/junit5344049447634916163/file.txt-00004-of-00035
Feb 27, 2022 12:15:55 AM org.apache.beam.sdk.io.FileBasedSink$WriteOperation moveToOutputFiles
INFO: Will copy temporary file FileResult{tempFilename=/tmp/junit5344049447634916163/.temp-beam-c6d341bb-0966-4dcd-8c8b-fb715ecb28ce/b4a0919ef65fcac3-3cdf-4b7a-b334-f39cf1770ebf, shard=5, window=org.apache.beam.sdk.transforms.windowing.GlobalWindow@7c8f8206, paneInfo=PaneInfo.NO_FIRING} to final location /tmp/junit5344049447634916163/file.txt-00005-of-00035
Feb 27, 2022 12:15:55 AM org.apache.beam.sdk.io.FileBasedSink$WriteOperation moveToOutputFiles
INFO: Will copy temporary file FileResult{tempFilename=/tmp/junit5344049447634916163/.temp-beam-c6d341bb-0966-4dcd-8c8b-fb715ecb28ce/4e8984cbed339dec-b614-4042-9a0c-51cf665cf785, shard=6, window=org.apache.beam.sdk.transforms.windowing.GlobalWindow@7c8f8206, paneInfo=PaneInfo.NO_FIRING} to final location /tmp/junit5344049447634916163/file.txt-00006-of-00035
Feb 27, 2022 12:15:55 AM org.apache.beam.sdk.io.FileBasedSink$WriteOperation moveToOutputFiles
INFO: Will copy temporary file FileResult{tempFilename=/tmp/junit5344049447634916163/.temp-beam-c6d341bb-0966-4dcd-8c8b-fb715ecb28ce/4eed87edc1ca4f52-f247-4057-a4fe-d651173ce644, shard=7, window=org.apache.beam.sdk.transforms.windowing.GlobalWindow@7c8f8206, paneInfo=PaneInfo.NO_FIRING} to final location /tmp/junit5344049447634916163/file.txt-00007-of-00035
Feb 27, 2022 12:15:55 AM org.apache.beam.sdk.io.FileBasedSink$WriteOperation moveToOutputFiles
INFO: Will copy temporary file FileResult{tempFilename=/tmp/junit5344049447634916163/.temp-beam-c6d341bb-0966-4dcd-8c8b-fb715ecb28ce/e83962494cb9b4e1-3ced-46ba-ba44-cb3b23cb0da1, shard=8, window=org.apache.beam.sdk.transforms.windowing.GlobalWindow@7c8f8206, paneInfo=PaneInfo.NO_FIRING} to final location /tmp/junit5344049447634916163/file.txt-00008-of-00035
Feb 27, 2022 12:15:55 AM org.apache.beam.sdk.io.FileBasedSink$WriteOperation moveToOutputFiles
INFO: Will copy temporary file FileResult{tempFilename=/tmp/junit5344049447634916163/.temp-beam-c6d341bb-0966-4dcd-8c8b-fb715ecb28ce/b8844f3eca66d362-bc62-4a23-8a16-3146be1000b2, shard=9, window=org.apache.beam.sdk.transforms.windowing.GlobalWindow@7c8f8206, paneInfo=PaneInfo.NO_FIRING} to final location /tmp/junit5344049447634916163/file.txt-00009-of-00035
Feb 27, 2022 12:15:55 AM org.apache.beam.sdk.io.FileBasedSink$WriteOperation moveToOutputFiles
INFO: Will copy temporary file FileResult{tempFilename=/tmp/junit5344049447634916163/.temp-beam-c6d341bb-0966-4dcd-8c8b-fb715ecb28ce/b4d002133a553afc-509c-4de2-9fb6-3934a4588817, shard=10, window=org.apache.beam.sdk.transforms.windowing.GlobalWindow@7c8f8206, paneInfo=PaneInfo.NO_FIRING} to final location /tmp/junit5344049447634916163/file.txt-00010-of-00035
Feb 27, 2022 12:15:55 AM org.apache.beam.sdk.io.FileBasedSink$WriteOperation moveToOutputFiles
INFO: Will copy temporary file FileResult{tempFilename=/tmp/junit5344049447634916163/.temp-beam-c6d341bb-0966-4dcd-8c8b-fb715ecb28ce/ffaa277054724881-0f95-42ff-b619-9d9c9a1ae46c, shard=11, window=org.apache.beam.sdk.transforms.windowing.GlobalWindow@7c8f8206, paneInfo=PaneInfo.NO_FIRING} to final location /tmp/junit5344049447634916163/file.txt-00011-of-00035
Feb 27, 2022 12:15:55 AM org.apache.beam.sdk.io.FileBasedSink$WriteOperation moveToOutputFiles
INFO: Will copy temporary file FileResult{tempFilename=/tmp/junit5344049447634916163/.temp-beam-c6d341bb-0966-4dcd-8c8b-fb715ecb28ce/b349a491d407b191-8bc8-4c63-a7bb-90779de68a00, shard=12, window=org.apache.beam.sdk.transforms.windowing.GlobalWindow@7c8f8206, paneInfo=PaneInfo.NO_FIRING} to final location /tmp/junit5344049447634916163/file.txt-00012-of-00035
Feb 27, 2022 12:15:55 AM org.apache.beam.sdk.io.FileBasedSink$WriteOperation moveToOutputFiles
INFO: Will copy temporary file FileResult{tempFilename=/tmp/junit5344049447634916163/.temp-beam-c6d341bb-0966-4dcd-8c8b-fb715ecb28ce/711e4c05d6e7fc6b-3aa5-4494-8bcd-b34777bdfba9, shard=13, window=org.apache.beam.sdk.transforms.windowing.GlobalWindow@7c8f8206, paneInfo=PaneInfo.NO_FIRING} to final location /tmp/junit5344049447634916163/file.txt-00013-of-00035
Feb 27, 2022 12:15:55 AM org.apache.beam.sdk.io.FileBasedSink$WriteOperation moveToOutputFiles
INFO: Will copy temporary file FileResult{tempFilename=/tmp/junit5344049447634916163/.temp-beam-c6d341bb-0966-4dcd-8c8b-fb715ecb28ce/2a2c70ca9319cae1-432e-44d5-9f37-0724ceed2fc5, shard=14, window=org.apache.beam.sdk.transforms.windowing.GlobalWindow@7c8f8206, paneInfo=PaneInfo.NO_FIRING} to final location /tmp/junit5344049447634916163/file.txt-00014-of-00035
Feb 27, 2022 12:15:55 AM org.apache.beam.sdk.io.FileBasedSink$WriteOperation moveToOutputFiles
INFO: Will copy temporary file FileResult{tempFilename=/tmp/junit5344049447634916163/.temp-beam-c6d341bb-0966-4dcd-8c8b-fb715ecb28ce/e6824e9eb727cc12-0069-412b-a30d-005cd06ca08a, shard=15, window=org.apache.beam.sdk.transforms.windowing.GlobalWindow@7c8f8206, paneInfo=PaneInfo.NO_FIRING} to final location /tmp/junit5344049447634916163/file.txt-00015-of-00035
Feb 27, 2022 12:15:55 AM org.apache.beam.sdk.io.FileBasedSink$WriteOperation moveToOutputFiles
INFO: Will copy temporary file FileResult{tempFilename=/tmp/junit5344049447634916163/.temp-beam-c6d341bb-0966-4dcd-8c8b-fb715ecb28ce/ec10d152e0e0737e-421d-4bd3-9924-08f7db2a57ff, shard=16, window=org.apache.beam.sdk.transforms.windowing.GlobalWindow@7c8f8206, paneInfo=PaneInfo.NO_FIRING} to final location /tmp/junit5344049447634916163/file.txt-00016-of-00035
Feb 27, 2022 12:15:55 AM org.apache.beam.sdk.io.FileBasedSink$WriteOperation moveToOutputFiles
INFO: Will copy temporary file FileResult{tempFilename=/tmp/junit5344049447634916163/.temp-beam-c6d341bb-0966-4dcd-8c8b-fb715ecb28ce/2c302c962a8884b9-d2e6-4d34-bfe9-06d92bff23b0, shard=17, window=org.apache.beam.sdk.transforms.windowing.GlobalWindow@7c8f8206, paneInfo=PaneInfo.NO_FIRING} to final location /tmp/junit5344049447634916163/file.txt-00017-of-00035
Feb 27, 2022 12:15:55 AM org.apache.beam.sdk.io.FileBasedSink$WriteOperation moveToOutputFiles
INFO: Will copy temporary file FileResult{tempFilename=/tmp/junit5344049447634916163/.temp-beam-c6d341bb-0966-4dcd-8c8b-fb715ecb28ce/24a73963b1ebc9ab-d8af-4bb6-9fcd-d7d747762be2, shard=18, window=org.apache.beam.sdk.transforms.windowing.GlobalWindow@7c8f8206, paneInfo=PaneInfo.NO_FIRING} to final location /tmp/junit5344049447634916163/file.txt-00018-of-00035
Feb 27, 2022 12:15:55 AM org.apache.beam.sdk.io.FileBasedSink$WriteOperation moveToOutputFiles
INFO: Will copy temporary file FileResult{tempFilename=/tmp/junit5344049447634916163/.temp-beam-c6d341bb-0966-4dcd-8c8b-fb715ecb28ce/acc165b0a08c5007-e704-4f53-96ce-7a202c31ef67, shard=19, window=org.apache.beam.sdk.transforms.windowing.GlobalWindow@7c8f8206, paneInfo=PaneInfo.NO_FIRING} to final location /tmp/junit5344049447634916163/file.txt-00019-of-00035
Feb 27, 2022 12:15:55 AM org.apache.beam.sdk.io.FileBasedSink$WriteOperation moveToOutputFiles
INFO: Will copy temporary file FileResult{tempFilename=/tmp/junit5344049447634916163/.temp-beam-c6d341bb-0966-4dcd-8c8b-fb715ecb28ce/29acfd8a9dc61c08-6889-4f3e-bfa7-74032fabf29c, shard=20, window=org.apache.beam.sdk.transforms.windowing.GlobalWindow@7c8f8206, paneInfo=PaneInfo.NO_FIRING} to final location /tmp/junit5344049447634916163/file.txt-00020-of-00035
Feb 27, 2022 12:15:55 AM org.apache.beam.sdk.io.FileBasedSink$WriteOperation moveToOutputFiles
INFO: Will copy temporary file FileResult{tempFilename=/tmp/junit5344049447634916163/.temp-beam-c6d341bb-0966-4dcd-8c8b-fb715ecb28ce/aa785e4f9faea8d5-81b9-4383-9427-013f4a82d885, shard=21, window=org.apache.beam.sdk.transforms.windowing.GlobalWindow@7c8f8206, paneInfo=PaneInfo.NO_FIRING} to final location /tmp/junit5344049447634916163/file.txt-00021-of-00035
Feb 27, 2022 12:15:55 AM org.apache.beam.sdk.io.FileBasedSink$WriteOperation moveToOutputFiles
INFO: Will copy temporary file FileResult{tempFilename=/tmp/junit5344049447634916163/.temp-beam-c6d341bb-0966-4dcd-8c8b-fb715ecb28ce/533c1a6f479a0411-a6b3-4b45-bd71-a91115944275, shard=22, window=org.apache.beam.sdk.transforms.windowing.GlobalWindow@7c8f8206, paneInfo=PaneInfo.NO_FIRING} to final location /tmp/junit5344049447634916163/file.txt-00022-of-00035
Feb 27, 2022 12:15:55 AM org.apache.beam.sdk.io.FileBasedSink$WriteOperation moveToOutputFiles
INFO: Will copy temporary file FileResult{tempFilename=/tmp/junit5344049447634916163/.temp-beam-c6d341bb-0966-4dcd-8c8b-fb715ecb28ce/92f993886adcf29e-3fd9-472a-b21c-80cf3f985a27, shard=23, window=org.apache.beam.sdk.transforms.windowing.GlobalWindow@7c8f8206, paneInfo=PaneInfo.NO_FIRING} to final location /tmp/junit5344049447634916163/file.txt-00023-of-00035
Feb 27, 2022 12:15:55 AM org.apache.beam.sdk.io.FileBasedSink$WriteOperation moveToOutputFiles
INFO: Will copy temporary file FileResult{tempFilename=/tmp/junit5344049447634916163/.temp-beam-c6d341bb-0966-4dcd-8c8b-fb715ecb28ce/0870329369a29e16-41b6-4214-baaa-1d9d4bd78831, shard=24, window=org.apache.beam.sdk.transforms.windowing.GlobalWindow@7c8f8206, paneInfo=PaneInfo.NO_FIRING} to final location /tmp/junit5344049447634916163/file.txt-00024-of-00035
Feb 27, 2022 12:15:55 AM org.apache.beam.sdk.io.FileBasedSink$WriteOperation moveToOutputFiles
INFO: Will copy temporary file FileResult{tempFilename=/tmp/junit5344049447634916163/.temp-beam-c6d341bb-0966-4dcd-8c8b-fb715ecb28ce/0cc81ab7fe574519-b0ac-488c-aa40-e520d0c71e9a, shard=25, window=org.apache.beam.sdk.transforms.windowing.GlobalWindow@7c8f8206, paneInfo=PaneInfo.NO_FIRING} to final location /tmp/junit5344049447634916163/file.txt-00025-of-00035
Feb 27, 2022 12:15:55 AM org.apache.beam.sdk.io.FileBasedSink$WriteOperation moveToOutputFiles
INFO: Will copy temporary file FileResult{tempFilename=/tmp/junit5344049447634916163/.temp-beam-c6d341bb-0966-4dcd-8c8b-fb715ecb28ce/00f22e1489f2a357-c4ea-413b-8569-40cfd45b2f37, shard=26, window=org.apache.beam.sdk.transforms.windowing.GlobalWindow@7c8f8206, paneInfo=PaneInfo.NO_FIRING} to final location /tmp/junit5344049447634916163/file.txt-00026-of-00035
Feb 27, 2022 12:15:55 AM org.apache.beam.sdk.io.FileBasedSink$WriteOperation moveToOutputFiles
INFO: Will copy temporary file FileResult{tempFilename=/tmp/junit5344049447634916163/.temp-beam-c6d341bb-0966-4dcd-8c8b-fb715ecb28ce/e724ea8d7d5cd721-4517-4cfd-b211-40a399fcfb36, shard=27, window=org.apache.beam.sdk.transforms.windowing.GlobalWindow@7c8f8206, paneInfo=PaneInfo.NO_FIRING} to final location /tmp/junit5344049447634916163/file.txt-00027-of-00035
Feb 27, 2022 12:15:55 AM org.apache.beam.sdk.io.FileBasedSink$WriteOperation moveToOutputFiles
INFO: Will copy temporary file FileResult{tempFilename=/tmp/junit5344049447634916163/.temp-beam-c6d341bb-0966-4dcd-8c8b-fb715ecb28ce/146bfc778fa80a99-a716-4e2c-8b29-8b20179ee798, shard=28, window=org.apache.beam.sdk.transforms.windowing.GlobalWindow@7c8f8206, paneInfo=PaneInfo.NO_FIRING} to final location /tmp/junit5344049447634916163/file.txt-00028-of-00035
Feb 27, 2022 12:15:55 AM org.apache.beam.sdk.io.FileBasedSink$WriteOperation moveToOutputFiles
INFO: Will copy temporary file FileResult{tempFilename=/tmp/junit5344049447634916163/.temp-beam-c6d341bb-0966-4dcd-8c8b-fb715ecb28ce/744eab5d63538a1c-2ecd-4061-9413-8b5a73844c48, shard=29, window=org.apache.beam.sdk.transforms.windowing.GlobalWindow@7c8f8206, paneInfo=PaneInfo.NO_FIRING} to final location /tmp/junit5344049447634916163/file.txt-00029-of-00035
Feb 27, 2022 12:15:55 AM org.apache.beam.sdk.io.FileBasedSink$WriteOperation moveToOutputFiles
INFO: Will copy temporary file FileResult{tempFilename=/tmp/junit5344049447634916163/.temp-beam-c6d341bb-0966-4dcd-8c8b-fb715ecb28ce/dd27e1b78f43f4cf-2f56-4f6a-8fcb-484526aa02c6, shard=30, window=org.apache.beam.sdk.transforms.windowing.GlobalWindow@7c8f8206, paneInfo=PaneInfo.NO_FIRING} to final location /tmp/junit5344049447634916163/file.txt-00030-of-00035
Feb 27, 2022 12:15:55 AM org.apache.beam.sdk.io.FileBasedSink$WriteOperation moveToOutputFiles
INFO: Will copy temporary file FileResult{tempFilename=/tmp/junit5344049447634916163/.temp-beam-c6d341bb-0966-4dcd-8c8b-fb715ecb28ce/b2cd8490eae78a82-0a12-4eb0-bc19-3439a2e36c19, shard=31, window=org.apache.beam.sdk.transforms.windowing.GlobalWindow@7c8f8206, paneInfo=PaneInfo.NO_FIRING} to final location /tmp/junit5344049447634916163/file.txt-00031-of-00035
Feb 27, 2022 12:15:55 AM org.apache.beam.sdk.io.FileBasedSink$WriteOperation moveToOutputFiles
INFO: Will copy temporary file FileResult{tempFilename=/tmp/junit5344049447634916163/.temp-beam-c6d341bb-0966-4dcd-8c8b-fb715ecb28ce/f48dda3c5c9ea0a5-15fa-4fd2-864b-1b38c144e391, shard=32, window=org.apache.beam.sdk.transforms.windowing.GlobalWindow@7c8f8206, paneInfo=PaneInfo.NO_FIRING} to final location /tmp/junit5344049447634916163/file.txt-00032-of-00035
Feb 27, 2022 12:15:55 AM org.apache.beam.sdk.io.FileBasedSink$WriteOperation moveToOutputFiles
INFO: Will copy temporary file FileResult{tempFilename=/tmp/junit5344049447634916163/.temp-beam-c6d341bb-0966-4dcd-8c8b-fb715ecb28ce/d6461f8cfc65ef33-808c-400c-9593-87b365495934, shard=33, window=org.apache.beam.sdk.transforms.windowing.GlobalWindow@7c8f8206, paneInfo=PaneInfo.NO_FIRING} to final location /tmp/junit5344049447634916163/file.txt-00033-of-00035
Feb 27, 2022 12:15:55 AM org.apache.beam.sdk.io.FileBasedSink$WriteOperation moveToOutputFiles
INFO: Will copy temporary file FileResult{tempFilename=/tmp/junit5344049447634916163/.temp-beam-c6d341bb-0966-4dcd-8c8b-fb715ecb28ce/24ef71668b362600-4c20-42e7-9bf1-65d6128a6dda, shard=34, window=org.apache.beam.sdk.transforms.windowing.GlobalWindow@7c8f8206, paneInfo=PaneInfo.NO_FIRING} to final location /tmp/junit5344049447634916163/file.txt-00034-of-00035
Feb 27, 2022 12:15:55 AM org.apache.beam.sdk.io.FileBasedSink$WriteOperation removeTemporaryFiles
WARNING: Failed to match temporary files under: [/tmp/junit5344049447634916163/.temp-beam-c6d341bb-0966-4dcd-8c8b-fb715ecb28ce/].
921 tests completed, 1 failed, 6 skipped
> Task :runners:direct-java:needsRunnerTests FAILED
> Task :runners:direct-java:packageTests
> Task :runners:direct-java:assemble
> Task :runners:direct-java:analyzeClassesDependencies FROM-CACHE
> Task :runners:direct-java:analyzeTestClassesDependencies SKIPPED
> Task :runners:direct-java:analyzeDependencies UP-TO-DATE
> Task :runners:direct-java:checkstyleMain FROM-CACHE
> Task :runners:direct-java:checkstyleTest FROM-CACHE
> Task :runners:direct-java:javadoc FROM-CACHE
> Task :sdks:java:javadoc:allJavadoc UP-TO-DATE
> Task :runners:direct-java:spotbugsMain FROM-CACHE
> Task :runners:direct-java:spotbugsTest SKIPPED
> Task :runners:direct-java:test FROM-CACHE
> Task :runners:direct-java:validateShadedJarDoesntLeakNonProjectClasses
> Task :runners:direct-java:check
> Task :runners:direct-java:build
> Task :runners:direct-java:buildDependents
> Task :runners:java-fn-execution:buildDependents
> Task :runners:local-java:buildDependents
> Task :sdks:java:harness:buildDependents
> Task :sdks:java:extensions:google-cloud-platform-core:buildDependents
> Task :runners:core-java:buildDependents
> Task :runners:core-construction-java:buildDependents
FAILURE: Build completed with 3 failures.
1: Task failed with an exception.
-----------
* What went wrong:
Execution failed for task ':sdks:java:fn-execution:analyzeClassesDependencies'.
> Dependency analysis found issues.
usedUndeclaredArtifacts
- org.apache.avro:avro:1.8.2@jar
* Try:
> Run with --stacktrace option to get the stack trace.
> Run with --info or --debug option to get more log output.
> Run with --scan to get full insights.
==============================================================================
2: Task failed with an exception.
-----------
* What went wrong:
Execution failed for task ':sdks:java:fn-execution:checkstyleMain'.
> Checkstyle rule violations were found. See the report at: file://<https://ci-beam.apache.org/job/beam_PreCommit_Java_Cron/ws/src/sdks/java/fn-execution/build/reports/checkstyle/main.html>
Checkstyle files with violations: 1
Checkstyle violations by severity: [error:1]
* Try:
> Run with --stacktrace option to get the stack trace.
> Run with --info or --debug option to get more log output.
> Run with --scan to get full insights.
==============================================================================
3: Task failed with an exception.
-----------
* What went wrong:
Execution failed for task ':runners:direct-java:needsRunnerTests'.
> There were failing tests. See the report at: file://<https://ci-beam.apache.org/job/beam_PreCommit_Java_Cron/ws/src/runners/direct-java/build/reports/tests/needsRunnerTests/index.html>
* Try:
> Run with --stacktrace option to get the stack trace.
> Run with --info or --debug option to get more log output.
> Run with --scan to get full insights.
==============================================================================
* Get more help at https://help.gradle.org
Deprecated Gradle features were used in this build, making it incompatible with Gradle 8.0.
You can use '--warning-mode all' to show the individual deprecation warnings and determine if they come from your own scripts or plugins.
See https://docs.gradle.org/7.3.2/userguide/command_line_interface.html#sec:command_line_warnings
Execution optimizations have been disabled for 1 invalid unit(s) of work during this build to ensure correctness.
Please consult deprecation warnings for more details.
BUILD FAILED in 9m 59s
1264 actionable tasks: 497 executed, 765 from cache, 2 up-to-date
Publishing build scan...
https://gradle.com/s/7hjlmqu2ucias
Build step 'Invoke Gradle script' changed build result to FAILURE
Build step 'Invoke Gradle script' marked build as failure
---------------------------------------------------------------------
To unsubscribe, e-mail: builds-unsubscribe@beam.apache.org
For additional commands, e-mail: builds-help@beam.apache.org
Build failed in Jenkins: beam_PreCommit_Java_Cron #5146
Posted by Apache Jenkins Server <je...@builds.apache.org>.
See <https://ci-beam.apache.org/job/beam_PreCommit_Java_Cron/5146/display/redirect>
Changes:
------------------------------------------
[...truncated 2.86 MB...]
<https://ci-beam.apache.org/job/beam_PreCommit_Java_Cron/ws/src/sdks/java/core/src/main/java/org/apache/beam/sdk/state/StateSpecs.java>:107: warning - Tag @see: can't find combining(Coder, CombineFnWithContext) in org.apache.beam.sdk.state.StateSpecs
<https://ci-beam.apache.org/job/beam_PreCommit_Java_Cron/ws/src/sdks/java/core/src/main/java/org/apache/beam/sdk/state/StateSpecs.java>:118: warning - Tag @link: can't find combining(CombineFn) in org.apache.beam.sdk.state.StateSpecs
<https://ci-beam.apache.org/job/beam_PreCommit_Java_Cron/ws/src/sdks/java/core/src/main/java/org/apache/beam/sdk/state/StateSpecs.java>:137: warning - Tag @link: can't find combining(CombineFnWithContext) in org.apache.beam.sdk.state.StateSpecs
59 warnings
> Task :runners:samza:check
> Task :runners:samza:build
> Task :sdks:java:extensions:sbe:spotbugsTest SKIPPED
> Task :sdks:java:io:azure:compileJava
> Task :sdks:java:io:azure:classes
> Task :sdks:java:io:azure:jar
> Task :sdks:java:io:azure:assemble
> Task :sdks:java:extensions:sbe:spotbugsMain
> Task :sdks:java:extensions:protobuf:spotbugsMain
> Task :sdks:java:io:elasticsearch:spotbugsTest SKIPPED
> Task :sdks:java:io:elasticsearch:test NO-SOURCE
> Task :sdks:java:io:hadoop-common:assemble
> Task :sdks:java:io:azure:analyzeClassesDependencies
> Task :sdks:java:io:hadoop-common:analyzeClassesDependencies
> Task :sdks:java:io:hadoop-common:compileTestJava FROM-CACHE
> Task :sdks:java:core:spotbugsTest SKIPPED
> Task :sdks:java:extensions:protobuf:test
> Task :sdks:java:extensions:protobuf:check
> Task :sdks:java:extensions:protobuf:build
> Task :sdks:java:io:hadoop-common:testClasses UP-TO-DATE
> Task :sdks:java:io:hadoop-common:analyzeTestClassesDependencies SKIPPED
> Task :sdks:java:io:hadoop-common:analyzeDependencies
> Task :sdks:java:io:hadoop-common:checkstyleMain
> Task :sdks:java:io:hadoop-common:checkstyleTest
> Task :sdks:java:extensions:sbe:test
> Task :sdks:java:extensions:sbe:check
> Task :sdks:java:extensions:sbe:build
> Task :sdks:java:extensions:sbe:buildDependents
> Task :sdks:java:container:java8:copyDockerfileDependencies
> Task :sdks:java:io:azure:compileTestJava
Note: <https://ci-beam.apache.org/job/beam_PreCommit_Java_Cron/ws/src/sdks/java/io/azure/src/test/java/org/apache/beam/sdk/io/azure/blobstore/AzfsResourceIdTest.java> uses or overrides a deprecated API.
Note: Recompile with -Xlint:deprecation for details.
Note: <https://ci-beam.apache.org/job/beam_PreCommit_Java_Cron/ws/src/sdks/java/io/azure/src/test/java/org/apache/beam/sdk/io/azure/blobstore/AzureBlobStoreFileSystemTest.java> uses unchecked or unsafe operations.
Note: Recompile with -Xlint:unchecked for details.
> Task :sdks:java:io:azure:testClasses
> Task :sdks:java:io:azure:analyzeTestClassesDependencies SKIPPED
> Task :sdks:java:io:azure:analyzeDependencies
> Task :sdks:java:io:azure:checkstyleMain
> Task :sdks:java:io:common:test
> Task :sdks:java:io:common:check
> Task :sdks:java:io:common:build
> Task :sdks:java:io:hadoop-common:javadoc
> Task :sdks:java:io:azure:checkstyleTest
> Task :release:go-licenses:java:dockerRun
+ rm -rf '/output/*'
+ export GO111MODULE=off
+ GO111MODULE=off
+ go get github.com/apache/beam/sdks/java/container
> Task :sdks:java:io:azure:javadoc
> Task :sdks:java:io:hadoop-common:spotbugsMain
> Task :sdks:java:io:azure:spotbugsTest SKIPPED
> Task :sdks:java:io:elasticsearch:spotbugsMain
> Task :sdks:java:io:elasticsearch:check
> Task :sdks:java:io:elasticsearch:build
> Task :sdks:java:io:hadoop-common:spotbugsTest SKIPPED
> Task :sdks:java:core:spotbugsMain
> Task :sdks:java:io:hadoop-common:test
> Task :sdks:java:io:hadoop-common:check
> Task :sdks:java:io:hadoop-common:build
> Task :sdks:java:javadoc:allJavadoc
> Task :sdks:java:io:azure:spotbugsMain
> Task :sdks:java:core:test
> Task :sdks:java:container:java8:copySdkHarnessLauncher
Execution optimizations have been disabled for task ':sdks:java:container:java8:copySdkHarnessLauncher' to ensure correctness due to the following reasons:
- Gradle detected a problem with the following location: '<https://ci-beam.apache.org/job/beam_PreCommit_Java_Cron/ws/src/sdks/java/container/build/target'.> Reason: Task ':sdks:java:container:java8:copySdkHarnessLauncher' uses this output of task ':sdks:java:container:downloadCloudProfilerAgent' without declaring an explicit or implicit dependency. This can lead to incorrect results being produced, depending on what order the tasks are executed. Please refer to https://docs.gradle.org/7.3.2/userguide/validation_problems.html#implicit_dependency for more details about this problem.
- Gradle detected a problem with the following location: '<https://ci-beam.apache.org/job/beam_PreCommit_Java_Cron/ws/src/sdks/java/container/build/target'.> Reason: Task ':sdks:java:container:java8:copySdkHarnessLauncher' uses this output of task ':sdks:java:container:pullLicenses' without declaring an explicit or implicit dependency. This can lead to incorrect results being produced, depending on what order the tasks are executed. Please refer to https://docs.gradle.org/7.3.2/userguide/validation_problems.html#implicit_dependency for more details about this problem.
> Task :sdks:java:container:pullLicenses
> Task :sdks:java:io:azure:test
> Task :sdks:java:io:azure:check
> Task :sdks:java:io:azure:build
> Task :sdks:java:io:azure:buildDependents
> Task :sdks:java:container:java8:copyJavaThirdPartyLicenses
> Task :runners:samza:job-server:startShadowScripts
> Task :runners:samza:job-server:shadowDistTar
> Task :sdks:java:extensions:sql:jdbc:shadowJarTest
> Task :sdks:java:extensions:sql:jdbc:preCommit
> Task :sdks:java:io:elasticsearch-tests:elasticsearch-tests-7:check
> Task :sdks:java:io:elasticsearch-tests:elasticsearch-tests-7:build
> Task :sdks:java:io:elasticsearch-tests:elasticsearch-tests-7:buildDependents
> Task :runners:samza:job-server:shadowDistZip
> Task :runners:samza:job-server:assemble
> Task :runners:samza:job-server:analyzeClassesDependencies
> Task :runners:samza:job-server:analyzeTestClassesDependencies SKIPPED
> Task :runners:samza:job-server:analyzeDependencies
> Task :runners:samza:job-server:checkstyleMain NO-SOURCE
> Task :runners:samza:job-server:checkstyleTest NO-SOURCE
> Task :runners:samza:job-server:javadoc NO-SOURCE
> Task :runners:samza:job-server:spotbugsMain NO-SOURCE
> Task :runners:samza:job-server:spotbugsTest SKIPPED
> Task :runners:samza:job-server:test NO-SOURCE
> Task :runners:samza:job-server:check
> Task :runners:samza:job-server:build
> Task :runners:samza:job-server:buildDependents
> Task :runners:samza:buildDependents
> Task :runners:java-job-service:buildDependents
> Task :sdks:java:io:elasticsearch-tests:elasticsearch-tests-5:check
> Task :sdks:java:io:elasticsearch-tests:elasticsearch-tests-5:build
> Task :sdks:java:io:elasticsearch-tests:elasticsearch-tests-5:buildDependents
> Task :sdks:java:io:elasticsearch-tests:elasticsearch-tests-6:check
> Task :sdks:java:io:elasticsearch-tests:elasticsearch-tests-6:build
> Task :sdks:java:io:elasticsearch-tests:elasticsearch-tests-6:buildDependents
> Task :sdks:java:io:elasticsearch-tests:elasticsearch-tests-common:buildDependents
> Task :sdks:java:io:elasticsearch:buildDependents
> Task :release:go-licenses:java:dockerRun
+ go-licenses save github.com/apache/beam/sdks/java/container --save_path=/output/licenses
+ go-licenses csv github.com/apache/beam/sdks/java/container
+ tee /output/licenses/list.csv
> Task :sdks:java:core:validateShadedJarDoesntLeakNonProjectClasses
> Task :sdks:java:core:check
> Task :sdks:java:core:build
> Task :sdks:java:core:buildNeeded
> Task :release:go-licenses:java:dockerRun
github.com/apache/beam/sdks/java/container,https://github.com/apache/beam/blob/master/LICENSE,Apache-2.0
golang.org/x/sys,https://go.googlesource.com/sys/+/refs/heads/master/LICENSE,BSD-3-Clause
github.com/apache/beam/sdks/go/pkg/beam,https://github.com/apache/beam/blob/master/sdks/go/README.md,Apache-2.0
google.golang.org/grpc,https://github.com/grpc/grpc-go/blob/master/LICENSE,Apache-2.0
golang.org/x/net,https://go.googlesource.com/net/+/refs/heads/master/LICENSE,BSD-3-Clause
github.com/golang/protobuf,https://github.com/golang/protobuf/blob/master/LICENSE,BSD-3-Clause
google.golang.org/protobuf,https://go.googlesource.com/protobuf/+/refs/heads/master/LICENSE,BSD-3-Clause
google.golang.org/genproto/googleapis/rpc/status,https://github.com/googleapis/go-genproto/blob/master/LICENSE,Apache-2.0
golang.org/x/text,https://go.googlesource.com/text/+/refs/heads/master/LICENSE,BSD-3-Clause
+ chmod -R a+w /output/licenses
> Task :release:go-licenses:java:createLicenses
> Task :sdks:java:container:java8:copyGolangLicenses
> Task :sdks:java:container:java8:dockerPrepare
> Task :sdks:java:testing:nexmark:check
> Task :sdks:java:testing:nexmark:build
> Task :sdks:java:testing:nexmark:buildDependents
> Task :sdks:java:extensions:sql:zetasql:buildDependents
> Task :sdks:java:extensions:sql:buildDependents
> Task :sdks:java:extensions:join-library:buildDependents
> Task :sdks:java:io:kafka:buildDependents
> Task :sdks:java:io:mongodb:buildDependents
> Task :sdks:java:io:parquet:buildDependents
> Task :sdks:java:io:synthetic:buildDependents
> Task :sdks:java:io:thrift:buildDependents
> Task :sdks:java:io:hadoop-common:buildDependents
> Task :sdks:java:container:java8:docker
---> e025071766bc
Step 15/19 : COPY target/LICENSE target/go-licenses/* /opt/apache/beam/third_party_licenses/golang/
---> 26c7336cc3c6
Step 16/19 : RUN rm /opt/apache/beam/third_party_licenses/golang/LICENSE
---> Running in 516c503b6a8f
Removing intermediate container 516c503b6a8f
---> 1f00d94e56e2
Step 17/19 : RUN if [ "${pull_licenses}" = "false" ] ; then rm -rf /opt/apache/beam/third_party_licenses ; fi
---> Running in 0d6b5dc9fa74
Removing intermediate container 0d6b5dc9fa74
---> e6869af1fe10
Step 18/19 : COPY target/profiler/* /opt/google_cloud_profiler/
---> 0d1dbd6dfcda
Step 19/19 : ENTRYPOINT ["/opt/apache/beam/boot"]
---> Running in ba122eb2a29b
Removing intermediate container ba122eb2a29b
---> 47f68779698f
Successfully built 47f68779698f
Successfully tagged apache/beam_java8_sdk:2.38.0.dev
FAILURE: Build completed with 4 failures.
1: Task failed with an exception.
-----------
* What went wrong:
Execution failed for task ':sdks:java:io:clickhouse:test'.
> There were failing tests. See the report at: file://<https://ci-beam.apache.org/job/beam_PreCommit_Java_Cron/ws/src/sdks/java/io/clickhouse/build/reports/tests/test/index.html>
* Try:
> Run with --stacktrace option to get the stack trace.
> Run with --info or --debug option to get more log output.
> Run with --scan to get full insights.
==============================================================================
2: Task failed with an exception.
-----------
* What went wrong:
Execution failed for task ':sdks:java:io:google-cloud-platform:test'.
> There were failing tests. See the report at: file://<https://ci-beam.apache.org/job/beam_PreCommit_Java_Cron/ws/src/sdks/java/io/google-cloud-platform/build/reports/tests/test/index.html>
* Try:
> Run with --stacktrace option to get the stack trace.
> Run with --info or --debug option to get more log output.
> Run with --scan to get full insights.
==============================================================================
3: Task failed with an exception.
-----------
* What went wrong:
Execution failed for task ':sdks:java:fn-execution:analyzeClassesDependencies'.
> Dependency analysis found issues.
usedUndeclaredArtifacts
- org.apache.avro:avro:1.8.2@jar
* Try:
> Run with --stacktrace option to get the stack trace.
> Run with --info or --debug option to get more log output.
> Run with --scan to get full insights.
==============================================================================
4: Task failed with an exception.
-----------
* What went wrong:
Execution failed for task ':sdks:java:fn-execution:checkstyleMain'.
> Checkstyle rule violations were found. See the report at: file://<https://ci-beam.apache.org/job/beam_PreCommit_Java_Cron/ws/src/sdks/java/fn-execution/build/reports/checkstyle/main.html>
Checkstyle files with violations: 1
Checkstyle violations by severity: [error:1]
* Try:
> Run with --stacktrace option to get the stack trace.
> Run with --info or --debug option to get more log output.
> Run with --scan to get full insights.
==============================================================================
* Get more help at https://help.gradle.org
Deprecated Gradle features were used in this build, making it incompatible with Gradle 8.0.
You can use '--warning-mode all' to show the individual deprecation warnings and determine if they come from your own scripts or plugins.
See https://docs.gradle.org/7.3.2/userguide/command_line_interface.html#sec:command_line_warnings
Execution optimizations have been disabled for 1 invalid unit(s) of work during this build to ensure correctness.
Please consult deprecation warnings for more details.
BUILD FAILED in 40m 14s
1264 actionable tasks: 1124 executed, 138 from cache, 2 up-to-date
Publishing build scan...
https://gradle.com/s/r67osjldx4pw4
Build step 'Invoke Gradle script' changed build result to FAILURE
Build step 'Invoke Gradle script' marked build as failure
---------------------------------------------------------------------
To unsubscribe, e-mail: builds-unsubscribe@beam.apache.org
For additional commands, e-mail: builds-help@beam.apache.org
Build failed in Jenkins: beam_PreCommit_Java_Cron #5145
Posted by Apache Jenkins Server <je...@builds.apache.org>.
See <https://ci-beam.apache.org/job/beam_PreCommit_Java_Cron/5145/display/redirect>
Changes:
------------------------------------------
[...truncated 3.11 MB...]
INFO: Successfully wrote temporary file /tmp/junit5773422466901852714/.temp-beam-2a15aeea-d35a-48ca-b197-9a20fe4c0c66/a7c8d57ba4ba2071-ee0d-4b78-b531-23bdc8dbd742
Feb 26, 2022 12:24:06 PM org.apache.beam.sdk.io.FileBasedSink$Writer close
INFO: Successfully wrote temporary file /tmp/junit5773422466901852714/.temp-beam-2a15aeea-d35a-48ca-b197-9a20fe4c0c66/b0fee24dc852860d-e6ef-4d74-bbba-4b423068b1d7
Feb 26, 2022 12:24:06 PM org.apache.beam.sdk.io.FileBasedSink$Writer close
INFO: Successfully wrote temporary file /tmp/junit5773422466901852714/.temp-beam-2a15aeea-d35a-48ca-b197-9a20fe4c0c66/6bbe5035c1e426dc-6b86-432a-8ebc-52f953d37922
Feb 26, 2022 12:24:06 PM org.apache.beam.sdk.io.FileBasedSink$Writer close
INFO: Successfully wrote temporary file /tmp/junit5773422466901852714/.temp-beam-2a15aeea-d35a-48ca-b197-9a20fe4c0c66/cf3e9a1a826172a0-222f-4e30-960c-3d7f1f6a1909
Feb 26, 2022 12:24:06 PM org.apache.beam.sdk.io.WriteFiles$WriteUnshardedTempFilesFn processElement
INFO: Opening writer 3ae91d40-9bfe-4d65-8fdb-3b70de89fa5d for window org.apache.beam.sdk.transforms.windowing.GlobalWindow@7c8f8206 pane PaneInfo.NO_FIRING destination null
Feb 26, 2022 12:24:06 PM org.apache.beam.sdk.io.WriteFiles$WriteUnshardedTempFilesFn processElement
INFO: Opening writer c7f8a5ea-2225-4938-b92e-08b034da58b2 for window org.apache.beam.sdk.transforms.windowing.GlobalWindow@7c8f8206 pane PaneInfo.NO_FIRING destination null
Feb 26, 2022 12:24:06 PM org.apache.beam.sdk.io.WriteFiles$WriteUnshardedTempFilesFn processElement
INFO: Opening writer 9862b32e-912c-4449-b074-571aee9e4aa7 for window org.apache.beam.sdk.transforms.windowing.GlobalWindow@7c8f8206 pane PaneInfo.NO_FIRING destination null
Feb 26, 2022 12:24:06 PM org.apache.beam.sdk.io.FileBasedSink$Writer close
INFO: Successfully wrote temporary file /tmp/junit5773422466901852714/.temp-beam-2a15aeea-d35a-48ca-b197-9a20fe4c0c66/3730c0403ae91d40-9bfe-4d65-8fdb-3b70de89fa5d
Feb 26, 2022 12:24:06 PM org.apache.beam.sdk.io.FileBasedSink$Writer close
INFO: Successfully wrote temporary file /tmp/junit5773422466901852714/.temp-beam-2a15aeea-d35a-48ca-b197-9a20fe4c0c66/ab7d7ffac7f8a5ea-2225-4938-b92e-08b034da58b2
Feb 26, 2022 12:24:06 PM org.apache.beam.sdk.io.WriteFiles$WriteUnshardedTempFilesFn processElement
INFO: Opening writer f70b0767-e35f-43b3-a1ea-5664e7da42b9 for window org.apache.beam.sdk.transforms.windowing.GlobalWindow@7c8f8206 pane PaneInfo.NO_FIRING destination null
Feb 26, 2022 12:24:06 PM org.apache.beam.sdk.io.FileBasedSink$Writer close
INFO: Successfully wrote temporary file /tmp/junit5773422466901852714/.temp-beam-2a15aeea-d35a-48ca-b197-9a20fe4c0c66/af5828f19862b32e-912c-4449-b074-571aee9e4aa7
Feb 26, 2022 12:24:06 PM org.apache.beam.sdk.io.FileBasedSink$Writer close
INFO: Successfully wrote temporary file /tmp/junit5773422466901852714/.temp-beam-2a15aeea-d35a-48ca-b197-9a20fe4c0c66/a330d713f70b0767-e35f-43b3-a1ea-5664e7da42b9
Feb 26, 2022 12:24:06 PM org.apache.beam.sdk.io.WriteFiles$WriteUnshardedTempFilesFn processElement
INFO: Opening writer 0e791b7f-5b39-472b-b5c2-9baf6b267ded for window org.apache.beam.sdk.transforms.windowing.GlobalWindow@7c8f8206 pane PaneInfo.NO_FIRING destination null
Feb 26, 2022 12:24:06 PM org.apache.beam.sdk.io.FileBasedSink$Writer close
INFO: Successfully wrote temporary file /tmp/junit5773422466901852714/.temp-beam-2a15aeea-d35a-48ca-b197-9a20fe4c0c66/601230df0e791b7f-5b39-472b-b5c2-9baf6b267ded
Feb 26, 2022 12:24:06 PM org.apache.beam.sdk.io.WriteFiles$WriteUnshardedTempFilesFn processElement
INFO: Opening writer 41933554-f7a8-46d1-a71a-64f0457b7435 for window org.apache.beam.sdk.transforms.windowing.GlobalWindow@7c8f8206 pane PaneInfo.NO_FIRING destination null
Feb 26, 2022 12:24:06 PM org.apache.beam.sdk.io.FileBasedSink$Writer close
INFO: Successfully wrote temporary file /tmp/junit5773422466901852714/.temp-beam-2a15aeea-d35a-48ca-b197-9a20fe4c0c66/58b2f0ec41933554-f7a8-46d1-a71a-64f0457b7435
Feb 26, 2022 12:24:06 PM org.apache.beam.sdk.io.WriteFiles$WriteUnshardedTempFilesFn processElement
INFO: Opening writer dd73a19c-f310-4ea4-9298-b02d8df173b7 for window org.apache.beam.sdk.transforms.windowing.GlobalWindow@7c8f8206 pane PaneInfo.NO_FIRING destination null
Feb 26, 2022 12:24:06 PM org.apache.beam.sdk.io.FileBasedSink$Writer close
INFO: Successfully wrote temporary file /tmp/junit5773422466901852714/.temp-beam-2a15aeea-d35a-48ca-b197-9a20fe4c0c66/f7bebb7edd73a19c-f310-4ea4-9298-b02d8df173b7
Feb 26, 2022 12:24:06 PM org.apache.beam.sdk.io.WriteFiles$WriteUnshardedTempFilesFn processElement
INFO: Opening writer 926eaddd-79ae-487a-9f2e-b3eea817a609 for window org.apache.beam.sdk.transforms.windowing.GlobalWindow@7c8f8206 pane PaneInfo.NO_FIRING destination null
Feb 26, 2022 12:24:06 PM org.apache.beam.sdk.io.FileBasedSink$Writer close
INFO: Successfully wrote temporary file /tmp/junit5773422466901852714/.temp-beam-2a15aeea-d35a-48ca-b197-9a20fe4c0c66/cc3e9cbf926eaddd-79ae-487a-9f2e-b3eea817a609
Feb 26, 2022 12:24:06 PM org.apache.beam.sdk.io.WriteFiles$WriteUnshardedTempFilesFn processElement
INFO: Opening writer f0449479-6378-45cc-a10a-5ec3064db626 for window org.apache.beam.sdk.transforms.windowing.GlobalWindow@7c8f8206 pane PaneInfo.NO_FIRING destination null
Feb 26, 2022 12:24:06 PM org.apache.beam.sdk.io.FileBasedSink$Writer close
INFO: Successfully wrote temporary file /tmp/junit5773422466901852714/.temp-beam-2a15aeea-d35a-48ca-b197-9a20fe4c0c66/e44686d7f0449479-6378-45cc-a10a-5ec3064db626
Feb 26, 2022 12:24:06 PM org.apache.beam.sdk.io.WriteFiles$WriteUnshardedTempFilesFn processElement
INFO: Opening writer 54335b65-83af-43fc-9fc0-f3b3314128cb for window org.apache.beam.sdk.transforms.windowing.GlobalWindow@7c8f8206 pane PaneInfo.NO_FIRING destination null
Feb 26, 2022 12:24:06 PM org.apache.beam.sdk.io.WriteFiles$WriteUnshardedTempFilesFn processElement
INFO: Opening writer 354c448f-3af6-4247-8c0d-80e72596fa0b for window org.apache.beam.sdk.transforms.windowing.GlobalWindow@7c8f8206 pane PaneInfo.NO_FIRING destination null
Feb 26, 2022 12:24:06 PM org.apache.beam.sdk.io.FileBasedSink$Writer close
INFO: Successfully wrote temporary file /tmp/junit5773422466901852714/.temp-beam-2a15aeea-d35a-48ca-b197-9a20fe4c0c66/e8800c4b54335b65-83af-43fc-9fc0-f3b3314128cb
Feb 26, 2022 12:24:06 PM org.apache.beam.sdk.io.WriteFiles$WriteUnshardedTempFilesFn processElement
INFO: Opening writer f6aa1fb1-3329-442e-b627-0c0dbb83daac for window org.apache.beam.sdk.transforms.windowing.GlobalWindow@7c8f8206 pane PaneInfo.NO_FIRING destination null
Feb 26, 2022 12:24:06 PM org.apache.beam.sdk.io.FileBasedSink$Writer close
INFO: Successfully wrote temporary file /tmp/junit5773422466901852714/.temp-beam-2a15aeea-d35a-48ca-b197-9a20fe4c0c66/4a98235a354c448f-3af6-4247-8c0d-80e72596fa0b
Feb 26, 2022 12:24:06 PM org.apache.beam.sdk.io.FileBasedSink$Writer close
INFO: Successfully wrote temporary file /tmp/junit5773422466901852714/.temp-beam-2a15aeea-d35a-48ca-b197-9a20fe4c0c66/eeee68c8f6aa1fb1-3329-442e-b627-0c0dbb83daac
Feb 26, 2022 12:24:06 PM org.apache.beam.sdk.io.WriteFiles$WriteUnshardedTempFilesFn processElement
INFO: Opening writer a2a99cc4-04c5-45fe-aa37-7b2ad50cc4f4 for window org.apache.beam.sdk.transforms.windowing.GlobalWindow@7c8f8206 pane PaneInfo.NO_FIRING destination null
Feb 26, 2022 12:24:06 PM org.apache.beam.sdk.io.FileBasedSink$Writer close
INFO: Successfully wrote temporary file /tmp/junit5773422466901852714/.temp-beam-2a15aeea-d35a-48ca-b197-9a20fe4c0c66/e249c0e7a2a99cc4-04c5-45fe-aa37-7b2ad50cc4f4
Feb 26, 2022 12:24:06 PM org.apache.beam.sdk.io.WriteFiles$WriteUnshardedTempFilesFn processElement
INFO: Opening writer 4a0e9097-2e2d-4aed-be16-2a40a75a6f3b for window org.apache.beam.sdk.transforms.windowing.GlobalWindow@7c8f8206 pane PaneInfo.NO_FIRING destination null
Feb 26, 2022 12:24:06 PM org.apache.beam.sdk.io.WriteFiles$WriteUnshardedTempFilesFn processElement
INFO: Opening writer f0c83edc-5aee-4cab-8e8a-05582b784884 for window org.apache.beam.sdk.transforms.windowing.GlobalWindow@7c8f8206 pane PaneInfo.NO_FIRING destination null
Feb 26, 2022 12:24:06 PM org.apache.beam.sdk.io.FileBasedSink$Writer close
INFO: Successfully wrote temporary file /tmp/junit5773422466901852714/.temp-beam-2a15aeea-d35a-48ca-b197-9a20fe4c0c66/f9719f624a0e9097-2e2d-4aed-be16-2a40a75a6f3b
Feb 26, 2022 12:24:06 PM org.apache.beam.sdk.io.FileBasedSink$Writer close
INFO: Successfully wrote temporary file /tmp/junit5773422466901852714/.temp-beam-2a15aeea-d35a-48ca-b197-9a20fe4c0c66/269eec17f0c83edc-5aee-4cab-8e8a-05582b784884
Feb 26, 2022 12:24:06 PM org.apache.beam.sdk.io.WriteFiles$WriteUnshardedTempFilesFn processElement
INFO: Opening writer d7a01ef4-bedc-49cc-b6fa-bc6afaae73ad for window org.apache.beam.sdk.transforms.windowing.GlobalWindow@7c8f8206 pane PaneInfo.NO_FIRING destination null
Feb 26, 2022 12:24:06 PM org.apache.beam.sdk.io.FileBasedSink$Writer close
INFO: Successfully wrote temporary file /tmp/junit5773422466901852714/.temp-beam-2a15aeea-d35a-48ca-b197-9a20fe4c0c66/463118e2d7a01ef4-bedc-49cc-b6fa-bc6afaae73ad
Feb 26, 2022 12:24:06 PM org.apache.beam.sdk.io.WriteFiles$WriteUnshardedTempFilesFn processElement
INFO: Opening writer 1ed7ceeb-65dc-4f8f-a1a5-f8facf5ba4d9 for window org.apache.beam.sdk.transforms.windowing.GlobalWindow@7c8f8206 pane PaneInfo.NO_FIRING destination null
Feb 26, 2022 12:24:06 PM org.apache.beam.sdk.io.FileBasedSink$Writer close
INFO: Successfully wrote temporary file /tmp/junit5773422466901852714/.temp-beam-2a15aeea-d35a-48ca-b197-9a20fe4c0c66/6ed686691ed7ceeb-65dc-4f8f-a1a5-f8facf5ba4d9
Feb 26, 2022 12:24:06 PM org.apache.beam.sdk.io.WriteFiles$WriteUnshardedTempFilesFn processElement
INFO: Opening writer 5c48a7e4-3f6f-43f1-a611-7215357cef51 for window org.apache.beam.sdk.transforms.windowing.GlobalWindow@7c8f8206 pane PaneInfo.NO_FIRING destination null
Feb 26, 2022 12:24:06 PM org.apache.beam.sdk.io.WriteFiles$WriteUnshardedTempFilesFn processElement
INFO: Opening writer 7d0a3e0c-1554-4980-9c13-95c7671e5375 for window org.apache.beam.sdk.transforms.windowing.GlobalWindow@7c8f8206 pane PaneInfo.NO_FIRING destination null
Feb 26, 2022 12:24:06 PM org.apache.beam.sdk.io.WriteFiles$WriteUnshardedTempFilesFn processElement
INFO: Opening writer 616ca3d3-5d75-4927-ad8c-a161501c4c66 for window org.apache.beam.sdk.transforms.windowing.GlobalWindow@7c8f8206 pane PaneInfo.NO_FIRING destination null
Feb 26, 2022 12:24:06 PM org.apache.beam.sdk.io.FileBasedSink$Writer close
INFO: Successfully wrote temporary file /tmp/junit5773422466901852714/.temp-beam-2a15aeea-d35a-48ca-b197-9a20fe4c0c66/204505935c48a7e4-3f6f-43f1-a611-7215357cef51
Feb 26, 2022 12:24:06 PM org.apache.beam.sdk.io.FileBasedSink$Writer close
INFO: Successfully wrote temporary file /tmp/junit5773422466901852714/.temp-beam-2a15aeea-d35a-48ca-b197-9a20fe4c0c66/c6db8e127d0a3e0c-1554-4980-9c13-95c7671e5375
Feb 26, 2022 12:24:06 PM org.apache.beam.sdk.io.FileBasedSink$Writer close
INFO: Successfully wrote temporary file /tmp/junit5773422466901852714/.temp-beam-2a15aeea-d35a-48ca-b197-9a20fe4c0c66/5fa8011f616ca3d3-5d75-4927-ad8c-a161501c4c66
Feb 26, 2022 12:24:06 PM org.apache.beam.sdk.io.WriteFiles$FinalizeTempFileBundles$FinalizeFn process
INFO: Finalizing 34 file results
Feb 26, 2022 12:24:06 PM org.apache.beam.sdk.io.FileBasedSink$WriteOperation createMissingEmptyShards
INFO: Finalizing for destination null num shards 34.
Feb 26, 2022 12:24:06 PM org.apache.beam.sdk.io.FileBasedSink$WriteOperation moveToOutputFiles
INFO: Will copy temporary file FileResult{tempFilename=/tmp/junit5773422466901852714/.temp-beam-2a15aeea-d35a-48ca-b197-9a20fe4c0c66/601230df0e791b7f-5b39-472b-b5c2-9baf6b267ded, shard=0, window=org.apache.beam.sdk.transforms.windowing.GlobalWindow@7c8f8206, paneInfo=PaneInfo.NO_FIRING} to final location /tmp/junit5773422466901852714/file.txt-00000-of-00034
Feb 26, 2022 12:24:06 PM org.apache.beam.sdk.io.FileBasedSink$WriteOperation moveToOutputFiles
INFO: Will copy temporary file FileResult{tempFilename=/tmp/junit5773422466901852714/.temp-beam-2a15aeea-d35a-48ca-b197-9a20fe4c0c66/4a98235a354c448f-3af6-4247-8c0d-80e72596fa0b, shard=1, window=org.apache.beam.sdk.transforms.windowing.GlobalWindow@7c8f8206, paneInfo=PaneInfo.NO_FIRING} to final location /tmp/junit5773422466901852714/file.txt-00001-of-00034
Feb 26, 2022 12:24:06 PM org.apache.beam.sdk.io.FileBasedSink$WriteOperation moveToOutputFiles
INFO: Will copy temporary file FileResult{tempFilename=/tmp/junit5773422466901852714/.temp-beam-2a15aeea-d35a-48ca-b197-9a20fe4c0c66/58b2f0ec41933554-f7a8-46d1-a71a-64f0457b7435, shard=2, window=org.apache.beam.sdk.transforms.windowing.GlobalWindow@7c8f8206, paneInfo=PaneInfo.NO_FIRING} to final location /tmp/junit5773422466901852714/file.txt-00002-of-00034
Feb 26, 2022 12:24:06 PM org.apache.beam.sdk.io.FileBasedSink$WriteOperation moveToOutputFiles
INFO: Will copy temporary file FileResult{tempFilename=/tmp/junit5773422466901852714/.temp-beam-2a15aeea-d35a-48ca-b197-9a20fe4c0c66/b0fee24dc852860d-e6ef-4d74-bbba-4b423068b1d7, shard=3, window=org.apache.beam.sdk.transforms.windowing.GlobalWindow@7c8f8206, paneInfo=PaneInfo.NO_FIRING} to final location /tmp/junit5773422466901852714/file.txt-00003-of-00034
Feb 26, 2022 12:24:06 PM org.apache.beam.sdk.io.FileBasedSink$WriteOperation moveToOutputFiles
INFO: Will copy temporary file FileResult{tempFilename=/tmp/junit5773422466901852714/.temp-beam-2a15aeea-d35a-48ca-b197-9a20fe4c0c66/cc3e9cbf926eaddd-79ae-487a-9f2e-b3eea817a609, shard=4, window=org.apache.beam.sdk.transforms.windowing.GlobalWindow@7c8f8206, paneInfo=PaneInfo.NO_FIRING} to final location /tmp/junit5773422466901852714/file.txt-00004-of-00034
Feb 26, 2022 12:24:06 PM org.apache.beam.sdk.io.FileBasedSink$WriteOperation moveToOutputFiles
INFO: Will copy temporary file FileResult{tempFilename=/tmp/junit5773422466901852714/.temp-beam-2a15aeea-d35a-48ca-b197-9a20fe4c0c66/e8800c4b54335b65-83af-43fc-9fc0-f3b3314128cb, shard=5, window=org.apache.beam.sdk.transforms.windowing.GlobalWindow@7c8f8206, paneInfo=PaneInfo.NO_FIRING} to final location /tmp/junit5773422466901852714/file.txt-00005-of-00034
Feb 26, 2022 12:24:06 PM org.apache.beam.sdk.io.FileBasedSink$WriteOperation moveToOutputFiles
INFO: Will copy temporary file FileResult{tempFilename=/tmp/junit5773422466901852714/.temp-beam-2a15aeea-d35a-48ca-b197-9a20fe4c0c66/a7c8d57ba4ba2071-ee0d-4b78-b531-23bdc8dbd742, shard=6, window=org.apache.beam.sdk.transforms.windowing.GlobalWindow@7c8f8206, paneInfo=PaneInfo.NO_FIRING} to final location /tmp/junit5773422466901852714/file.txt-00006-of-00034
Feb 26, 2022 12:24:06 PM org.apache.beam.sdk.io.FileBasedSink$WriteOperation moveToOutputFiles
INFO: Will copy temporary file FileResult{tempFilename=/tmp/junit5773422466901852714/.temp-beam-2a15aeea-d35a-48ca-b197-9a20fe4c0c66/e249c0e7a2a99cc4-04c5-45fe-aa37-7b2ad50cc4f4, shard=7, window=org.apache.beam.sdk.transforms.windowing.GlobalWindow@7c8f8206, paneInfo=PaneInfo.NO_FIRING} to final location /tmp/junit5773422466901852714/file.txt-00007-of-00034
Feb 26, 2022 12:24:06 PM org.apache.beam.sdk.io.FileBasedSink$WriteOperation moveToOutputFiles
INFO: Will copy temporary file FileResult{tempFilename=/tmp/junit5773422466901852714/.temp-beam-2a15aeea-d35a-48ca-b197-9a20fe4c0c66/8c7a2ac050ba978c-b248-44cc-a8bb-c878841e809c, shard=8, window=org.apache.beam.sdk.transforms.windowing.GlobalWindow@7c8f8206, paneInfo=PaneInfo.NO_FIRING} to final location /tmp/junit5773422466901852714/file.txt-00008-of-00034
Feb 26, 2022 12:24:06 PM org.apache.beam.sdk.io.FileBasedSink$WriteOperation moveToOutputFiles
INFO: Will copy temporary file FileResult{tempFilename=/tmp/junit5773422466901852714/.temp-beam-2a15aeea-d35a-48ca-b197-9a20fe4c0c66/d557c65b5aeed0a2-f822-415e-8a28-8d2bee6f96da, shard=9, window=org.apache.beam.sdk.transforms.windowing.GlobalWindow@7c8f8206, paneInfo=PaneInfo.NO_FIRING} to final location /tmp/junit5773422466901852714/file.txt-00009-of-00034
Feb 26, 2022 12:24:06 PM org.apache.beam.sdk.io.FileBasedSink$WriteOperation moveToOutputFiles
INFO: Will copy temporary file FileResult{tempFilename=/tmp/junit5773422466901852714/.temp-beam-2a15aeea-d35a-48ca-b197-9a20fe4c0c66/e44686d7f0449479-6378-45cc-a10a-5ec3064db626, shard=10, window=org.apache.beam.sdk.transforms.windowing.GlobalWindow@7c8f8206, paneInfo=PaneInfo.NO_FIRING} to final location /tmp/junit5773422466901852714/file.txt-00010-of-00034
Feb 26, 2022 12:24:06 PM org.apache.beam.sdk.io.FileBasedSink$WriteOperation moveToOutputFiles
INFO: Will copy temporary file FileResult{tempFilename=/tmp/junit5773422466901852714/.temp-beam-2a15aeea-d35a-48ca-b197-9a20fe4c0c66/cf3e9a1a826172a0-222f-4e30-960c-3d7f1f6a1909, shard=11, window=org.apache.beam.sdk.transforms.windowing.GlobalWindow@7c8f8206, paneInfo=PaneInfo.NO_FIRING} to final location /tmp/junit5773422466901852714/file.txt-00011-of-00034
Feb 26, 2022 12:24:06 PM org.apache.beam.sdk.io.FileBasedSink$WriteOperation moveToOutputFiles
INFO: Will copy temporary file FileResult{tempFilename=/tmp/junit5773422466901852714/.temp-beam-2a15aeea-d35a-48ca-b197-9a20fe4c0c66/f7bebb7edd73a19c-f310-4ea4-9298-b02d8df173b7, shard=12, window=org.apache.beam.sdk.transforms.windowing.GlobalWindow@7c8f8206, paneInfo=PaneInfo.NO_FIRING} to final location /tmp/junit5773422466901852714/file.txt-00012-of-00034
Feb 26, 2022 12:24:06 PM org.apache.beam.sdk.io.FileBasedSink$WriteOperation moveToOutputFiles
INFO: Will copy temporary file FileResult{tempFilename=/tmp/junit5773422466901852714/.temp-beam-2a15aeea-d35a-48ca-b197-9a20fe4c0c66/4e5930f5b04bbf83-0f40-4cbe-b940-cab0cd917a20, shard=13, window=org.apache.beam.sdk.transforms.windowing.GlobalWindow@7c8f8206, paneInfo=PaneInfo.NO_FIRING} to final location /tmp/junit5773422466901852714/file.txt-00013-of-00034
Feb 26, 2022 12:24:06 PM org.apache.beam.sdk.io.FileBasedSink$WriteOperation moveToOutputFiles
INFO: Will copy temporary file FileResult{tempFilename=/tmp/junit5773422466901852714/.temp-beam-2a15aeea-d35a-48ca-b197-9a20fe4c0c66/41951904f407e429-0597-4705-9003-528537d59437, shard=14, window=org.apache.beam.sdk.transforms.windowing.GlobalWindow@7c8f8206, paneInfo=PaneInfo.NO_FIRING} to final location /tmp/junit5773422466901852714/file.txt-00014-of-00034
Feb 26, 2022 12:24:06 PM org.apache.beam.sdk.io.FileBasedSink$WriteOperation moveToOutputFiles
INFO: Will copy temporary file FileResult{tempFilename=/tmp/junit5773422466901852714/.temp-beam-2a15aeea-d35a-48ca-b197-9a20fe4c0c66/3730c0403ae91d40-9bfe-4d65-8fdb-3b70de89fa5d, shard=15, window=org.apache.beam.sdk.transforms.windowing.GlobalWindow@7c8f8206, paneInfo=PaneInfo.NO_FIRING} to final location /tmp/junit5773422466901852714/file.txt-00015-of-00034
Feb 26, 2022 12:24:06 PM org.apache.beam.sdk.io.FileBasedSink$WriteOperation moveToOutputFiles
INFO: Will copy temporary file FileResult{tempFilename=/tmp/junit5773422466901852714/.temp-beam-2a15aeea-d35a-48ca-b197-9a20fe4c0c66/af5828f19862b32e-912c-4449-b074-571aee9e4aa7, shard=16, window=org.apache.beam.sdk.transforms.windowing.GlobalWindow@7c8f8206, paneInfo=PaneInfo.NO_FIRING} to final location /tmp/junit5773422466901852714/file.txt-00016-of-00034
Feb 26, 2022 12:24:06 PM org.apache.beam.sdk.io.FileBasedSink$WriteOperation moveToOutputFiles
INFO: Will copy temporary file FileResult{tempFilename=/tmp/junit5773422466901852714/.temp-beam-2a15aeea-d35a-48ca-b197-9a20fe4c0c66/269eec17f0c83edc-5aee-4cab-8e8a-05582b784884, shard=17, window=org.apache.beam.sdk.transforms.windowing.GlobalWindow@7c8f8206, paneInfo=PaneInfo.NO_FIRING} to final location /tmp/junit5773422466901852714/file.txt-00017-of-00034
Feb 26, 2022 12:24:06 PM org.apache.beam.sdk.io.FileBasedSink$WriteOperation moveToOutputFiles
INFO: Will copy temporary file FileResult{tempFilename=/tmp/junit5773422466901852714/.temp-beam-2a15aeea-d35a-48ca-b197-9a20fe4c0c66/463118e2d7a01ef4-bedc-49cc-b6fa-bc6afaae73ad, shard=18, window=org.apache.beam.sdk.transforms.windowing.GlobalWindow@7c8f8206, paneInfo=PaneInfo.NO_FIRING} to final location /tmp/junit5773422466901852714/file.txt-00018-of-00034
Feb 26, 2022 12:24:06 PM org.apache.beam.sdk.io.FileBasedSink$WriteOperation moveToOutputFiles
INFO: Will copy temporary file FileResult{tempFilename=/tmp/junit5773422466901852714/.temp-beam-2a15aeea-d35a-48ca-b197-9a20fe4c0c66/204505935c48a7e4-3f6f-43f1-a611-7215357cef51, shard=19, window=org.apache.beam.sdk.transforms.windowing.GlobalWindow@7c8f8206, paneInfo=PaneInfo.NO_FIRING} to final location /tmp/junit5773422466901852714/file.txt-00019-of-00034
Feb 26, 2022 12:24:06 PM org.apache.beam.sdk.io.FileBasedSink$WriteOperation moveToOutputFiles
INFO: Will copy temporary file FileResult{tempFilename=/tmp/junit5773422466901852714/.temp-beam-2a15aeea-d35a-48ca-b197-9a20fe4c0c66/f9719f624a0e9097-2e2d-4aed-be16-2a40a75a6f3b, shard=20, window=org.apache.beam.sdk.transforms.windowing.GlobalWindow@7c8f8206, paneInfo=PaneInfo.NO_FIRING} to final location /tmp/junit5773422466901852714/file.txt-00020-of-00034
Feb 26, 2022 12:24:06 PM org.apache.beam.sdk.io.FileBasedSink$WriteOperation moveToOutputFiles
INFO: Will copy temporary file FileResult{tempFilename=/tmp/junit5773422466901852714/.temp-beam-2a15aeea-d35a-48ca-b197-9a20fe4c0c66/c6db8e127d0a3e0c-1554-4980-9c13-95c7671e5375, shard=21, window=org.apache.beam.sdk.transforms.windowing.GlobalWindow@7c8f8206, paneInfo=PaneInfo.NO_FIRING} to final location /tmp/junit5773422466901852714/file.txt-00021-of-00034
Feb 26, 2022 12:24:06 PM org.apache.beam.sdk.io.FileBasedSink$WriteOperation moveToOutputFiles
INFO: Will copy temporary file FileResult{tempFilename=/tmp/junit5773422466901852714/.temp-beam-2a15aeea-d35a-48ca-b197-9a20fe4c0c66/a0ebc7b974116cb6-91e2-4734-a51e-fd14319a50ce, shard=22, window=org.apache.beam.sdk.transforms.windowing.GlobalWindow@7c8f8206, paneInfo=PaneInfo.NO_FIRING} to final location /tmp/junit5773422466901852714/file.txt-00022-of-00034
Feb 26, 2022 12:24:06 PM org.apache.beam.sdk.io.FileBasedSink$WriteOperation moveToOutputFiles
INFO: Will copy temporary file FileResult{tempFilename=/tmp/junit5773422466901852714/.temp-beam-2a15aeea-d35a-48ca-b197-9a20fe4c0c66/93540d5c684d779b-7616-421f-94e3-88c1396f7bf2, shard=23, window=org.apache.beam.sdk.transforms.windowing.GlobalWindow@7c8f8206, paneInfo=PaneInfo.NO_FIRING} to final location /tmp/junit5773422466901852714/file.txt-00023-of-00034
Feb 26, 2022 12:24:06 PM org.apache.beam.sdk.io.FileBasedSink$WriteOperation moveToOutputFiles
INFO: Will copy temporary file FileResult{tempFilename=/tmp/junit5773422466901852714/.temp-beam-2a15aeea-d35a-48ca-b197-9a20fe4c0c66/5fa8011f616ca3d3-5d75-4927-ad8c-a161501c4c66, shard=24, window=org.apache.beam.sdk.transforms.windowing.GlobalWindow@7c8f8206, paneInfo=PaneInfo.NO_FIRING} to final location /tmp/junit5773422466901852714/file.txt-00024-of-00034
Feb 26, 2022 12:24:06 PM org.apache.beam.sdk.io.FileBasedSink$WriteOperation moveToOutputFiles
INFO: Will copy temporary file FileResult{tempFilename=/tmp/junit5773422466901852714/.temp-beam-2a15aeea-d35a-48ca-b197-9a20fe4c0c66/8f5610960c105f99-e3f6-43d3-bc05-d0305e87871c, shard=25, window=org.apache.beam.sdk.transforms.windowing.GlobalWindow@7c8f8206, paneInfo=PaneInfo.NO_FIRING} to final location /tmp/junit5773422466901852714/file.txt-00025-of-00034
Feb 26, 2022 12:24:06 PM org.apache.beam.sdk.io.FileBasedSink$WriteOperation moveToOutputFiles
INFO: Will copy temporary file FileResult{tempFilename=/tmp/junit5773422466901852714/.temp-beam-2a15aeea-d35a-48ca-b197-9a20fe4c0c66/eeee68c8f6aa1fb1-3329-442e-b627-0c0dbb83daac, shard=26, window=org.apache.beam.sdk.transforms.windowing.GlobalWindow@7c8f8206, paneInfo=PaneInfo.NO_FIRING} to final location /tmp/junit5773422466901852714/file.txt-00026-of-00034
Feb 26, 2022 12:24:06 PM org.apache.beam.sdk.io.FileBasedSink$WriteOperation moveToOutputFiles
INFO: Will copy temporary file FileResult{tempFilename=/tmp/junit5773422466901852714/.temp-beam-2a15aeea-d35a-48ca-b197-9a20fe4c0c66/ab7d7ffac7f8a5ea-2225-4938-b92e-08b034da58b2, shard=27, window=org.apache.beam.sdk.transforms.windowing.GlobalWindow@7c8f8206, paneInfo=PaneInfo.NO_FIRING} to final location /tmp/junit5773422466901852714/file.txt-00027-of-00034
Feb 26, 2022 12:24:06 PM org.apache.beam.sdk.io.FileBasedSink$WriteOperation moveToOutputFiles
INFO: Will copy temporary file FileResult{tempFilename=/tmp/junit5773422466901852714/.temp-beam-2a15aeea-d35a-48ca-b197-9a20fe4c0c66/6ed686691ed7ceeb-65dc-4f8f-a1a5-f8facf5ba4d9, shard=28, window=org.apache.beam.sdk.transforms.windowing.GlobalWindow@7c8f8206, paneInfo=PaneInfo.NO_FIRING} to final location /tmp/junit5773422466901852714/file.txt-00028-of-00034
Feb 26, 2022 12:24:06 PM org.apache.beam.sdk.io.FileBasedSink$WriteOperation moveToOutputFiles
INFO: Will copy temporary file FileResult{tempFilename=/tmp/junit5773422466901852714/.temp-beam-2a15aeea-d35a-48ca-b197-9a20fe4c0c66/5877e97331d45e8b-fb27-4b28-a632-f6d3dfc200fb, shard=29, window=org.apache.beam.sdk.transforms.windowing.GlobalWindow@7c8f8206, paneInfo=PaneInfo.NO_FIRING} to final location /tmp/junit5773422466901852714/file.txt-00029-of-00034
Feb 26, 2022 12:24:06 PM org.apache.beam.sdk.io.FileBasedSink$WriteOperation moveToOutputFiles
INFO: Will copy temporary file FileResult{tempFilename=/tmp/junit5773422466901852714/.temp-beam-2a15aeea-d35a-48ca-b197-9a20fe4c0c66/6bbe5035c1e426dc-6b86-432a-8ebc-52f953d37922, shard=30, window=org.apache.beam.sdk.transforms.windowing.GlobalWindow@7c8f8206, paneInfo=PaneInfo.NO_FIRING} to final location /tmp/junit5773422466901852714/file.txt-00030-of-00034
Feb 26, 2022 12:24:06 PM org.apache.beam.sdk.io.FileBasedSink$WriteOperation moveToOutputFiles
INFO: Will copy temporary file FileResult{tempFilename=/tmp/junit5773422466901852714/.temp-beam-2a15aeea-d35a-48ca-b197-9a20fe4c0c66/a330d713f70b0767-e35f-43b3-a1ea-5664e7da42b9, shard=31, window=org.apache.beam.sdk.transforms.windowing.GlobalWindow@7c8f8206, paneInfo=PaneInfo.NO_FIRING} to final location /tmp/junit5773422466901852714/file.txt-00031-of-00034
Feb 26, 2022 12:24:06 PM org.apache.beam.sdk.io.FileBasedSink$WriteOperation moveToOutputFiles
INFO: Will copy temporary file FileResult{tempFilename=/tmp/junit5773422466901852714/.temp-beam-2a15aeea-d35a-48ca-b197-9a20fe4c0c66/79af3d3221b9ea3c-596d-4916-ab6a-aba3e95b562a, shard=32, window=org.apache.beam.sdk.transforms.windowing.GlobalWindow@7c8f8206, paneInfo=PaneInfo.NO_FIRING} to final location /tmp/junit5773422466901852714/file.txt-00032-of-00034
Feb 26, 2022 12:24:06 PM org.apache.beam.sdk.io.FileBasedSink$WriteOperation moveToOutputFiles
INFO: Will copy temporary file FileResult{tempFilename=/tmp/junit5773422466901852714/.temp-beam-2a15aeea-d35a-48ca-b197-9a20fe4c0c66/7c6552b4592d53c7-da8a-450d-b5ba-575a5137eddf, shard=33, window=org.apache.beam.sdk.transforms.windowing.GlobalWindow@7c8f8206, paneInfo=PaneInfo.NO_FIRING} to final location /tmp/junit5773422466901852714/file.txt-00033-of-00034
Feb 26, 2022 12:24:06 PM org.apache.beam.sdk.io.FileBasedSink$WriteOperation removeTemporaryFiles
WARNING: Failed to match temporary files under: [/tmp/junit5773422466901852714/.temp-beam-2a15aeea-d35a-48ca-b197-9a20fe4c0c66/].
921 tests completed, 1 failed, 6 skipped
> Task :runners:direct-java:needsRunnerTests FAILED
> Task :runners:direct-java:packageTests
> Task :runners:direct-java:assemble
> Task :runners:direct-java:analyzeTestClassesDependencies SKIPPED
> Task :runners:direct-java:analyzeDependencies
> Task :runners:direct-java:checkstyleTest
> Task :runners:direct-java:javadoc FROM-CACHE
> Task :sdks:java:javadoc:allJavadoc UP-TO-DATE
> Task :runners:direct-java:spotbugsMain FROM-CACHE
> Task :runners:direct-java:spotbugsTest SKIPPED
> Task :runners:direct-java:test FROM-CACHE
> Task :runners:direct-java:validateShadedJarDoesntLeakNonProjectClasses
> Task :runners:direct-java:check
> Task :runners:direct-java:build
> Task :runners:direct-java:buildDependents
> Task :runners:java-fn-execution:buildDependents
> Task :sdks:java:harness:buildDependents
> Task :runners:local-java:buildDependents
> Task :sdks:java:extensions:google-cloud-platform-core:buildDependents
> Task :runners:core-java:buildDependents
> Task :runners:core-construction-java:buildDependents
FAILURE: Build completed with 3 failures.
1: Task failed with an exception.
-----------
* What went wrong:
Execution failed for task ':sdks:java:fn-execution:analyzeClassesDependencies'.
> Dependency analysis found issues.
usedUndeclaredArtifacts
- org.apache.avro:avro:1.8.2@jar
* Try:
> Run with --stacktrace option to get the stack trace.
> Run with --info or --debug option to get more log output.
> Run with --scan to get full insights.
==============================================================================
2: Task failed with an exception.
-----------
* What went wrong:
Execution failed for task ':sdks:java:fn-execution:checkstyleMain'.
> Checkstyle rule violations were found. See the report at: file://<https://ci-beam.apache.org/job/beam_PreCommit_Java_Cron/ws/src/sdks/java/fn-execution/build/reports/checkstyle/main.html>
Checkstyle files with violations: 1
Checkstyle violations by severity: [error:1]
* Try:
> Run with --stacktrace option to get the stack trace.
> Run with --info or --debug option to get more log output.
> Run with --scan to get full insights.
==============================================================================
3: Task failed with an exception.
-----------
* What went wrong:
Execution failed for task ':runners:direct-java:needsRunnerTests'.
> There were failing tests. See the report at: file://<https://ci-beam.apache.org/job/beam_PreCommit_Java_Cron/ws/src/runners/direct-java/build/reports/tests/needsRunnerTests/index.html>
* Try:
> Run with --stacktrace option to get the stack trace.
> Run with --info or --debug option to get more log output.
> Run with --scan to get full insights.
==============================================================================
* Get more help at https://help.gradle.org
Deprecated Gradle features were used in this build, making it incompatible with Gradle 8.0.
You can use '--warning-mode all' to show the individual deprecation warnings and determine if they come from your own scripts or plugins.
See https://docs.gradle.org/7.3.2/userguide/command_line_interface.html#sec:command_line_warnings
Execution optimizations have been disabled for 1 invalid unit(s) of work during this build to ensure correctness.
Please consult deprecation warnings for more details.
BUILD FAILED in 13m 16s
1264 actionable tasks: 600 executed, 662 from cache, 2 up-to-date
Publishing build scan...
https://gradle.com/s/clgv7xklpcihc
Build step 'Invoke Gradle script' changed build result to FAILURE
Build step 'Invoke Gradle script' marked build as failure
---------------------------------------------------------------------
To unsubscribe, e-mail: builds-unsubscribe@beam.apache.org
For additional commands, e-mail: builds-help@beam.apache.org
beam_PreCommit_Java_Cron - Build # 5144 - Aborted!
Posted by Apache Jenkins Server <je...@builds.apache.org>.
beam_PreCommit_Java_Cron - Build # 5144 - Aborted:
Check console output at https://ci-beam.apache.org/job/beam_PreCommit_Java_Cron/5144/ to view the results.
Build failed in Jenkins: beam_PreCommit_Java_Cron #5143
Posted by Apache Jenkins Server <je...@builds.apache.org>.
See <https://ci-beam.apache.org/job/beam_PreCommit_Java_Cron/5143/display/redirect?page=changes>
Changes:
[Ankur Goenka] [BEAM-13952] Sickbaying
[noreply] [BEAM-13912] Add more coverage for dataflow.go (#16903)
[noreply] [BEAM-12563] swaplevel general function for dataframe and series
[noreply] [BEAM-14001] Update coder.go unit tests (#16952)
[noreply] [BEAM-13910] Improve coverage of gcsx package (#16942)
------------------------------------------
[...truncated 2.87 MB...]
> Task :sdks:java:core:javadoc
<https://ci-beam.apache.org/job/beam_PreCommit_Java_Cron/ws/src/sdks/java/core/src/main/java/org/apache/beam/sdk/io/AvroIO.java>:334: warning - Tag @link: can't find continuously(Duration, TerminationCondition) in org.apache.beam.sdk.io.FileIO.Match
<https://ci-beam.apache.org/job/beam_PreCommit_Java_Cron/ws/src/sdks/java/core/src/main/java/org/apache/beam/sdk/io/AvroIO.java>:1034: warning - Tag @link: can't find watchForNewFiles in org.apache.beam.sdk.io.Read
<https://ci-beam.apache.org/job/beam_PreCommit_Java_Cron/ws/src/sdks/java/core/src/main/java/org/apache/beam/sdk/io/AvroIO.java>:1029: warning - Tag @link: can't find withEmptyMatchTreatment in org.apache.beam.sdk.io.Read
<https://ci-beam.apache.org/job/beam_PreCommit_Java_Cron/ws/src/sdks/java/core/src/main/java/org/apache/beam/sdk/io/AvroIO.java>:1046: warning - Tag @link: can't find withHintMatchesManyFiles() in org.apache.beam.sdk.io.Read
<https://ci-beam.apache.org/job/beam_PreCommit_Java_Cron/ws/src/sdks/java/core/src/main/java/org/apache/beam/sdk/io/AvroIO.java>:1240: warning - Tag @link: can't find watchForNewFiles in org.apache.beam.sdk.io.Read
<https://ci-beam.apache.org/job/beam_PreCommit_Java_Cron/ws/src/sdks/java/core/src/main/java/org/apache/beam/sdk/io/AvroIO.java>:1235: warning - Tag @link: can't find withEmptyMatchTreatment in org.apache.beam.sdk.io.Read
<https://ci-beam.apache.org/job/beam_PreCommit_Java_Cron/ws/src/sdks/java/core/src/main/java/org/apache/beam/sdk/io/AvroIO.java>:903: warning - Tag @link: can't find watchForNewFiles in org.apache.beam.sdk.io.Read
<https://ci-beam.apache.org/job/beam_PreCommit_Java_Cron/ws/src/sdks/java/core/src/main/java/org/apache/beam/sdk/io/AvroIO.java>:898: warning - Tag @link: can't find withEmptyMatchTreatment in org.apache.beam.sdk.io.Read
<https://ci-beam.apache.org/job/beam_PreCommit_Java_Cron/ws/src/sdks/java/core/src/main/java/org/apache/beam/sdk/io/AvroIO.java>:1400: warning - Tag @link: can't find to(FilenamePolicy) in org.apache.beam.sdk.io.AvroIO.TypedWrite
<https://ci-beam.apache.org/job/beam_PreCommit_Java_Cron/ws/src/sdks/java/core/src/main/java/org/apache/beam/sdk/io/AvroIO.java>:1400: warning - Tag @link: can't find to(FilenamePolicy) in org.apache.beam.sdk.io.AvroIO.TypedWrite
<https://ci-beam.apache.org/job/beam_PreCommit_Java_Cron/ws/src/sdks/java/core/src/main/java/org/apache/beam/sdk/io/AvroIO.java>:1377: warning - Tag @link: can't find to(FilenamePolicy) in org.apache.beam.sdk.io.AvroIO.TypedWrite
<https://ci-beam.apache.org/job/beam_PreCommit_Java_Cron/ws/src/sdks/java/core/src/main/java/org/apache/beam/sdk/io/AvroIO.java>:1708: warning - Tag @link: can't find to(FilenamePolicy) in org.apache.beam.sdk.io.AvroIO.TypedWrite
> Task :sdks:java:io:hadoop-common:javadoc
> Task :sdks:java:io:hadoop-common:spotbugsTest SKIPPED
> Task :sdks:java:core:javadoc
<https://ci-beam.apache.org/job/beam_PreCommit_Java_Cron/ws/src/sdks/java/core/src/main/java/org/apache/beam/sdk/io/DynamicFileDestinations.java>:136: warning - Tag @link: can't find constant(FilenamePolicy, SerializableFunction) in org.apache.beam.sdk.io.DynamicFileDestinations
<https://ci-beam.apache.org/job/beam_PreCommit_Java_Cron/ws/src/sdks/java/core/src/main/java/org/apache/beam/sdk/io/FileBasedSource.java>:207: warning - Tag @link: can't find FileBasedSource(Metadata, long, long, long) in org.apache.beam.sdk.io.FileBasedSource
<https://ci-beam.apache.org/job/beam_PreCommit_Java_Cron/ws/src/sdks/java/core/src/main/java/org/apache/beam/sdk/io/FileIO.java>:314: warning - Tag @link: can't find withNaming(Write.FileNaming) in org.apache.beam.sdk.io.FileIO.Write
<https://ci-beam.apache.org/job/beam_PreCommit_Java_Cron/ws/src/sdks/java/core/src/main/java/org/apache/beam/sdk/io/FileIO.java>:314: warning - Tag @link: can't find via(Contextful, Sink) in org.apache.beam.sdk.io.FileIO.Write
<https://ci-beam.apache.org/job/beam_PreCommit_Java_Cron/ws/src/sdks/java/core/src/main/java/org/apache/beam/sdk/io/FileIO.java>:334: warning - Tag @link: can't find continuously(Duration,
TerminationCondition) in org.apache.beam.sdk.io.FileIO.MatchAll
<https://ci-beam.apache.org/job/beam_PreCommit_Java_Cron/ws/src/sdks/java/core/src/main/java/org/apache/beam/sdk/io/TextIO.java>:185: warning - Tag @link: can't find continuously(Duration, TerminationCondition) in org.apache.beam.sdk.io.FileIO.Match
<https://ci-beam.apache.org/job/beam_PreCommit_Java_Cron/ws/src/sdks/java/core/src/main/java/org/apache/beam/sdk/io/TextIO.java>:185: warning - Tag @link: can't find to(FilenamePolicy) in org.apache.beam.sdk.io.TextIO.Write
<https://ci-beam.apache.org/job/beam_PreCommit_Java_Cron/ws/src/sdks/java/core/src/main/java/org/apache/beam/sdk/io/TextIO.java>:185: warning - Tag @link: can't find to(DynamicDestinations) in org.apache.beam.sdk.io.TextIO.Write
<https://ci-beam.apache.org/job/beam_PreCommit_Java_Cron/ws/src/sdks/java/core/src/main/java/org/apache/beam/sdk/io/TextIO.java>:260: warning - Tag @link: can't find to(DynamicDestinations) in org.apache.beam.sdk.io.TextIO.Write
<https://ci-beam.apache.org/job/beam_PreCommit_Java_Cron/ws/src/sdks/java/core/src/main/java/org/apache/beam/sdk/io/TextIO.java>:499: warning - Tag @link: can't find watchForNewFiles(Duration, TerminationCondition) in org.apache.beam.sdk.io.Read
<https://ci-beam.apache.org/job/beam_PreCommit_Java_Cron/ws/src/sdks/java/core/src/main/java/org/apache/beam/sdk/io/TextIO.java>:494: warning - Tag @link: can't find withEmptyMatchTreatment in org.apache.beam.sdk.io.Read
<https://ci-beam.apache.org/job/beam_PreCommit_Java_Cron/ws/src/sdks/java/core/src/main/java/org/apache/beam/sdk/io/TextIO.java>:560: warning - Tag @link: can't find withDelimiter in org.apache.beam.sdk.io.Read
<https://ci-beam.apache.org/job/beam_PreCommit_Java_Cron/ws/src/sdks/java/core/src/main/java/org/apache/beam/sdk/io/TextIO.java>:721: warning - Tag @link: can't find to(FilenamePolicy) in org.apache.beam.sdk.io.TextIO.TypedWrite
<https://ci-beam.apache.org/job/beam_PreCommit_Java_Cron/ws/src/sdks/java/core/src/main/java/org/apache/beam/sdk/io/TextIO.java>:795: warning - Tag @link: can't find to(DynamicDestinations) in org.apache.beam.sdk.io.TextIO.TypedWrite
<https://ci-beam.apache.org/job/beam_PreCommit_Java_Cron/ws/src/sdks/java/core/src/main/java/org/apache/beam/sdk/io/TextIO.java>:821: warning - Tag @link: can't find to(FilenamePolicy) in org.apache.beam.sdk.io.TextIO.TypedWrite
<https://ci-beam.apache.org/job/beam_PreCommit_Java_Cron/ws/src/sdks/java/core/src/main/java/org/apache/beam/sdk/io/TextIO.java>:821: warning - Tag @link: can't find to(DynamicDestinations) in org.apache.beam.sdk.io.TextIO.TypedWrite
<https://ci-beam.apache.org/job/beam_PreCommit_Java_Cron/ws/src/sdks/java/core/src/main/java/org/apache/beam/sdk/io/TextIO.java>:833: warning - Tag @link: can't find to(FilenamePolicy) in org.apache.beam.sdk.io.TextIO.TypedWrite
<https://ci-beam.apache.org/job/beam_PreCommit_Java_Cron/ws/src/sdks/java/core/src/main/java/org/apache/beam/sdk/io/TextIO.java>:833: warning - Tag @link: can't find to(DynamicDestinations) in org.apache.beam.sdk.io.TextIO.TypedWrite
<https://ci-beam.apache.org/job/beam_PreCommit_Java_Cron/ws/src/sdks/java/core/src/main/java/org/apache/beam/sdk/io/TextIO.java>:1109: warning - Tag @link: can't find to(DynamicDestinations) in org.apache.beam.sdk.io.TextIO.TypedWrite
<https://ci-beam.apache.org/job/beam_PreCommit_Java_Cron/ws/src/sdks/java/core/src/main/java/org/apache/beam/sdk/io/TextIO.java>:1096: warning - Tag @link: can't find to(FilenamePolicy) in org.apache.beam.sdk.io.TextIO.TypedWrite
<https://ci-beam.apache.org/job/beam_PreCommit_Java_Cron/ws/src/sdks/java/core/src/main/java/org/apache/beam/sdk/io/TextIO.java>:1122: warning - Tag @link: can't find to(SerializableFunction, Params) in org.apache.beam.sdk.io.TextIO.TypedWrite
<https://ci-beam.apache.org/job/beam_PreCommit_Java_Cron/ws/src/sdks/java/core/src/main/java/org/apache/beam/sdk/io/TextIO.java>:1215: warning - Tag @link: can't find to(DynamicDestinations) in org.apache.beam.sdk.io.TextIO.Write
<https://ci-beam.apache.org/job/beam_PreCommit_Java_Cron/ws/src/sdks/java/core/src/main/java/org/apache/beam/sdk/io/TextIO.java>:1215: warning - Tag @link: can't find to(SerializableFunction, Params) in org.apache.beam.sdk.io.TextIO.Write
<https://ci-beam.apache.org/job/beam_PreCommit_Java_Cron/ws/src/sdks/java/core/src/main/java/org/apache/beam/sdk/io/TextIO.java>:1183: warning - Tag @link: can't find withWritableByteChannelFactory(WritableByteChannelFactory) in org.apache.beam.sdk.io.TextIO.TypedWrite
> Task :sdks:java:io:azure:javadoc
> Task :sdks:java:io:azure:spotbugsTest SKIPPED
> Task :sdks:java:core:javadoc
<https://ci-beam.apache.org/job/beam_PreCommit_Java_Cron/ws/src/sdks/java/core/src/main/java/org/apache/beam/sdk/values/PCollection.java>:310: warning - Tag @link:illegal character: "60" in "PCollection<Row>"
<https://ci-beam.apache.org/job/beam_PreCommit_Java_Cron/ws/src/sdks/java/core/src/main/java/org/apache/beam/sdk/values/PCollection.java>:310: warning - Tag @link:illegal character: "62" in "PCollection<Row>"
<https://ci-beam.apache.org/job/beam_PreCommit_Java_Cron/ws/src/sdks/java/core/src/main/java/org/apache/beam/sdk/schemas/SchemaRegistry.java>:291: warning - Tag @link:illegal character: "42" in "* NoSuchSchemaException"
<https://ci-beam.apache.org/job/beam_PreCommit_Java_Cron/ws/src/sdks/java/core/src/main/java/org/apache/beam/sdk/schemas/SchemaRegistry.java>:299: warning - Tag @link:illegal character: "42" in "* NoSuchSchemaException"
> Task :sdks:java:io:elasticsearch:spotbugsMain
> Task :sdks:java:io:elasticsearch:check
> Task :sdks:java:io:elasticsearch:build
> Task :sdks:java:container:pullLicenses
Collecting pip
Using cached pip-22.0.3-py3-none-any.whl (2.1 MB)
Collecting setuptools
Using cached setuptools-60.9.3-py3-none-any.whl (1.1 MB)
> Task :sdks:java:io:hadoop-common:test
> Task :sdks:java:core:javadoc
<https://ci-beam.apache.org/job/beam_PreCommit_Java_Cron/ws/src/sdks/java/core/src/main/java/org/apache/beam/sdk/options/SdkHarnessOptions.java>:241: warning - Tag @link: can't find addOverrideForName(String, LogLevel) in org.apache.beam.sdk.options.SdkHarnessOptions.SdkHarnessLogLevelOverrides
<https://ci-beam.apache.org/job/beam_PreCommit_Java_Cron/ws/src/sdks/java/core/src/main/java/org/apache/beam/sdk/options/SdkHarnessOptions.java>:253: warning - Tag @link: can't find addOverrideForName(String, LogLevel) in org.apache.beam.sdk.options.SdkHarnessOptions.SdkHarnessLogLevelOverrides
<https://ci-beam.apache.org/job/beam_PreCommit_Java_Cron/ws/src/sdks/java/core/src/main/java/org/apache/beam/sdk/state/StateSpecs.java>:89: warning - Tag @see: can't find combining(Coder, CombineFn) in org.apache.beam.sdk.state.StateSpecs
<https://ci-beam.apache.org/job/beam_PreCommit_Java_Cron/ws/src/sdks/java/core/src/main/java/org/apache/beam/sdk/state/StateSpecs.java>:107: warning - Tag @see: can't find combining(Coder, CombineFnWithContext) in org.apache.beam.sdk.state.StateSpecs
<https://ci-beam.apache.org/job/beam_PreCommit_Java_Cron/ws/src/sdks/java/core/src/main/java/org/apache/beam/sdk/state/StateSpecs.java>:118: warning - Tag @link: can't find combining(CombineFn) in org.apache.beam.sdk.state.StateSpecs
<https://ci-beam.apache.org/job/beam_PreCommit_Java_Cron/ws/src/sdks/java/core/src/main/java/org/apache/beam/sdk/state/StateSpecs.java>:137: warning - Tag @link: can't find combining(CombineFnWithContext) in org.apache.beam.sdk.state.StateSpecs
59 warnings
> Task :sdks:java:io:hadoop-common:spotbugsMain
> Task :sdks:java:io:hadoop-common:check
> Task :sdks:java:io:hadoop-common:build
> Task :sdks:java:container:pullLicenses
Collecting wheel
Using cached wheel-0.37.1-py2.py3-none-any.whl (35 kB)
Installing collected packages: pip, setuptools, wheel
Attempting uninstall: pip
Found existing installation: pip 20.0.2
Uninstalling pip-20.0.2:
Successfully uninstalled pip-20.0.2
> Task :sdks:java:javadoc:allJavadoc
> Task :sdks:java:container:pullLicenses
Attempting uninstall: setuptools
Found existing installation: setuptools 44.0.0
Uninstalling setuptools-44.0.0:
Successfully uninstalled setuptools-44.0.0
Successfully installed pip-22.0.3 setuptools-60.9.3 wheel-0.37.1
> Task :sdks:java:core:spotbugsTest SKIPPED
> Task :sdks:java:container:pullLicenses
Collecting beautifulsoup4<5.0,>=4.9.0
Using cached beautifulsoup4-4.10.0-py3-none-any.whl (97 kB)
Collecting pyyaml<6.0.0,>=3.12
Using cached PyYAML-5.4.1-cp38-cp38-manylinux1_x86_64.whl (662 kB)
Collecting tenacity<6.0,>=5.0.2
Using cached tenacity-5.1.5-py2.py3-none-any.whl (34 kB)
Collecting soupsieve>1.2
Using cached soupsieve-2.3.1-py3-none-any.whl (37 kB)
Collecting six>=1.9.0
Using cached six-1.16.0-py2.py3-none-any.whl (11 kB)
Installing collected packages: soupsieve, six, pyyaml, tenacity, beautifulsoup4
Successfully installed beautifulsoup4-4.10.0 pyyaml-5.4.1 six-1.16.0 soupsieve-2.3.1 tenacity-5.1.5
Executing python <https://ci-beam.apache.org/job/beam_PreCommit_Java_Cron/ws/src/sdks/java/container/license_scripts/pull_licenses_java.py> --license_index=<https://ci-beam.apache.org/job/beam_PreCommit_Java_Cron/ws/src/sdks/java/container/build/reports/dependency-license/index.json> --output_dir=<https://ci-beam.apache.org/job/beam_PreCommit_Java_Cron/ws/src/sdks/java/container/build/target/java_third_party_licenses> --dep_url_yaml=<https://ci-beam.apache.org/job/beam_PreCommit_Java_Cron/ws/src/sdks/java/container/license_scripts/dep_urls_java.yaml> --manual_license_path=<https://ci-beam.apache.org/job/beam_PreCommit_Java_Cron/ws/src/sdks/java/container/license_scripts/manual_licenses>
> Task :sdks:java:io:azure:spotbugsMain
> Task :sdks:java:container:pullLicenses
INFO:root:Pulling license for 220 dependencies using 16 threads.
> Task :sdks:java:io:azure:test
> Task :sdks:java:io:azure:check
> Task :sdks:java:io:azure:build
> Task :sdks:java:io:azure:buildDependents
> Task :sdks:java:container:pullLicenses
INFO:root:Replaced local file URL with file://<https://ci-beam.apache.org/job/beam_PreCommit_Java_Cron/ws/src/sdks/java/container/license_scripts/manual_licenses/xz/COPYING> for xz-1.5
> Task :runners:samza:job-server:startShadowScripts
> Task :runners:samza:job-server:shadowDistTar
> Task :sdks:java:container:pullLicenses
INFO:root:pull_licenses_java.py succeed. It took 19.323441 seconds with 16 threads.
Copying licenses from <https://ci-beam.apache.org/job/beam_PreCommit_Java_Cron/ws/src/sdks/java/container/build/target/java_third_party_licenses> to <https://ci-beam.apache.org/job/beam_PreCommit_Java_Cron/ws/src/sdks/java/container/build/target/third_party_licenses.>
Finished license_scripts.sh
> Task :sdks:java:container:java8:copyJavaThirdPartyLicenses
> Task :sdks:java:core:spotbugsMain
> Task :sdks:java:core:test
> Task :sdks:java:io:elasticsearch-tests:elasticsearch-tests-7:check
> Task :sdks:java:io:elasticsearch-tests:elasticsearch-tests-7:build
> Task :sdks:java:io:elasticsearch-tests:elasticsearch-tests-7:buildDependents
> Task :sdks:java:io:elasticsearch-tests:elasticsearch-tests-6:check
> Task :sdks:java:io:elasticsearch-tests:elasticsearch-tests-6:build
> Task :sdks:java:io:elasticsearch-tests:elasticsearch-tests-6:buildDependents
> Task :runners:samza:job-server:shadowDistZip
> Task :runners:samza:job-server:assemble
> Task :runners:samza:job-server:analyzeClassesDependencies
> Task :runners:samza:job-server:analyzeTestClassesDependencies SKIPPED
> Task :runners:samza:job-server:analyzeDependencies
> Task :runners:samza:job-server:checkstyleMain NO-SOURCE
> Task :runners:samza:job-server:checkstyleTest NO-SOURCE
> Task :runners:samza:job-server:javadoc NO-SOURCE
> Task :runners:samza:job-server:spotbugsMain NO-SOURCE
> Task :runners:samza:job-server:spotbugsTest SKIPPED
> Task :runners:samza:job-server:test NO-SOURCE
> Task :runners:samza:job-server:check
> Task :runners:samza:job-server:build
> Task :runners:samza:job-server:buildDependents
> Task :runners:samza:buildDependents
> Task :runners:java-job-service:buildDependents
> Task :sdks:java:io:elasticsearch-tests:elasticsearch-tests-5:check
> Task :sdks:java:io:elasticsearch-tests:elasticsearch-tests-5:build
> Task :sdks:java:io:elasticsearch-tests:elasticsearch-tests-5:buildDependents
> Task :sdks:java:io:elasticsearch-tests:elasticsearch-tests-common:buildDependents
> Task :sdks:java:io:elasticsearch:buildDependents
> Task :release:go-licenses:java:dockerRun
+ go-licenses save github.com/apache/beam/sdks/java/container --save_path=/output/licenses
+ go-licenses csv github.com/apache/beam/sdks/java/container
+ tee /output/licenses/list.csv
> Task :sdks:java:core:validateShadedJarDoesntLeakNonProjectClasses
> Task :sdks:java:core:check
> Task :sdks:java:core:build
> Task :sdks:java:core:buildNeeded
> Task :release:go-licenses:java:dockerRun
github.com/apache/beam/sdks/java/container,https://github.com/apache/beam/blob/master/LICENSE,Apache-2.0
google.golang.org/grpc,https://github.com/grpc/grpc-go/blob/master/LICENSE,Apache-2.0
google.golang.org/protobuf,https://go.googlesource.com/protobuf/+/refs/heads/master/LICENSE,BSD-3-Clause
google.golang.org/genproto/googleapis/rpc/status,https://github.com/googleapis/go-genproto/blob/master/LICENSE,Apache-2.0
golang.org/x/text,https://go.googlesource.com/text/+/refs/heads/master/LICENSE,BSD-3-Clause
github.com/apache/beam/sdks/go/pkg/beam,https://github.com/apache/beam/blob/master/sdks/go/README.md,Apache-2.0
golang.org/x/net,https://go.googlesource.com/net/+/refs/heads/master/LICENSE,BSD-3-Clause
golang.org/x/sys,https://go.googlesource.com/sys/+/refs/heads/master/LICENSE,BSD-3-Clause
github.com/golang/protobuf,https://github.com/golang/protobuf/blob/master/LICENSE,BSD-3-Clause
+ chmod -R a+w /output/licenses
> Task :release:go-licenses:java:createLicenses
> Task :sdks:java:container:java8:copyGolangLicenses
> Task :sdks:java:container:java8:dockerPrepare
> Task :sdks:java:container:java8:docker
FAILURE: Build completed with 3 failures.
1: Task failed with an exception.
-----------
* What went wrong:
Execution failed for task ':sdks:java:extensions:sql:jdbc:shadowJar'.
> Failed to store cache entry for task ':sdks:java:extensions:sql:jdbc:shadowJar'
* Try:
> Run with --stacktrace option to get the stack trace.
> Run with --info or --debug option to get more log output.
> Run with --scan to get full insights.
==============================================================================
2: Task failed with an exception.
-----------
* What went wrong:
Execution failed for task ':runners:direct-java:test'.
> Failed to store cache entry for task ':runners:direct-java:test'
* Try:
> Run with --stacktrace option to get the stack trace.
> Run with --info or --debug option to get more log output.
> Run with --scan to get full insights.
==============================================================================
3: Task failed with an exception.
-----------
* What went wrong:
Execution failed for task ':sdks:java:io:google-cloud-platform:test'.
> There were failing tests. See the report at: file://<https://ci-beam.apache.org/job/beam_PreCommit_Java_Cron/ws/src/sdks/java/io/google-cloud-platform/build/reports/tests/test/index.html>
* Try:
> Run with --stacktrace option to get the stack trace.
> Run with --info or --debug option to get more log output.
> Run with --scan to get full insights.
==============================================================================
* Get more help at https://help.gradle.org
Deprecated Gradle features were used in this build, making it incompatible with Gradle 8.0.
You can use '--warning-mode all' to show the individual deprecation warnings and determine if they come from your own scripts or plugins.
See https://docs.gradle.org/7.3.2/userguide/command_line_interface.html#sec:command_line_warnings
Execution optimizations have been disabled for 1 invalid unit(s) of work during this build to ensure correctness.
Please consult deprecation warnings for more details.
BUILD FAILED in 57m 23s
1258 actionable tasks: 1170 executed, 86 from cache, 2 up-to-date
Publishing build scan...
https://gradle.com/s/t6q6zzp7bbvjs
Build step 'Invoke Gradle script' changed build result to FAILURE
Build step 'Invoke Gradle script' marked build as failure
---------------------------------------------------------------------
To unsubscribe, e-mail: builds-unsubscribe@beam.apache.org
For additional commands, e-mail: builds-help@beam.apache.org
Build failed in Jenkins: beam_PreCommit_Java_Cron #5142
Posted by Apache Jenkins Server <je...@builds.apache.org>.
See <https://ci-beam.apache.org/job/beam_PreCommit_Java_Cron/5142/display/redirect?page=changes>
Changes:
[noreply] Memoize some objects for timer processing to reduce overhead. (#16207)
[noreply] [BEAM-13965] Use TypeDeserializer if type information is available to
------------------------------------------
[...truncated 2.82 MB...]
> Task :sdks:java:core:javadoc
> Task :sdks:java:io:common:test
> Task :sdks:java:extensions:sbe:spotbugsTest SKIPPED
> Task :sdks:java:extensions:protobuf:test
> Task :sdks:java:io:common:check
> Task :sdks:java:io:common:build
> Task :sdks:java:io:elasticsearch:assemble
> Task :sdks:java:io:elasticsearch:analyzeClassesDependencies
> Task :sdks:java:io:elasticsearch:compileTestJava NO-SOURCE
> Task :sdks:java:io:elasticsearch:testClasses UP-TO-DATE
> Task :sdks:java:io:elasticsearch:analyzeTestClassesDependencies SKIPPED
> Task :sdks:java:io:elasticsearch:analyzeDependencies
> Task :sdks:java:extensions:protobuf:spotbugsMain
> Task :sdks:java:io:azure:classes
> Task :sdks:java:io:elasticsearch:checkstyleMain
> Task :sdks:java:io:azure:jar
> Task :sdks:java:io:azure:assemble
> Task :sdks:java:io:elasticsearch:checkstyleTest NO-SOURCE
> Task :sdks:java:extensions:protobuf:check
> Task :sdks:java:extensions:protobuf:build
> Task :sdks:java:io:hadoop-common:assemble
> Task :sdks:java:io:hadoop-common:analyzeClassesDependencies
> Task :sdks:java:io:azure:analyzeClassesDependencies
> Task :sdks:java:extensions:sbe:test
> Task :sdks:java:extensions:sql:udf:javadoc FROM-CACHE
> Task :sdks:java:extensions:sql:udf-test-provider:javadoc FROM-CACHE
> Task :sdks:java:container:java8:copyDockerfileDependencies
> Task :sdks:java:core:spotbugsTest SKIPPED
> Task :sdks:java:io:hadoop-common:compileTestJava
Note: <https://ci-beam.apache.org/job/beam_PreCommit_Java_Cron/ws/src/sdks/java/io/hadoop-common/src/test/java/org/apache/beam/sdk/io/hadoop/SerializableConfigurationTest.java> uses or overrides a deprecated API.
Note: Recompile with -Xlint:deprecation for details.
> Task :sdks:java:io:hadoop-common:testClasses
> Task :sdks:java:io:hadoop-common:analyzeTestClassesDependencies SKIPPED
> Task :sdks:java:io:hadoop-common:analyzeDependencies
> Task :sdks:java:io:elasticsearch:javadoc
> Task :sdks:java:io:hadoop-common:checkstyleMain
> Task :sdks:java:io:azure:compileTestJava
Note: <https://ci-beam.apache.org/job/beam_PreCommit_Java_Cron/ws/src/sdks/java/io/azure/src/test/java/org/apache/beam/sdk/io/azure/blobstore/AzfsResourceIdTest.java> uses or overrides a deprecated API.
Note: Recompile with -Xlint:deprecation for details.
Note: <https://ci-beam.apache.org/job/beam_PreCommit_Java_Cron/ws/src/sdks/java/io/azure/src/test/java/org/apache/beam/sdk/io/azure/blobstore/AzureBlobStoreFileSystemTest.java> uses unchecked or unsafe operations.
Note: Recompile with -Xlint:unchecked for details.
> Task :sdks:java:io:azure:testClasses
> Task :sdks:java:io:azure:analyzeTestClassesDependencies SKIPPED
> Task :sdks:java:io:azure:analyzeDependencies
> Task :sdks:java:io:hadoop-common:checkstyleTest
> Task :sdks:java:io:elasticsearch:spotbugsTest SKIPPED
> Task :sdks:java:io:elasticsearch:test NO-SOURCE
> Task :sdks:java:extensions:sbe:spotbugsMain
> Task :sdks:java:extensions:sbe:check
> Task :sdks:java:extensions:sbe:build
> Task :sdks:java:extensions:sbe:buildDependents
> Task :sdks:java:io:azure:checkstyleMain
> Task :release:go-licenses:java:dockerRun FAILED
Unable to find image 'golicenses-java:latest' locally
docker: Error response from daemon: pull access denied for golicenses-java, repository does not exist or may require 'docker login'.
See 'docker run --help'.
> Task :sdks:java:io:azure:checkstyleTest
> Task :sdks:java:container:pullLicenses
Copying already-fetched licenses from <https://ci-beam.apache.org/job/beam_PreCommit_Java_Cron/ws/src/sdks/java/container/build/reports/dependency-license> to <https://ci-beam.apache.org/job/beam_PreCommit_Java_Cron/ws/src/sdks/java/container/build/target/java_third_party_licenses>
> Task :sdks:java:io:hadoop-common:javadoc
> Task :sdks:java:io:azure:javadoc
> Task :sdks:java:container:pullLicenses
Collecting pip
Using cached pip-22.0.3-py3-none-any.whl (2.1 MB)
Collecting setuptools
Using cached setuptools-60.9.3-py3-none-any.whl (1.1 MB)
Collecting wheel
Using cached wheel-0.37.1-py2.py3-none-any.whl (35 kB)
Installing collected packages: pip, setuptools, wheel
Attempting uninstall: pip
Found existing installation: pip 20.0.2
Uninstalling pip-20.0.2:
Successfully uninstalled pip-20.0.2
> Task :runners:samza:check
> Task :runners:samza:build
> Task :sdks:java:io:azure:spotbugsTest SKIPPED
> Task :sdks:java:container:pullLicenses
Attempting uninstall: setuptools
Found existing installation: setuptools 44.0.0
Uninstalling setuptools-44.0.0:
Successfully uninstalled setuptools-44.0.0
> Task :sdks:java:io:hadoop-common:spotbugsMain
> Task :sdks:java:io:hadoop-common:spotbugsTest SKIPPED
> Task :sdks:java:container:pullLicenses
Successfully installed pip-22.0.3 setuptools-60.9.3 wheel-0.37.1
Collecting beautifulsoup4<5.0,>=4.9.0
Using cached beautifulsoup4-4.10.0-py3-none-any.whl (97 kB)
Collecting pyyaml<6.0.0,>=3.12
Using cached PyYAML-5.4.1-cp38-cp38-manylinux1_x86_64.whl (662 kB)
> Task :sdks:java:core:spotbugsMain
> Task :sdks:java:io:elasticsearch:spotbugsMain
> Task :sdks:java:io:elasticsearch:check
> Task :sdks:java:io:elasticsearch:build
> Task :sdks:java:javadoc:allJavadoc
> Task :sdks:java:core:test
> Task :sdks:java:container:java8:copySdkHarnessLauncher
Execution optimizations have been disabled for task ':sdks:java:container:java8:copySdkHarnessLauncher' to ensure correctness due to the following reasons:
- Gradle detected a problem with the following location: '<https://ci-beam.apache.org/job/beam_PreCommit_Java_Cron/ws/src/sdks/java/container/build/target'.> Reason: Task ':sdks:java:container:java8:copySdkHarnessLauncher' uses this output of task ':sdks:java:container:downloadCloudProfilerAgent' without declaring an explicit or implicit dependency. This can lead to incorrect results being produced, depending on what order the tasks are executed. Please refer to https://docs.gradle.org/7.3.2/userguide/validation_problems.html#implicit_dependency for more details about this problem.
- Gradle detected a problem with the following location: '<https://ci-beam.apache.org/job/beam_PreCommit_Java_Cron/ws/src/sdks/java/container/build/target'.> Reason: Task ':sdks:java:container:java8:copySdkHarnessLauncher' uses this output of task ':sdks:java:container:pullLicenses' without declaring an explicit or implicit dependency. This can lead to incorrect results being produced, depending on what order the tasks are executed. Please refer to https://docs.gradle.org/7.3.2/userguide/validation_problems.html#implicit_dependency for more details about this problem.
> Task :sdks:java:container:pullLicenses
Collecting tenacity<6.0,>=5.0.2
Using cached tenacity-5.1.5-py2.py3-none-any.whl (34 kB)
Collecting soupsieve>1.2
Using cached soupsieve-2.3.1-py3-none-any.whl (37 kB)
Collecting six>=1.9.0
Using cached six-1.16.0-py2.py3-none-any.whl (11 kB)
Installing collected packages: soupsieve, six, pyyaml, tenacity, beautifulsoup4
Successfully installed beautifulsoup4-4.10.0 pyyaml-5.4.1 six-1.16.0 soupsieve-2.3.1 tenacity-5.1.5
Executing python <https://ci-beam.apache.org/job/beam_PreCommit_Java_Cron/ws/src/sdks/java/container/license_scripts/pull_licenses_java.py> --license_index=<https://ci-beam.apache.org/job/beam_PreCommit_Java_Cron/ws/src/sdks/java/container/build/reports/dependency-license/index.json> --output_dir=<https://ci-beam.apache.org/job/beam_PreCommit_Java_Cron/ws/src/sdks/java/container/build/target/java_third_party_licenses> --dep_url_yaml=<https://ci-beam.apache.org/job/beam_PreCommit_Java_Cron/ws/src/sdks/java/container/license_scripts/dep_urls_java.yaml> --manual_license_path=<https://ci-beam.apache.org/job/beam_PreCommit_Java_Cron/ws/src/sdks/java/container/license_scripts/manual_licenses>
INFO:root:Pulling license for 220 dependencies using 16 threads.
> Task :sdks:java:io:azure:spotbugsMain
> Task :sdks:java:container:pullLicenses
INFO:root:Replaced local file URL with file://<https://ci-beam.apache.org/job/beam_PreCommit_Java_Cron/ws/src/sdks/java/container/license_scripts/manual_licenses/xz/COPYING> for xz-1.5
> Task :sdks:java:io:hadoop-common:test
> Task :sdks:java:io:hadoop-common:check
> Task :sdks:java:io:hadoop-common:build
> Task :sdks:java:io:azure:test
> Task :sdks:java:io:azure:check
> Task :sdks:java:io:azure:build
> Task :sdks:java:io:azure:buildDependents
> Task :sdks:java:container:pullLicenses
INFO:root:pull_licenses_java.py succeed. It took 12.120431 seconds with 16 threads.
Copying licenses from <https://ci-beam.apache.org/job/beam_PreCommit_Java_Cron/ws/src/sdks/java/container/build/target/java_third_party_licenses> to <https://ci-beam.apache.org/job/beam_PreCommit_Java_Cron/ws/src/sdks/java/container/build/target/third_party_licenses.>
Finished license_scripts.sh
> Task :sdks:java:container:java8:copyJavaThirdPartyLicenses
> Task :sdks:java:extensions:sql:jdbc:shadowJarTest
> Task :runners:samza:job-server:startShadowScripts
> Task :runners:samza:job-server:shadowDistTar
> Task :sdks:java:extensions:sql:jdbc:preCommit
> Task :runners:samza:job-server:shadowDistZip
> Task :runners:samza:job-server:assemble
> Task :runners:samza:job-server:analyzeClassesDependencies
> Task :runners:samza:job-server:analyzeTestClassesDependencies SKIPPED
> Task :runners:samza:job-server:analyzeDependencies
> Task :runners:samza:job-server:checkstyleMain NO-SOURCE
> Task :runners:samza:job-server:checkstyleTest NO-SOURCE
> Task :runners:samza:job-server:javadoc NO-SOURCE
> Task :runners:samza:job-server:spotbugsMain NO-SOURCE
> Task :runners:samza:job-server:spotbugsTest SKIPPED
> Task :runners:samza:job-server:test NO-SOURCE
> Task :runners:samza:job-server:check
> Task :runners:samza:job-server:build
> Task :runners:samza:job-server:buildDependents
> Task :runners:samza:buildDependents
> Task :runners:java-job-service:buildDependents
> Task :sdks:java:io:elasticsearch-tests:elasticsearch-tests-5:check
> Task :sdks:java:io:elasticsearch-tests:elasticsearch-tests-5:build
> Task :sdks:java:io:elasticsearch-tests:elasticsearch-tests-5:buildDependents
> Task :sdks:java:io:elasticsearch-tests:elasticsearch-tests-6:check
> Task :sdks:java:io:elasticsearch-tests:elasticsearch-tests-6:build
> Task :sdks:java:io:elasticsearch-tests:elasticsearch-tests-6:buildDependents
> Task :sdks:java:io:elasticsearch-tests:elasticsearch-tests-7:check
> Task :sdks:java:io:elasticsearch-tests:elasticsearch-tests-7:build
> Task :sdks:java:io:elasticsearch-tests:elasticsearch-tests-7:buildDependents
> Task :sdks:java:io:elasticsearch-tests:elasticsearch-tests-common:buildDependents
> Task :sdks:java:io:elasticsearch:buildDependents
> Task :sdks:java:core:validateShadedJarDoesntLeakNonProjectClasses
> Task :sdks:java:core:check
> Task :sdks:java:core:build
> Task :sdks:java:core:buildNeeded
> Task :sdks:java:testing:nexmark:check
> Task :sdks:java:testing:nexmark:build
> Task :sdks:java:testing:nexmark:buildDependents
> Task :sdks:java:extensions:sql:zetasql:buildDependents
> Task :sdks:java:extensions:sql:buildDependents
> Task :sdks:java:extensions:join-library:buildDependents
> Task :sdks:java:io:mongodb:buildDependents
> Task :sdks:java:io:parquet:buildDependents
> Task :sdks:java:io:thrift:buildDependents
> Task :sdks:java:io:hadoop-common:buildDependents
FAILURE: Build completed with 3 failures.
1: Task failed with an exception.
-----------
* What went wrong:
Execution failed for task ':examples:java:test'.
> There were failing tests. See the report at: file://<https://ci-beam.apache.org/job/beam_PreCommit_Java_Cron/ws/src/examples/java/build/reports/tests/test/index.html>
* Try:
> Run with --stacktrace option to get the stack trace.
> Run with --info or --debug option to get more log output.
> Run with --scan to get full insights.
==============================================================================
2: Task failed with an exception.
-----------
* What went wrong:
Execution failed for task ':sdks:java:io:google-cloud-platform:test'.
> There were failing tests. See the report at: file://<https://ci-beam.apache.org/job/beam_PreCommit_Java_Cron/ws/src/sdks/java/io/google-cloud-platform/build/reports/tests/test/index.html>
* Try:
> Run with --stacktrace option to get the stack trace.
> Run with --info or --debug option to get more log output.
> Run with --scan to get full insights.
==============================================================================
3: Task failed with an exception.
-----------
* What went wrong:
Execution failed for task ':release:go-licenses:java:dockerRun'.
> Process 'command 'docker'' finished with non-zero exit value 125
* Try:
> Run with --stacktrace option to get the stack trace.
> Run with --info or --debug option to get more log output.
> Run with --scan to get full insights.
==============================================================================
* Get more help at https://help.gradle.org
Deprecated Gradle features were used in this build, making it incompatible with Gradle 8.0.
You can use '--warning-mode all' to show the individual deprecation warnings and determine if they come from your own scripts or plugins.
See https://docs.gradle.org/7.3.2/userguide/command_line_interface.html#sec:command_line_warnings
Execution optimizations have been disabled for 1 invalid unit(s) of work during this build to ensure correctness.
Please consult deprecation warnings for more details.
BUILD FAILED in 1h 26s
1261 actionable tasks: 1221 executed, 38 from cache, 2 up-to-date
Publishing build scan...
https://gradle.com/s/x5iivbjozjusy
Build step 'Invoke Gradle script' changed build result to FAILURE
Build step 'Invoke Gradle script' marked build as failure
---------------------------------------------------------------------
To unsubscribe, e-mail: builds-unsubscribe@beam.apache.org
For additional commands, e-mail: builds-help@beam.apache.org
Build failed in Jenkins: beam_PreCommit_Java_Cron #5141
Posted by Apache Jenkins Server <je...@builds.apache.org>.
See <https://ci-beam.apache.org/job/beam_PreCommit_Java_Cron/5141/display/redirect?page=changes>
Changes:
[noreply] Merge pull request #16846 from [BEAM-12164]: Add sad path tests for
------------------------------------------
Started by timer
Running as SYSTEM
[EnvInject] - Loading node environment variables.
Building remotely on apache-beam-jenkins-4 (beam) in workspace <https://ci-beam.apache.org/job/beam_PreCommit_Java_Cron/ws/>
The recommended git tool is: NONE
No credentials specified
Wiping out workspace first.
Cloning the remote Git repository
Cloning repository https://github.com/apache/beam.git
> git init <https://ci-beam.apache.org/job/beam_PreCommit_Java_Cron/ws/src> # timeout=10
Fetching upstream changes from https://github.com/apache/beam.git
> git --version # timeout=10
> git --version # 'git version 2.25.1'
> git fetch --tags --force --progress -- https://github.com/apache/beam.git +refs/heads/*:refs/remotes/origin/* # timeout=10
> git config remote.origin.url https://github.com/apache/beam.git # timeout=10
> git config --add remote.origin.fetch +refs/heads/*:refs/remotes/origin/* # timeout=10
> git config remote.origin.url https://github.com/apache/beam.git # timeout=10
Fetching upstream changes from https://github.com/apache/beam.git
> git fetch --tags --force --progress -- https://github.com/apache/beam.git +refs/heads/*:refs/remotes/origin/* +refs/pull/${ghprbPullId}/*:refs/remotes/origin/pr/${ghprbPullId}/* # timeout=10
> git rev-parse origin/master^{commit} # timeout=10
Checking out Revision 47ab260aaad6b1014d86dd6cf9274f1045690631 (origin/master)
> git config core.sparsecheckout # timeout=10
> git checkout -f 47ab260aaad6b1014d86dd6cf9274f1045690631 # timeout=10
Commit message: "Merge pull request #16846 from [BEAM-12164]: Add sad path tests for Cloud Spanner's ReadChangeStream"
> git rev-list --no-walk 8fcb103a7fc246f24e1e4574e59ce4d5dd184d1d # timeout=10
No emails were triggered.
[EnvInject] - Executing scripts and injecting environment variables after the SCM step.
[EnvInject] - Injecting as environment variables the properties content
SPARK_LOCAL_IP=127.0.0.1
SETUPTOOLS_USE_DISTUTILS=stdlib
[EnvInject] - Variables injected successfully.
[Gradle] - Launching build.
[src] $ <https://ci-beam.apache.org/job/beam_PreCommit_Java_Cron/ws/src/gradlew> -PdisableSpotlessCheck=true --continue --max-workers=12 -Dorg.gradle.jvmargs=-Xms2g -Dorg.gradle.jvmargs=-Xmx4g -Dorg.gradle.vfs.watch=false -Pdocker-pull-licenses :javaPreCommit
FAILURE: Build failed with an exception.
* What went wrong:
Timeout waiting to lock daemon addresses registry. It is currently in use by another Gradle instance.
Owner PID: unknown
Our PID: 2115639
Owner Operation: unknown
Our operation:
Lock file: /home/jenkins/.gradle/daemon/7.3.2/registry.bin.lock
* Try:
> Run with --stacktrace option to get the stack trace.
> Run with --info or --debug option to get more log output.
> Run with --scan to get full insights.
* Get more help at https://help.gradle.org
Build step 'Invoke Gradle script' changed build result to FAILURE
Build step 'Invoke Gradle script' marked build as failure
---------------------------------------------------------------------
To unsubscribe, e-mail: builds-unsubscribe@beam.apache.org
For additional commands, e-mail: builds-help@beam.apache.org
Build failed in Jenkins: beam_PreCommit_Java_Cron #5140
Posted by Apache Jenkins Server <je...@builds.apache.org>.
See <https://ci-beam.apache.org/job/beam_PreCommit_Java_Cron/5140/display/redirect?page=changes>
Changes:
[noreply] [BEAM-13925] Add most of the supporting files for the pr management
------------------------------------------
Started by timer
Running as SYSTEM
[EnvInject] - Loading node environment variables.
Building remotely on apache-beam-jenkins-4 (beam) in workspace <https://ci-beam.apache.org/job/beam_PreCommit_Java_Cron/ws/>
The recommended git tool is: NONE
No credentials specified
Wiping out workspace first.
Cloning the remote Git repository
Cloning repository https://github.com/apache/beam.git
> git init <https://ci-beam.apache.org/job/beam_PreCommit_Java_Cron/ws/src> # timeout=10
Fetching upstream changes from https://github.com/apache/beam.git
> git --version # timeout=10
> git --version # 'git version 2.25.1'
> git fetch --tags --force --progress -- https://github.com/apache/beam.git +refs/heads/*:refs/remotes/origin/* # timeout=10
> git config remote.origin.url https://github.com/apache/beam.git # timeout=10
> git config --add remote.origin.fetch +refs/heads/*:refs/remotes/origin/* # timeout=10
> git config remote.origin.url https://github.com/apache/beam.git # timeout=10
Fetching upstream changes from https://github.com/apache/beam.git
> git fetch --tags --force --progress -- https://github.com/apache/beam.git +refs/heads/*:refs/remotes/origin/* +refs/pull/${ghprbPullId}/*:refs/remotes/origin/pr/${ghprbPullId}/* # timeout=10
> git rev-parse origin/master^{commit} # timeout=10
Checking out Revision 8fcb103a7fc246f24e1e4574e59ce4d5dd184d1d (origin/master)
> git config core.sparsecheckout # timeout=10
> git checkout -f 8fcb103a7fc246f24e1e4574e59ce4d5dd184d1d # timeout=10
Commit message: "[BEAM-13925] Add most of the supporting files for the pr management automation (#16898)"
> git rev-list --no-walk bf020ac1c620c0367244acc6161f228772559f70 # timeout=10
No emails were triggered.
[EnvInject] - Executing scripts and injecting environment variables after the SCM step.
[EnvInject] - Injecting as environment variables the properties content
SPARK_LOCAL_IP=127.0.0.1
SETUPTOOLS_USE_DISTUTILS=stdlib
[EnvInject] - Variables injected successfully.
[Gradle] - Launching build.
[src] $ <https://ci-beam.apache.org/job/beam_PreCommit_Java_Cron/ws/src/gradlew> -PdisableSpotlessCheck=true --continue --max-workers=12 -Dorg.gradle.jvmargs=-Xms2g -Dorg.gradle.jvmargs=-Xmx4g -Dorg.gradle.vfs.watch=false -Pdocker-pull-licenses :javaPreCommit
FAILURE: Build failed with an exception.
* What went wrong:
Timeout waiting to lock daemon addresses registry. It is currently in use by another Gradle instance.
Owner PID: unknown
Our PID: 2104267
Owner Operation: unknown
Our operation:
Lock file: /home/jenkins/.gradle/daemon/7.3.2/registry.bin.lock
* Try:
> Run with --stacktrace option to get the stack trace.
> Run with --info or --debug option to get more log output.
> Run with --scan to get full insights.
* Get more help at https://help.gradle.org
Build step 'Invoke Gradle script' changed build result to FAILURE
Build step 'Invoke Gradle script' marked build as failure
---------------------------------------------------------------------
To unsubscribe, e-mail: builds-unsubscribe@beam.apache.org
For additional commands, e-mail: builds-help@beam.apache.org
Build failed in Jenkins: beam_PreCommit_Java_Cron #5139
Posted by Apache Jenkins Server <je...@builds.apache.org>.
See <https://ci-beam.apache.org/job/beam_PreCommit_Java_Cron/5139/display/redirect?page=changes>
Changes:
[benjamin.gonzalez] Revert PR#16253 due errors with plugin flaky-test-handler
[noreply] Fix BoundedQueueExecutor and StreamingDataflowWorker to actually limit
[noreply] [BEAM-1857] Add Neo4jIO (#15916)
[noreply] [BEAM-13767] Migrate serveral portable runner tasks to use configuration
[noreply] [BEAM-13996] Removing 'No cluster_manager is associated with the
[noreply] [BEAM-13906] Improve coverage of errors package (#16934)
[noreply] [BEAM-13886] unit tests for trigger package (#16935)
[noreply] [BEAM-4767] Remove beam- prefix from release script tags (#16899)
[noreply] [BEAM-13866] Add small unit tests to errorx, make boolean assignment
------------------------------------------
Started by timer
Running as SYSTEM
[EnvInject] - Loading node environment variables.
Building remotely on apache-beam-jenkins-4 (beam) in workspace <https://ci-beam.apache.org/job/beam_PreCommit_Java_Cron/ws/>
The recommended git tool is: NONE
No credentials specified
Wiping out workspace first.
Cloning the remote Git repository
Cloning repository https://github.com/apache/beam.git
> git init <https://ci-beam.apache.org/job/beam_PreCommit_Java_Cron/ws/src> # timeout=10
Fetching upstream changes from https://github.com/apache/beam.git
> git --version # timeout=10
> git --version # 'git version 2.25.1'
> git fetch --tags --force --progress -- https://github.com/apache/beam.git +refs/heads/*:refs/remotes/origin/* # timeout=10
> git config remote.origin.url https://github.com/apache/beam.git # timeout=10
> git config --add remote.origin.fetch +refs/heads/*:refs/remotes/origin/* # timeout=10
> git config remote.origin.url https://github.com/apache/beam.git # timeout=10
Fetching upstream changes from https://github.com/apache/beam.git
> git fetch --tags --force --progress -- https://github.com/apache/beam.git +refs/heads/*:refs/remotes/origin/* +refs/pull/${ghprbPullId}/*:refs/remotes/origin/pr/${ghprbPullId}/* # timeout=10
> git rev-parse origin/master^{commit} # timeout=10
Checking out Revision bf020ac1c620c0367244acc6161f228772559f70 (origin/master)
> git config core.sparsecheckout # timeout=10
> git checkout -f bf020ac1c620c0367244acc6161f228772559f70 # timeout=10
Commit message: "[BEAM-13866] Add small unit tests to errorx, make boolean assignment more clear (#16943)"
> git rev-list --no-walk 2a45a5b6c34141dcc595c5cda3d28264e542bdff # timeout=10
No emails were triggered.
[EnvInject] - Executing scripts and injecting environment variables after the SCM step.
[EnvInject] - Injecting as environment variables the properties content
SPARK_LOCAL_IP=127.0.0.1
SETUPTOOLS_USE_DISTUTILS=stdlib
[EnvInject] - Variables injected successfully.
[Gradle] - Launching build.
[src] $ <https://ci-beam.apache.org/job/beam_PreCommit_Java_Cron/ws/src/gradlew> -PdisableSpotlessCheck=true --continue --max-workers=12 -Dorg.gradle.jvmargs=-Xms2g -Dorg.gradle.jvmargs=-Xmx4g -Dorg.gradle.vfs.watch=false -Pdocker-pull-licenses :javaPreCommit
FAILURE: Build failed with an exception.
* What went wrong:
Timeout waiting to lock daemon addresses registry. It is currently in use by another Gradle instance.
Owner PID: unknown
Our PID: 2097559
Owner Operation: unknown
Our operation:
Lock file: /home/jenkins/.gradle/daemon/7.3.2/registry.bin.lock
* Try:
> Run with --stacktrace option to get the stack trace.
> Run with --info or --debug option to get more log output.
> Run with --scan to get full insights.
* Get more help at https://help.gradle.org
Build step 'Invoke Gradle script' changed build result to FAILURE
Build step 'Invoke Gradle script' marked build as failure
---------------------------------------------------------------------
To unsubscribe, e-mail: builds-unsubscribe@beam.apache.org
For additional commands, e-mail: builds-help@beam.apache.org