You are viewing a plain text version of this content. The canonical link for it is here.
Posted to issues@nifi.apache.org by "Daniel Stieglitz (Jira)" <ji...@apache.org> on 2026/09/10 15:35:00 UTC
[jira] [Commented] (NIFI-14126) TestPutUDP.testSendChangePropertiesAndSend is a flakey test
[ https://issues.apache.org/jira/browse/NIFI-14126?page=com.atlassian.jira.plugin.system.issuetabpanels:comment-tabpanel&focusedCommentId=18113917#comment-18113917 ]
Daniel Stieglitz commented on NIFI-14126:
-----------------------------------------
[~exceptionfactory] Now that the PutUdp processor was deprecated in NIFI-16323, does it make sense to make this ticket OBE?
> TestPutUDP.testSendChangePropertiesAndSend is a flakey test
> -----------------------------------------------------------
>
> Key: NIFI-14126
> URL: https://issues.apache.org/jira/browse/NIFI-14126
> Project: Apache NiFi
> Issue Type: Bug
> Environment: Apache Maven 3.9.9 (8e8579a9e76f7d015ee5ec7bfcdc97d260186937)
> Maven home: /opt/homebrew/Cellar/maven/3.9.9/libexec
> Java version: 21.0.5, vendor: Azul Systems, Inc., runtime: /Library/Java/JavaVirtualMachines/zulu-21.jdk/Contents/Home
> Default locale: en_US, platform encoding: UTF-8
> OS name: "mac os x", version: "15.2", arch: "aarch64", family: "mac"
> Reporter: Joe Witt
> Priority: Major
>
> [ERROR] Tests run: 5, Failures: 1, Errors: 0, Skipped: 0, Time elapsed: 0.701 s <<< FAILURE! -- in org.apache.nifi.processors.standard.TestPutUDP
> [ERROR] org.apache.nifi.processors.standard.TestPutUDP.testSendChangePropertiesAndSend -- Time elapsed: 0.112 s <<< FAILURE!
> org.opentest4j.AssertionFailedError: array lengths differ, expected: <8> but was: <9>
> at org.junit.jupiter.api.AssertionFailureBuilder.build(AssertionFailureBuilder.java:151)
> at org.junit.jupiter.api.AssertionFailureBuilder.buildAndThrow(AssertionFailureBuilder.java:132)
> at org.junit.jupiter.api.AssertArrayEquals.assertArraysHaveSameLength(AssertArrayEquals.java:428)
> at org.junit.jupiter.api.AssertArrayEquals.assertArrayEquals(AssertArrayEquals.java:205)
> at org.junit.jupiter.api.AssertArrayEquals.assertArrayEquals(AssertArrayEquals.java:63)
> at org.junit.jupiter.api.AssertArrayEquals.assertArrayEquals(AssertArrayEquals.java:59)
> at org.junit.jupiter.api.Assertions.assertArrayEquals(Assertions.java:1229)
> at org.apache.nifi.processors.standard.TestPutUDP.assertMessagesReceived(TestPutUDP.java:164)
> at org.apache.nifi.processors.standard.TestPutUDP.testSendChangePropertiesAndSend(TestPutUDP.java:116)
> at java.base/java.lang.reflect.Method.invoke(Method.java:580)
> at java.base/java.util.ArrayList.forEach(ArrayList.java:1596)
> at java.base/java.util.ArrayList.forEach(ArrayList.java:1596)
--
This message was sent by Atlassian Jira
(v8.20.10#820010)