You are viewing a plain text version of this content. The canonical link for it is here.
Posted to builds@solr.apache.org by Apache Jenkins Server <je...@builds.apache.org> on 2026/08/16 00:14:17 UTC

[JENKINS] Solr » Solr-Test-main - Build # 14549 - Unstable!

Build: https://ci-builds.apache.org/job/Solr/job/Solr-Test-main/14549/

1 tests failed.
FAILED:  org.apache.solr.cloud.RecoveryAfterSoftCommitTest.test

Error Message:
org.apache.solr.client.solrj.SolrServerException: java.nio.channels.ClosedChannelException

Stack Trace:
org.apache.solr.client.solrj.SolrServerException: java.nio.channels.ClosedChannelException
	at __randomizedtesting.SeedInfo.seed([29DCE295C440B786:A188DD4F6ABCDA7E]:0)
	at org.apache.solr.client.solrj.impl.LBSolrClient.doRequest(LBSolrClient.java:680)
	at org.apache.solr.client.solrj.impl.LBSolrClient.request(LBSolrClient.java:582)
	at org.apache.solr.client.solrj.impl.CloudSolrClient.sendRequest(CloudSolrClient.java:1088)
	at org.apache.solr.client.solrj.impl.CloudSolrClient.requestWithRetryOnStaleState(CloudSolrClient.java:723)
	at org.apache.solr.client.solrj.impl.CloudSolrClient.request(CloudSolrClient.java:645)
	at org.apache.solr.client.solrj.SolrRequest.process(SolrRequest.java:314)
	at org.apache.solr.client.solrj.SolrClient.add(SolrClient.java:167)
	at org.apache.solr.client.solrj.SolrClient.add(SolrClient.java:132)
	at org.apache.solr.client.solrj.SolrClient.add(SolrClient.java:148)
	at org.apache.solr.cloud.RecoveryAfterSoftCommitTest.test(RecoveryAfterSoftCommitTest.java:106)
	at java.base/jdk.internal.reflect.DirectMethodHandleAccessor.invoke(DirectMethodHandleAccessor.java:103)
	at java.base/java.lang.reflect.Method.invoke(Method.java:580)
	at com.carrotsearch.randomizedtesting.RandomizedRunner.invoke(RandomizedRunner.java:1780)
	at com.carrotsearch.randomizedtesting.RandomizedRunner$8.evaluate(RandomizedRunner.java:959)
	at com.carrotsearch.randomizedtesting.RandomizedRunner$9.evaluate(RandomizedRunner.java:995)
	at com.carrotsearch.randomizedtesting.RandomizedRunner$10.evaluate(RandomizedRunner.java:1009)
	at org.apache.solr.BaseDistributedSearchTestCase$ShardsRepeatRule$ShardsFixedStatement.callStatement(BaseDistributedSearchTestCase.java:1088)
	at org.apache.solr.BaseDistributedSearchTestCase$ShardsRepeatRule$ShardsStatement.evaluate(BaseDistributedSearchTestCase.java:1059)
	at com.carrotsearch.randomizedtesting.rules.SystemPropertiesRestoreRule$1.evaluate(SystemPropertiesRestoreRule.java:80)
	at org.junit.rules.RunRules.evaluate(RunRules.java:20)
	at org.apache.lucene.tests.util.TestRuleSetupTeardownChained$1.evaluate(TestRuleSetupTeardownChained.java:48)
	at org.apache.lucene.tests.util.AbstractBeforeAfterRule$1.evaluate(AbstractBeforeAfterRule.java:43)
	at org.apache.lucene.tests.util.TestRuleThreadAndTestName$1.evaluate(TestRuleThreadAndTestName.java:45)
	at org.apache.lucene.tests.util.TestRuleIgnoreAfterMaxFailures$1.evaluate(TestRuleIgnoreAfterMaxFailures.java:60)
	at org.apache.lucene.tests.util.TestRuleMarkFailure$1.evaluate(TestRuleMarkFailure.java:44)
	at org.junit.rules.RunRules.evaluate(RunRules.java:20)
	at com.carrotsearch.randomizedtesting.rules.StatementAdapter.evaluate(StatementAdapter.java:36)
	at com.carrotsearch.randomizedtesting.ThreadLeakControl$StatementRunner.run(ThreadLeakControl.java:390)
	at com.carrotsearch.randomizedtesting.ThreadLeakControl.forkTimeoutingTask(ThreadLeakControl.java:843)
	at com.carrotsearch.randomizedtesting.ThreadLeakControl$3.evaluate(ThreadLeakControl.java:490)
	at com.carrotsearch.randomizedtesting.RandomizedRunner.runSingleTest(RandomizedRunner.java:968)
	at com.carrotsearch.randomizedtesting.RandomizedRunner$5.evaluate(RandomizedRunner.java:853)
	at com.carrotsearch.randomizedtesting.RandomizedRunner$6.evaluate(RandomizedRunner.java:904)
	at com.carrotsearch.randomizedtesting.RandomizedRunner$7.evaluate(RandomizedRunner.java:915)
	at com.carrotsearch.randomizedtesting.rules.StatementAdapter.evaluate(StatementAdapter.java:36)
	at com.carrotsearch.randomizedtesting.rules.StatementAdapter.evaluate(StatementAdapter.java:36)
	at org.apache.lucene.tests.util.AbstractBeforeAfterRule$1.evaluate(AbstractBeforeAfterRule.java:43)
	at com.carrotsearch.randomizedtesting.rules.SystemPropertiesRestoreRule$1.evaluate(SystemPropertiesRestoreRule.java:80)
	at org.junit.rules.RunRules.evaluate(RunRules.java:20)
	at org.apache.lucene.tests.util.AbstractBeforeAfterRule$1.evaluate(AbstractBeforeAfterRule.java:43)
	at com.carrotsearch.randomizedtesting.rules.StatementAdapter.evaluate(StatementAdapter.java:36)
	at org.apache.lucene.tests.util.TestRuleStoreClassName$1.evaluate(TestRuleStoreClassName.java:38)
	at com.carrotsearch.randomizedtesting.rules.NoShadowingOrOverridesOnMethodsRule$1.evaluate(NoShadowingOrOverridesOnMethodsRule.java:40)
	at com.carrotsearch.randomizedtesting.rules.NoShadowingOrOverridesOnMethodsRule$1.evaluate(NoShadowingOrOverridesOnMethodsRule.java:40)
	at com.carrotsearch.randomizedtesting.rules.StatementAdapter.evaluate(StatementAdapter.java:36)
	at com.carrotsearch.randomizedtesting.rules.StatementAdapter.evaluate(StatementAdapter.java:36)
	at org.apache.lucene.tests.util.TestRuleAssertionsRequired$1.evaluate(TestRuleAssertionsRequired.java:53)
	at org.apache.lucene.tests.util.AbstractBeforeAfterRule$1.evaluate(AbstractBeforeAfterRule.java:43)
	at org.apache.lucene.tests.util.TestRuleMarkFailure$1.evaluate(TestRuleMarkFailure.java:44)
	at org.apache.lucene.tests.util.TestRuleIgnoreAfterMaxFailures$1.evaluate(TestRuleIgnoreAfterMaxFailures.java:60)
	at org.apache.lucene.tests.util.TestRuleIgnoreTestSuites$1.evaluate(TestRuleIgnoreTestSuites.java:47)
	at org.junit.rules.RunRules.evaluate(RunRules.java:20)
	at com.carrotsearch.randomizedtesting.rules.StatementAdapter.evaluate(StatementAdapter.java:36)
	at com.carrotsearch.randomizedtesting.ThreadLeakControl$StatementRunner.run(ThreadLeakControl.java:390)
	at com.carrotsearch.randomizedtesting.ThreadLeakControl.lambda$forkTimeoutingTask$0(ThreadLeakControl.java:850)
	at java.base/java.lang.Thread.run(Thread.java:1583)
Caused by: java.nio.channels.ClosedChannelException
	at org.eclipse.jetty.http2.HTTP2Session$StreamsState.onShutdown(HTTP2Session.java:2173)
	at org.eclipse.jetty.http2.HTTP2Session.onShutdown(HTTP2Session.java:1206)
	at org.eclipse.jetty.http2.HTTP2Connection$HTTP2Producer.produce(HTTP2Connection.java:441)
	at org.eclipse.jetty.util.thread.strategy.AdaptiveExecutionStrategy.produceTask(AdaptiveExecutionStrategy.java:509)
	at org.eclipse.jetty.util.thread.strategy.AdaptiveExecutionStrategy.tryProduce(AdaptiveExecutionStrategy.java:251)
	at org.eclipse.jetty.util.thread.strategy.AdaptiveExecutionStrategy.produce(AdaptiveExecutionStrategy.java:196)
	at org.eclipse.jetty.http2.HTTP2Connection.produce(HTTP2Connection.java:237)
	at org.eclipse.jetty.http2.HTTP2Connection.onFillable(HTTP2Connection.java:165)
	at org.eclipse.jetty.http2.HTTP2Connection$FillableCallback.succeeded(HTTP2Connection.java:592)
	at org.eclipse.jetty.io.FillInterest.fillable(FillInterest.java:105)
	at org.eclipse.jetty.io.SelectableChannelEndPoint$1.run(SelectableChannelEndPoint.java:54)
	at org.eclipse.jetty.util.thread.Invocable.invokeNonBlocking(Invocable.java:225)
	at org.eclipse.jetty.util.thread.strategy.AdaptiveExecutionStrategy.picRunTask(AdaptiveExecutionStrategy.java:473)
	at org.eclipse.jetty.util.thread.strategy.AdaptiveExecutionStrategy.consumeTask(AdaptiveExecutionStrategy.java:399)
	at org.eclipse.jetty.util.thread.strategy.AdaptiveExecutionStrategy.tryProduce(AdaptiveExecutionStrategy.java:255)
	at org.eclipse.jetty.util.thread.strategy.AdaptiveExecutionStrategy.produce(AdaptiveExecutionStrategy.java:196)
	at org.apache.solr.common.util.ExecutorUtil$MDCAwareThreadPoolExecutor.lambda$execute$0(ExecutorUtil.java:390)
	at java.base/java.util.concurrent.ThreadPoolExecutor.runWorker(ThreadPoolExecutor.java:1144)
	at java.base/java.util.concurrent.ThreadPoolExecutor$Worker.run(ThreadPoolExecutor.java:642)
	... 1 more




Build Log:
[...truncated 11 lines...]
ERROR: Workspace has a .git repository, but it appears to be corrupt.
hudson.plugins.git.GitException: Command "git rev-parse --resolve-git-dir /home/jenkins/jenkins-agent/workspace/Solr/Solr-Test-main/.git" returned status code 128:
stdout: 
stderr: fatal: not a gitdir '/home/jenkins/jenkins-agent/workspace/Solr/Solr-Test-main/.git'

	at PluginClassLoader for git-client//org.jenkinsci.plugins.gitclient.CliGitAPIImpl.launchCommandIn(CliGitAPIImpl.java:2848)
	at PluginClassLoader for git-client//org.jenkinsci.plugins.gitclient.CliGitAPIImpl.launchCommandIn(CliGitAPIImpl.java:2768)
	at PluginClassLoader for git-client//org.jenkinsci.plugins.gitclient.CliGitAPIImpl.launchCommandIn(CliGitAPIImpl.java:2763)
	at PluginClassLoader for git-client//org.jenkinsci.plugins.gitclient.CliGitAPIImpl.launchCommand(CliGitAPIImpl.java:2052)
	at PluginClassLoader for git-client//org.jenkinsci.plugins.gitclient.CliGitAPIImpl.launchCommand(CliGitAPIImpl.java:2064)
	at PluginClassLoader for git-client//org.jenkinsci.plugins.gitclient.CliGitAPIImpl.hasGitRepo(CliGitAPIImpl.java:404)
	at PluginClassLoader for git-client//hudson.plugins.git.GitAPI.hasGitRepo(GitAPI.java:281)
	at jdk.internal.reflect.GeneratedMethodAccessor30.invoke(Unknown Source)
	at java.base/jdk.internal.reflect.DelegatingMethodAccessorImpl.invoke(DelegatingMethodAccessorImpl.java:43)
	at java.base/java.lang.reflect.Method.invoke(Method.java:569)
	at hudson.remoting.RemoteInvocationHandler$RPCRequest.perform(RemoteInvocationHandler.java:986)
	at hudson.remoting.RemoteInvocationHandler$RPCRequest.call(RemoteInvocationHandler.java:961)
	at hudson.remoting.RemoteInvocationHandler$RPCRequest.call(RemoteInvocationHandler.java:907)
	at hudson.remoting.UserRequest.perform(UserRequest.java:225)
	at hudson.remoting.UserRequest.perform(UserRequest.java:50)
	at hudson.remoting.Request$2.run(Request.java:391)
	at hudson.remoting.InterceptingExecutorService.lambda$wrap$0(InterceptingExecutorService.java:81)
	at java.base/java.util.concurrent.FutureTask.run(FutureTask.java:264)
	at java.base/java.util.concurrent.ThreadPoolExecutor.runWorker(ThreadPoolExecutor.java:1136)
	at java.base/java.util.concurrent.ThreadPoolExecutor$Worker.run(ThreadPoolExecutor.java:635)
	at java.base/java.lang.Thread.run(Thread.java:840)
Cloning the remote Git repository
Cloning repository https://gitbox.apache.org/repos/asf/solr.git
 > git init /home/jenkins/jenkins-agent/workspace/Solr/Solr-Test-main # timeout=10
Fetching upstream changes from https://gitbox.apache.org/repos/asf/solr.git
 > git --version # timeout=10
 > git --version # 'git version 2.43.0'
 > git fetch --tags --force --progress -- https://gitbox.apache.org/repos/asf/solr.git +refs/heads/*:refs/remotes/origin/* # timeout=10
 > git config remote.origin.url https://gitbox.apache.org/repos/asf/solr.git # timeout=10
 > git config --add remote.origin.fetch +refs/heads/*:refs/remotes/origin/* # timeout=10
Avoid second fetch
 > git rev-parse refs/remotes/origin/main^{commit} # timeout=10
Checking out Revision dd1ed4b711c869e89428fc01e76fbba8676359fc (refs/remotes/origin/main)
 > git config core.sparsecheckout # timeout=10
 > git checkout -f dd1ed4b711c869e89428fc01e76fbba8676359fc # timeout=10
 > git branch -a -v --no-abbrev # timeout=10
 > git checkout -b main dd1ed4b711c869e89428fc01e76fbba8676359fc # timeout=10
Commit message: "Fix formatting of commit and optimize operation tags (#4740)"
 > git rev-list --no-walk dd1ed4b711c869e89428fc01e76fbba8676359fc # timeout=10
No emails were triggered.
provisioning config files...
copy managed file [gradle.properties] to file:/home/jenkins/jenkins-agent/workspace/Solr/Solr-Test-main/gradle.properties
[Gradle] - Launching build.
[Solr-Test-main] $ /home/jenkins/jenkins-agent/workspace/Solr/Solr-Test-main/gradlew -Dtests.haltonfailure=false -Dtests.badapples=false --continue test
Downloading gradle-wrapper.jar from https://raw.githubusercontent.com/gradle/gradle/v8.10.2/gradle/wrapper/gradle-wrapper.jar
To honour the JVM settings for this build a single-use Daemon process will be forked. For more on this, please refer to https://docs.gradle.org/9.6.0/userguide/gradle_daemon.html#sec:disabling_the_daemon in the Gradle documentation.
Daemon will be stopped at the end of the build 

> Task :build-infra:compileJava
Note: /home/jenkins/jenkins-agent/workspace/Solr/Solr-Test-main/build-tools/build-infra/src/main/java/org/apache/lucene/gradle/Checksum.java uses or overrides a deprecated API.
Note: Recompile with -Xlint:deprecation for details.

> Task :build-infra:pluginDescriptors
> Task :build-infra:processResources
> Task :build-infra:classes
> Task :build-infra:jar
> Task :gitStatus
> Task :checkJdkInternalsExportedToGradle

> Task :solr:api:compileJava
Note: Some input files use or override a deprecated API.
Note: Recompile with -Xlint:deprecation for details.

> Task :solr:api:processResources NO-SOURCE
> Task :solr:api:classes
> Task :solr:api:jar

> Task :randomizationInfo
Running tests with randomization seed: tests.seed=29DCE295C440B786

> Task :solr:api:resolve
SLF4J(W): No SLF4J providers were found.
SLF4J(W): Defaulting to no-operation (NOP) logger implementation
SLF4J(W): See https://www.slf4j.org/codes.html#noProviders for further details.

> Task :solr:api:processTestResources
> Task :solr:core:processResources
> Task :solr:solrj:processResources
> Task :solr:solrj-jetty:processResources NO-SOURCE
> Task :solr:solrj-streaming:processResources
> Task :solr:solrj-zookeeper:processResources NO-SOURCE
> Task :solr:test-framework:processResources
> Task :solr:benchmark:processResources
> Task :solr:benchmark:processTestResources
> Task :solr:core:processTestResources
> Task :solr:modules:analysis-extras:processResources NO-SOURCE
> Task :solr:cross-dc-manager:processResources NO-SOURCE
> Task :solr:cross-dc-manager:processTestResources
> Task :solr:modules:cross-dc:processResources NO-SOURCE
> Task :solr:modules:opentelemetry:processResources NO-SOURCE
> Task :solr:server:compileJava SKIPPED
> Task :solr:server:processResources NO-SOURCE
> Task :solr:server:classes UP-TO-DATE
> Task :solr:server:compileTestJava NO-SOURCE
> Task :solr:server:processTestResources NO-SOURCE
> Task :solr:server:testClasses UP-TO-DATE
> Task :solr:server:test NO-SOURCE
> Task :solr:server:wipeTaskTemp
> Task :solr:solr-ref-guide:compileJava NO-SOURCE
> Task :solr:solr-ref-guide:processResources NO-SOURCE
> Task :solr:solr-ref-guide:classes UP-TO-DATE
> Task :solr:solr-ref-guide:copySolrjTestResources
> Task :solr:solr-ref-guide:processTestResources NO-SOURCE
> Task :solr:modules:sql:processResources
> Task :solr:solrj:processTestResources
> Task :solr:solrj-jetty:processTestResources
> Task :solr:solrj-streaming:processTestResources
> Task :solr:solrj-zookeeper:processTestResources
> Task :solr:test-framework:processTestResources
> Task :solr:webapp:processResources NO-SOURCE
> Task :solr:webapp:processTestResources NO-SOURCE
> Task :solr:modules:analysis-extras:processTestResources
> Task :solr:modules:clustering:processResources NO-SOURCE
> Task :solr:modules:clustering:processTestResources
> Task :solr:modules:cross-dc:processTestResources
> Task :solr:modules:cuvs:processResources NO-SOURCE
> Task :solr:modules:cuvs:processTestResources
> Task :solr:modules:extraction:processResources
> Task :solr:modules:extraction:processTestResources
> Task :solr:modules:gcs-repository:processResources NO-SOURCE
> Task :solr:modules:gcs-repository:processTestResources
> Task :solr:modules:jwt-auth:processResources NO-SOURCE
> Task :solr:modules:jwt-auth:processTestResources
> Task :solr:modules:langid:processResources NO-SOURCE
> Task :solr:modules:langid:processTestResources
> Task :solr:modules:language-models:processResources NO-SOURCE
> Task :solr:modules:language-models:processTestResources
> Task :solr:modules:ltr:processResources NO-SOURCE
> Task :solr:modules:ltr:processTestResources
> Task :solr:modules:opentelemetry:processTestResources
> Task :solr:modules:s3-repository:processResources NO-SOURCE
> Task :solr:modules:s3-repository:processTestResources
> Task :solr:modules:scripting:processResources NO-SOURCE
> Task :solr:modules:scripting:processTestResources
> Task :solr:modules:sql:copySolrCoreTestResources
> Task :solr:modules:sql:processTestResources

> Task :solr:solrj:openApiGenerate
Cleaned up output directory /home/jenkins/jenkins-agent/workspace/Solr/Solr-Test-main/solr/solrj/build/generated before code generation.
[openApiGenerate] Worker isolation: classloader (fast startup, but generator classes accumulate in Gradle daemon Metaspace - consider workerIsolation = "process" if you hit metaspace pressure)
No application/json content media type found in response. Response examples can currently only be generated for application/json media type.
############################################################################################
# Thanks for using OpenAPI Generator.                                                      #
# We appreciate your support! Please consider donation to help us maintain this project.   #
# https://opencollective.com/openapi_generator/donate                                      #
############################################################################################
Successfully generated code to /home/jenkins/jenkins-agent/workspace/Solr/Solr-Test-main/solr/solrj/build/generated

> Task :solr:solrj:generatedSpotlessHelper
> Task :solr:solrj:generatedSpotless

> Task :solr:solrj:compileJava
Note: Some input files use or override a deprecated API.
Note: Recompile with -Xlint:deprecation for details.

> Task :solr:solrj-jetty:compileJava
Note: /home/jenkins/jenkins-agent/workspace/Solr/Solr-Test-main/solr/solrj-jetty/src/java/org/apache/solr/client/solrj/jetty/HttpJettySolrClient.java uses or overrides a deprecated API.
Note: Recompile with -Xlint:deprecation for details.

> Task :solr:solrj-streaming:compileJava
Note: Some input files use or override a deprecated API.
Note: Recompile with -Xlint:deprecation for details.

> Task :solr:solrj-zookeeper:compileJava
Note: Some input files use or override a deprecated API.
Note: Recompile with -Xlint:deprecation for details.

> Task :solr:core:compileJava
Note: Some input files use or override a deprecated API.
Note: Recompile with -Xlint:deprecation for details.

> Task :solr:test-framework:compileJava
Note: Some input files use or override a deprecated API.
Note: Recompile with -Xlint:deprecation for details.

> Task :solr:api:compileTestJava
> Task :solr:api:testClasses
> Task :solr:core:classes
> Task :solr:core:jar
> Task :solr:solrj:classes
> Task :solr:solrj:jar
> Task :solr:solrj-jetty:classes
> Task :solr:solrj-jetty:jar
> Task :solr:solrj-streaming:classes
> Task :solr:solrj-streaming:jar
> Task :solr:solrj-zookeeper:classes
> Task :solr:solrj-zookeeper:jar
> Task :solr:test-framework:classes
> Task :solr:test-framework:jar

> Task :solr:api:test
WARNING: Using incubator modules: jdk.incubator.vector
WARNING: Using incubator modules: jdk.incubator.vector
WARNING: A command line option has enabled the Security Manager
WARNING: The Security Manager is deprecated and will be removed in a future release
WARNING: A command line option has enabled the Security Manager
WARNING: The Security Manager is deprecated and will be removed in a future release
java.security.policy: error adding Permission, java.net.URLPermission:
java.security.policy: error adding Permission, java.net.URLPermission:
	java.util.ServiceConfigurationError: Locale provider adapter "CLDR"cannot be instantiated.
	java.util.ServiceConfigurationError: Locale provider adapter "CLDR"cannot be instantiated.
java.security.policy: error adding Permission, java.net.URLPermission:
java.security.policy: error adding Permission, java.net.URLPermission:
	java.util.ServiceConfigurationError: Locale provider adapter "CLDR"cannot be instantiated.
	java.util.ServiceConfigurationError: Locale provider adapter "CLDR"cannot be instantiated.
java.security.policy: error adding Permission, java.net.URLPermission:
java.security.policy: error adding Permission, java.net.URLPermission:
	java.util.ServiceConfigurationError: Locale provider adapter "CLDR"cannot be instantiated.
	java.util.ServiceConfigurationError: Locale provider adapter "CLDR"cannot be instantiated.
java.security.policy: error adding Permission, java.net.URLPermission:
	java.util.ServiceConfigurationError: Locale provider adapter "CLDR"cannot be instantiated.
java.security.policy: error adding Permission, java.net.URLPermission:
	java.util.ServiceConfigurationError: Locale provider adapter "CLDR"cannot be instantiated.
java.security.policy: error adding Permission, java.net.URLPermission:
	java.util.ServiceConfigurationError: Locale provider adapter "CLDR"cannot be instantiated.
java.security.policy: error adding Permission, java.net.URLPermission:
	java.util.ServiceConfigurationError: Locale provider adapter "CLDR"cannot be instantiated.
:solr:api:test (SUCCESS): 19 test(s)

> Task :solr:api:wipeTaskTemp

> Task :solr:benchmark:compileJava
Note: /home/jenkins/jenkins-agent/workspace/Solr/Solr-Test-main/solr/benchmark/src/java/org/apache/solr/bench/lifecycle/SolrStartup.java uses or overrides a deprecated API.
Note: Recompile with -Xlint:deprecation for details.

> Task :solr:benchmark:classes
> Task :solr:benchmark:compileTestJava
> Task :solr:benchmark:testClasses

> Task :solr:benchmark:test
WARNING: Using incubator modules: jdk.incubator.vector
WARNING: Using incubator modules: jdk.incubator.vector
WARNING: Using incubator modules: jdk.incubator.vector
WARNING: A command line option has enabled the Security Manager
WARNING: The Security Manager is deprecated and will be removed in a future release
WARNING: A command line option has enabled the Security Manager
WARNING: The Security Manager is deprecated and will be removed in a future release
WARNING: A command line option has enabled the Security Manager
WARNING: The Security Manager is deprecated and will be removed in a future release
java.security.policy: error adding Permission, java.net.URLPermission:
	java.util.ServiceConfigurationError: Locale provider adapter "CLDR"cannot be instantiated.
java.security.policy: error adding Permission, java.net.URLPermission:
java.security.policy: error adding Permission, java.net.URLPermission:
	java.util.ServiceConfigurationError: Locale provider adapter "CLDR"cannot be instantiated.
	java.util.ServiceConfigurationError: Locale provider adapter "CLDR"cannot be instantiated.
java.security.policy: error adding Permission, java.net.URLPermission:
	java.util.ServiceConfigurationError: Locale provider adapter "CLDR"cannot be instantiated.
java.security.policy: error adding Permission, java.net.URLPermission:
	java.util.ServiceConfigurationError: Locale provider adapter "CLDR"cannot be instantiated.
java.security.policy: error adding Permission, java.net.URLPermission:
	java.util.ServiceConfigurationError: Locale provider adapter "CLDR"cannot be instantiated.
java.security.policy: error adding Permission, java.net.URLPermission:
	java.util.ServiceConfigurationError: Locale provider adapter "CLDR"cannot be instantiated.
java.security.policy: error adding Permission, java.net.URLPermission:
java.security.policy: error adding Permission, java.net.URLPermission:
	java.util.ServiceConfigurationError: Locale provider adapter "CLDR"cannot be instantiated.
java.security.policy: error adding Permission, java.net.URLPermission:
	java.util.ServiceConfigurationError: Locale provider adapter "CLDR"cannot be instantiated.
	java.util.ServiceConfigurationError: Locale provider adapter "CLDR"cannot be instantiated.
java.security.policy: error adding Permission, java.net.URLPermission:
java.security.policy: error adding Permission, java.net.URLPermission:
	java.util.ServiceConfigurationError: Locale provider adapter "CLDR"cannot be instantiated.
	java.util.ServiceConfigurationError: Locale provider adapter "CLDR"cannot be instantiated.
java.security.policy: error adding Permission, java.net.URLPermission:
	java.util.ServiceConfigurationError: Locale provider adapter "CLDR"cannot be instantiated.
java.security.policy: error adding Permission, java.net.URLPermission:
	java.util.ServiceConfigurationError: Locale provider adapter "CLDR"cannot be instantiated.
java.security.policy: error adding Permission, java.net.URLPermission:
	java.util.ServiceConfigurationError: Locale provider adapter "CLDR"cannot be instantiated.
:solr:benchmark:test (SUCCESS): 10 test(s)

> Task :solr:benchmark:wipeTaskTemp
> Task :solr:core:compileTestJava
Note: Some input files use or override a deprecated API.
Note: Recompile with -Xlint:deprecation for details.

> Task :solr:core:testClasses

> Task :solr:modules:analysis-extras:compileJava
Note: /home/jenkins/jenkins-agent/workspace/Solr/Solr-Test-main/solr/modules/analysis-extras/src/java/org/apache/solr/schema/ICUCollationField.java uses or overrides a deprecated API.
Note: Recompile with -Xlint:deprecation for details.

> Task :solr:modules:analysis-extras:classes
> Task :solr:modules:analysis-extras:jar

> Task :solr:core:test
WARNING: Using incubator modules: jdk.incubator.vector
WARNING: Using incubator modules: jdk.incubator.vector
WARNING: Using incubator modules: jdk.incubator.vector
WARNING: Using incubator modules: jdk.incubator.vector
WARNING: A command line option has enabled the Security Manager
WARNING: The Security Manager is deprecated and will be removed in a future release
WARNING: A command line option has enabled the Security Manager
WARNING: The Security Manager is deprecated and will be removed in a future release
WARNING: A command line option has enabled the Security Manager
WARNING: The Security Manager is deprecated and will be removed in a future release
WARNING: A command line option has enabled the Security Manager
WARNING: The Security Manager is deprecated and will be removed in a future release
java.security.policy: error adding Permission, java.net.URLPermission:
	java.util.ServiceConfigurationError: Locale provider adapter "CLDR"cannot be instantiated.
java.security.policy: error adding Permission, java.net.URLPermission:
	java.util.ServiceConfigurationError: Locale provider adapter "CLDR"cannot be instantiated.
java.security.policy: error adding Permission, java.net.URLPermission:
	java.util.ServiceConfigurationError: Locale provider adapter "CLDR"cannot be instantiated.
java.security.policy: error adding Permission, java.net.URLPermission:
	java.util.ServiceConfigurationError: Locale provider adapter "CLDR"cannot be instantiated.
java.security.policy: error adding Permission, java.net.URLPermission:
	java.util.ServiceConfigurationError: Locale provider adapter "CLDR"cannot be instantiated.
java.security.policy: error adding Permission, java.net.URLPermission:
	java.util.ServiceConfigurationError: Locale provider adapter "CLDR"cannot be instantiated.
java.security.policy: error adding Permission, java.net.URLPermission:
	java.util.ServiceConfigurationError: Locale provider adapter "CLDR"cannot be instantiated.
java.security.policy: error adding Permission, java.net.URLPermission:
	java.util.ServiceConfigurationError: Locale provider adapter "CLDR"cannot be instantiated.
java.security.policy: error adding Permission, java.net.URLPermission:
	java.util.ServiceConfigurationError: Locale provider adapter "CLDR"cannot be instantiated.
java.security.policy: error adding Permission, java.net.URLPermission:
	java.util.ServiceConfigurationError: Locale provider adapter "CLDR"cannot be instantiated.
java.security.policy: error adding Permission, java.net.URLPermission:
	java.util.ServiceConfigurationError: Locale provider adapter "CLDR"cannot be instantiated.
java.security.policy: error adding Permission, java.net.URLPermission:
	java.util.ServiceConfigurationError: Locale provider adapter "CLDR"cannot be instantiated.
java.security.policy: error adding Permission, java.net.URLPermission:
	java.util.ServiceConfigurationError: Locale provider adapter "CLDR"cannot be instantiated.
java.security.policy: error adding Permission, java.net.URLPermission:
	java.util.ServiceConfigurationError: Locale provider adapter "CLDR"cannot be instantiated.
java.security.policy: error adding Permission, java.net.URLPermission:
	java.util.ServiceConfigurationError: Locale provider adapter "CLDR"cannot be instantiated.
java.security.policy: error adding Permission, java.net.URLPermission:
	java.util.ServiceConfigurationError: Locale provider adapter "CLDR"cannot be instantiated.
java.security.policy: error adding Permission, java.net.URLPermission:
	java.util.ServiceConfigurationError: Locale provider adapter "CLDR"cannot be instantiated.
java.security.policy: error adding Permission, java.net.URLPermission:
	java.util.ServiceConfigurationError: Locale provider adapter "CLDR"cannot be instantiated.
java.security.policy: error adding Permission, java.net.URLPermission:
	java.util.ServiceConfigurationError: Locale provider adapter "CLDR"cannot be instantiated.
java.security.policy: error adding Permission, java.net.URLPermission:
	java.util.ServiceConfigurationError: Locale provider adapter "CLDR"cannot be instantiated.
WARNING: Test org.apache.solr.TestRandomFaceting wrote 24,173,764 bytes of output.

RecoveryAfterSoftCommitTest > test FAILED
    org.apache.solr.client.solrj.SolrServerException: java.nio.channels.ClosedChannelException
        at __randomizedtesting.SeedInfo.seed([29DCE295C440B786:A188DD4F6ABCDA7E]:0)
        at app//org.apache.solr.client.solrj.impl.LBSolrClient.doRequest(LBSolrClient.java:680)
        at app//org.apache.solr.client.solrj.impl.LBSolrClient.request(LBSolrClient.java:582)
        at app//org.apache.solr.client.solrj.impl.CloudSolrClient.sendRequest(CloudSolrClient.java:1088)
        at app//org.apache.solr.client.solrj.impl.CloudSolrClient.requestWithRetryOnStaleState(CloudSolrClient.java:723)
        at app//org.apache.solr.client.solrj.impl.CloudSolrClient.request(CloudSolrClient.java:645)
        at app//org.apache.solr.client.solrj.SolrRequest.process(SolrRequest.java:314)
        at app//org.apache.solr.client.solrj.SolrClient.add(SolrClient.java:167)
        at app//org.apache.solr.client.solrj.SolrClient.add(SolrClient.java:132)
        at app//org.apache.solr.client.solrj.SolrClient.add(SolrClient.java:148)
        at app//org.apache.solr.cloud.RecoveryAfterSoftCommitTest.test(RecoveryAfterSoftCommitTest.java:106)
        at java.base@21.0.4/jdk.internal.reflect.DirectMethodHandleAccessor.invoke(DirectMethodHandleAccessor.java:103)
        at java.base@21.0.4/java.lang.reflect.Method.invoke(Method.java:580)
        at app//com.carrotsearch.randomizedtesting.RandomizedRunner.invoke(RandomizedRunner.java:1780)
        at app//com.carrotsearch.randomizedtesting.RandomizedRunner$8.evaluate(RandomizedRunner.java:959)
        at app//com.carrotsearch.randomizedtesting.RandomizedRunner$9.evaluate(RandomizedRunner.java:995)
        at app//com.carrotsearch.randomizedtesting.RandomizedRunner$10.evaluate(RandomizedRunner.java:1009)
        at app//org.apache.solr.BaseDistributedSearchTestCase$ShardsRepeatRule$ShardsFixedStatement.callStatement(BaseDistributedSearchTestCase.java:1088)
        at app//org.apache.solr.BaseDistributedSearchTestCase$ShardsRepeatRule$ShardsStatement.evaluate(BaseDistributedSearchTestCase.java:1059)
        at app//com.carrotsearch.randomizedtesting.rules.SystemPropertiesRestoreRule$1.evaluate(SystemPropertiesRestoreRule.java:80)
        at app//org.junit.rules.RunRules.evaluate(RunRules.java:20)
        at app//org.apache.lucene.tests.util.TestRuleSetupTeardownChained$1.evaluate(TestRuleSetupTeardownChained.java:48)
        at app//org.apache.lucene.tests.util.AbstractBeforeAfterRule$1.evaluate(AbstractBeforeAfterRule.java:43)
        at app//org.apache.lucene.tests.util.TestRuleThreadAndTestName$1.evaluate(TestRuleThreadAndTestName.java:45)
        at app//org.apache.lucene.tests.util.TestRuleIgnoreAfterMaxFailures$1.evaluate(TestRuleIgnoreAfterMaxFailures.java:60)
        at app//org.apache.lucene.tests.util.TestRuleMarkFailure$1.evaluate(TestRuleMarkFailure.java:44)
        at app//org.junit.rules.RunRules.evaluate(RunRules.java:20)
        at app//com.carrotsearch.randomizedtesting.rules.StatementAdapter.evaluate(StatementAdapter.java:36)
        at app//com.carrotsearch.randomizedtesting.ThreadLeakControl$StatementRunner.run(ThreadLeakControl.java:390)
        at app//com.carrotsearch.randomizedtesting.ThreadLeakControl.forkTimeoutingTask(ThreadLeakControl.java:843)
        at app//com.carrotsearch.randomizedtesting.ThreadLeakControl$3.evaluate(ThreadLeakControl.java:490)
        at app//com.carrotsearch.randomizedtesting.RandomizedRunner.runSingleTest(RandomizedRunner.java:968)
        at app//com.carrotsearch.randomizedtesting.RandomizedRunner$5.evaluate(RandomizedRunner.java:853)
        at app//com.carrotsearch.randomizedtesting.RandomizedRunner$6.evaluate(RandomizedRunner.java:904)
        at app//com.carrotsearch.randomizedtesting.RandomizedRunner$7.evaluate(RandomizedRunner.java:915)
        at app//com.carrotsearch.randomizedtesting.rules.StatementAdapter.evaluate(StatementAdapter.java:36)
        at app//com.carrotsearch.randomizedtesting.rules.StatementAdapter.evaluate(StatementAdapter.java:36)
        at app//org.apache.lucene.tests.util.AbstractBeforeAfterRule$1.evaluate(AbstractBeforeAfterRule.java:43)
        at app//com.carrotsearch.randomizedtesting.rules.SystemPropertiesRestoreRule$1.evaluate(SystemPropertiesRestoreRule.java:80)
        at app//org.junit.rules.RunRules.evaluate(RunRules.java:20)
        at app//org.apache.lucene.tests.util.AbstractBeforeAfterRule$1.evaluate(AbstractBeforeAfterRule.java:43)
        at app//com.carrotsearch.randomizedtesting.rules.StatementAdapter.evaluate(StatementAdapter.java:36)
        at app//org.apache.lucene.tests.util.TestRuleStoreClassName$1.evaluate(TestRuleStoreClassName.java:38)
        at app//com.carrotsearch.randomizedtesting.rules.NoShadowingOrOverridesOnMethodsRule$1.evaluate(NoShadowingOrOverridesOnMethodsRule.java:40)
        at app//com.carrotsearch.randomizedtesting.rules.NoShadowingOrOverridesOnMethodsRule$1.evaluate(NoShadowingOrOverridesOnMethodsRule.java:40)
        at app//com.carrotsearch.randomizedtesting.rules.StatementAdapter.evaluate(StatementAdapter.java:36)
        at app//com.carrotsearch.randomizedtesting.rules.StatementAdapter.evaluate(StatementAdapter.java:36)
        at app//org.apache.lucene.tests.util.TestRuleAssertionsRequired$1.evaluate(TestRuleAssertionsRequired.java:53)
        at app//org.apache.lucene.tests.util.AbstractBeforeAfterRule$1.evaluate(AbstractBeforeAfterRule.java:43)
        at app//org.apache.lucene.tests.util.TestRuleMarkFailure$1.evaluate(TestRuleMarkFailure.java:44)
        at app//org.apache.lucene.tests.util.TestRuleIgnoreAfterMaxFailures$1.evaluate(TestRuleIgnoreAfterMaxFailures.java:60)
        at app//org.apache.lucene.tests.util.TestRuleIgnoreTestSuites$1.evaluate(TestRuleIgnoreTestSuites.java:47)
        at app//org.junit.rules.RunRules.evaluate(RunRules.java:20)
        at app//com.carrotsearch.randomizedtesting.rules.StatementAdapter.evaluate(StatementAdapter.java:36)
        at app//com.carrotsearch.randomizedtesting.ThreadLeakControl$StatementRunner.run(ThreadLeakControl.java:390)
        at app//com.carrotsearch.randomizedtesting.ThreadLeakControl.lambda$forkTimeoutingTask$0(ThreadLeakControl.java:850)
        at java.base@21.0.4/java.lang.Thread.run(Thread.java:1583)

        Caused by:
        java.nio.channels.ClosedChannelException
            at org.eclipse.jetty.http2.HTTP2Session$StreamsState.onShutdown(HTTP2Session.java:2173)
            at org.eclipse.jetty.http2.HTTP2Session.onShutdown(HTTP2Session.java:1206)
            at org.eclipse.jetty.http2.HTTP2Connection$HTTP2Producer.produce(HTTP2Connection.java:441)
            at org.eclipse.jetty.util.thread.strategy.AdaptiveExecutionStrategy.produceTask(AdaptiveExecutionStrategy.java:509)
            at org.eclipse.jetty.util.thread.strategy.AdaptiveExecutionStrategy.tryProduce(AdaptiveExecutionStrategy.java:251)
            at org.eclipse.jetty.util.thread.strategy.AdaptiveExecutionStrategy.produce(AdaptiveExecutionStrategy.java:196)
            at org.eclipse.jetty.http2.HTTP2Connection.produce(HTTP2Connection.java:237)
            at org.eclipse.jetty.http2.HTTP2Connection.onFillable(HTTP2Connection.java:165)
            at org.eclipse.jetty.http2.HTTP2Connection$FillableCallback.succeeded(HTTP2Connection.java:592)
            at org.eclipse.jetty.io.FillInterest.fillable(FillInterest.java:105)
            at org.eclipse.jetty.io.SelectableChannelEndPoint$1.run(SelectableChannelEndPoint.java:54)
            at org.eclipse.jetty.util.thread.Invocable.invokeNonBlocking(Invocable.java:225)
            at org.eclipse.jetty.util.thread.strategy.AdaptiveExecutionStrategy.picRunTask(AdaptiveExecutionStrategy.java:473)
            at org.eclipse.jetty.util.thread.strategy.AdaptiveExecutionStrategy.consumeTask(AdaptiveExecutionStrategy.java:399)
            at org.eclipse.jetty.util.thread.strategy.AdaptiveExecutionStrategy.tryProduce(AdaptiveExecutionStrategy.java:255)
            at org.eclipse.jetty.util.thread.strategy.AdaptiveExecutionStrategy.produce(AdaptiveExecutionStrategy.java:196)
            at org.apache.solr.common.util.ExecutorUtil$MDCAwareThreadPoolExecutor.lambda$execute$0(ExecutorUtil.java:390)
            at java.base/java.util.concurrent.ThreadPoolExecutor.runWorker(ThreadPoolExecutor.java:1144)
            at java.base/java.util.concurrent.ThreadPoolExecutor$Worker.run(ThreadPoolExecutor.java:642)
            ... 1 more

org.apache.solr.cloud.RecoveryAfterSoftCommitTest > test suite's output saved to /home/jenkins/jenkins-agent/workspace/Solr/Solr-Test-main/solr/core/build/test-results/test/outputs/OUTPUT-org.apache.solr.cloud.RecoveryAfterSoftCommitTest.txt, copied below:
  2> 208012 INFO  (SUITE-RecoveryAfterSoftCommitTest-seed#[29DCE295C440B786]-worker) [] o.a.s.SolrTestCase Setting 'solr.configset.default.confdir' system property to test-framework derived value of '/home/jenkins/jenkins-agent/workspace/Solr/Solr-Test-main/solr/server/solr/configsets/_default/conf'
  2> 208012 INFO  (SUITE-RecoveryAfterSoftCommitTest-seed#[29DCE295C440B786]-worker) [] o.a.s.SolrTestCaseJ4 SecureRandom sanity checks: test.solr.allowed.securerandom=null & java.security.egd=file:/dev/./urandom
  2> 208013 INFO  (SUITE-RecoveryAfterSoftCommitTest-seed#[29DCE295C440B786]-worker) [] o.a.s.u.ErrorLogMuter Closing ErrorLogMuter-regex-66 after muting 0 log messages
  2> 208013 INFO  (SUITE-RecoveryAfterSoftCommitTest-seed#[29DCE295C440B786]-worker) [] o.a.s.u.ErrorLogMuter Creating ErrorLogMuter-regex-67 for ERROR logs matching regex: ignore_exception
  2> 208014 INFO  (SUITE-RecoveryAfterSoftCommitTest-seed#[29DCE295C440B786]-worker) [] o.a.s.SolrTestCaseJ4 Created dataDir: /home/jenkins/jenkins-agent/workspace/Solr/Solr-Test-main/solr/core/build/tmp/tests-tmp/org.apache.solr.cloud.RecoveryAfterSoftCommitTest_29DCE295C440B786-001/data-dir-27-001
  2> 208014 INFO  (SUITE-RecoveryAfterSoftCommitTest-seed#[29DCE295C440B786]-worker) [] o.a.s.SolrTestCaseJ4 Using PointFields (NUMERIC_POINTS_SYSPROP=true) w/NUMERIC_DOCVALUES_SYSPROP=true
  2> 208015 WARN  (SUITE-RecoveryAfterSoftCommitTest-seed#[29DCE295C440B786]-worker) [] o.e.j.u.r.ResourceFactory Leaked /home/jenkins/jenkins-agent/workspace/Solr/Solr-Test-main/solr/test-framework/build/libs/solr-test-framework-11.0.0-SNAPSHOT.jar for jar:file:///home/jenkins/jenkins-agent/workspace/Solr/Solr-Test-main/solr/test-framework/build/libs/solr-test-framework-11.0.0-SNAPSHOT.jar!/SSLTestConfig.hostname-and-ip-missmatch.keystore
  2> 208015 INFO  (SUITE-RecoveryAfterSoftCommitTest-seed#[29DCE295C440B786]-worker) [] o.a.s.SolrTestCaseJ4 Randomized ssl (false) and clientAuth (false) via: @org.apache.solr.SolrTestCaseJ4.SuppressSSL(bugUrl="None")
  2> 208020 INFO  (TEST-RecoveryAfterSoftCommitTest.test-seed#[29DCE295C440B786]) [] o.a.s.u.ErrorLogMuter Closing ErrorLogMuter-regex-67 after muting 0 log messages
  2> 208020 INFO  (TEST-RecoveryAfterSoftCommitTest.test-seed#[29DCE295C440B786]) [] o.a.s.u.ErrorLogMuter Creating ErrorLogMuter-regex-68 for ERROR logs matching regex: ignore_exception
  2> 208021 INFO  (TEST-RecoveryAfterSoftCommitTest.test-seed#[29DCE295C440B786]) [] o.a.s.c.ZkTestServer STARTING ZK TEST SERVER
  2> 208021 INFO  (ZkTestServer Run Thread) [] o.a.s.c.ZkTestServer client port: /127.0.0.1:0
  2> 208021 INFO  (ZkTestServer Run Thread) [] o.a.s.c.ZkTestServer Starting server
  2> 208022 WARN  (ZkTestServer Run Thread) [] o.a.z.s.ServerCnxnFactory maxCnxns is not configured, using default value 0.
  2> 208121 INFO  (TEST-RecoveryAfterSoftCommitTest.test-seed#[29DCE295C440B786]) [] o.a.s.c.ZkTestServer start zk server on port: 34081
  2> 208123 WARN  (TEST-RecoveryAfterSoftCommitTest.test-seed#[29DCE295C440B786]) [] o.a.s.c.c.SolrZkClient Using default ZkCredentialsInjector. ZkCredentialsInjector is not secure, it creates an empty list of credentials which leads to 'OPEN_ACL_UNSAFE' ACLs to Zookeeper nodes
  2> 208123 WARN  (TEST-RecoveryAfterSoftCommitTest.test-seed#[29DCE295C440B786]) [] o.a.s.c.c.SolrZkClient Using default ZkACLProvider. DefaultZkACLProvider is not secure, it creates 'OPEN_ACL_UNSAFE' ACLs to Zookeeper nodes
  2> 208123 INFO  (TEST-RecoveryAfterSoftCommitTest.test-seed#[29DCE295C440B786]) [] o.a.c.f.i.CuratorFrameworkImpl Starting
  2> 208124 INFO  (TEST-RecoveryAfterSoftCommitTest.test-seed#[29DCE295C440B786]) [] o.a.c.f.i.CuratorFrameworkImpl Default schema
  2> 208125 INFO  (TEST-RecoveryAfterSoftCommitTest.test-seed#[29DCE295C440B786]-EventThread) [] o.a.c.f.s.ConnectionStateManager State change: CONNECTED
  2> 208126 INFO  (TEST-RecoveryAfterSoftCommitTest.test-seed#[29DCE295C440B786]-EventThread) [] o.a.c.f.i.EnsembleTracker New config event received: {}
  2> 208126 INFO  (TEST-RecoveryAfterSoftCommitTest.test-seed#[29DCE295C440B786]-EventThread) [] o.a.c.f.i.EnsembleTracker New config event received: {}
  2> 208127 WARN  (TEST-RecoveryAfterSoftCommitTest.test-seed#[29DCE295C440B786]) [] o.a.s.c.c.SolrZkClient Using default ZkCredentialsInjector. ZkCredentialsInjector is not secure, it creates an empty list of credentials which leads to 'OPEN_ACL_UNSAFE' ACLs to Zookeeper nodes
  2> 208127 WARN  (TEST-RecoveryAfterSoftCommitTest.test-seed#[29DCE295C440B786]) [] o.a.s.c.c.SolrZkClient Using default ZkACLProvider. DefaultZkACLProvider is not secure, it creates 'OPEN_ACL_UNSAFE' ACLs to Zookeeper nodes
  2> 208127 INFO  (TEST-RecoveryAfterSoftCommitTest.test-seed#[29DCE295C440B786]) [] o.a.c.f.i.CuratorFrameworkImpl Starting
  2> 208128 INFO  (TEST-RecoveryAfterSoftCommitTest.test-seed#[29DCE295C440B786]) [] o.a.c.f.i.CuratorFrameworkImpl Default schema
  2> 208129 INFO  (TEST-RecoveryAfterSoftCommitTest.test-seed#[29DCE295C440B786]-EventThread) [] o.a.c.f.s.ConnectionStateManager State change: CONNECTED
  2> 208129 INFO  (TEST-RecoveryAfterSoftCommitTest.test-seed#[29DCE295C440B786]-EventThread) [] o.a.c.f.i.EnsembleTracker New config event received: {}
  2> 208129 INFO  (TEST-RecoveryAfterSoftCommitTest.test-seed#[29DCE295C440B786]-EventThread) [] o.a.c.f.i.EnsembleTracker New config event received: {}
  2> 208130 INFO  (TEST-RecoveryAfterSoftCommitTest.test-seed#[29DCE295C440B786]) [] o.a.s.c.ZkTestServer put /home/jenkins/jenkins-agent/workspace/Solr/Solr-Test-main/solr/core/build/resources/test/solr/collection1/conf/solrconfig-tlog.xml to /configs/conf1/solrconfig.xml
  2> 208131 INFO  (TEST-RecoveryAfterSoftCommitTest.test-seed#[29DCE295C440B786]) [] o.a.s.c.ZkTestServer put /home/jenkins/jenkins-agent/workspace/Solr/Solr-Test-main/solr/core/build/resources/test/solr/collection1/conf/schema.xml to /configs/conf1/schema.xml
  2> 208132 INFO  (TEST-RecoveryAfterSoftCommitTest.test-seed#[29DCE295C440B786]) [] o.a.s.c.ZkTestServer put /home/jenkins/jenkins-agent/workspace/Solr/Solr-Test-main/solr/core/build/resources/test/solr/collection1/conf/solrconfig.snippet.randomindexconfig.xml to /configs/conf1/solrconfig.snippet.randomindexconfig.xml
  2> 208133 INFO  (TEST-RecoveryAfterSoftCommitTest.test-seed#[29DCE295C440B786]) [] o.a.s.c.ZkTestServer put /home/jenkins/jenkins-agent/workspace/Solr/Solr-Test-main/solr/core/build/resources/test/solr/collection1/conf/stopwords.txt to /configs/conf1/stopwords.txt
  2> 208134 INFO  (TEST-RecoveryAfterSoftCommitTest.test-seed#[29DCE295C440B786]) [] o.a.s.c.ZkTestServer put /home/jenkins/jenkins-agent/workspace/Solr/Solr-Test-main/solr/core/build/resources/test/solr/collection1/conf/protwords.txt to /configs/conf1/protwords.txt
  2> 208135 INFO  (TEST-RecoveryAfterSoftCommitTest.test-seed#[29DCE295C440B786]) [] o.a.s.c.ZkTestServer put /home/jenkins/jenkins-agent/workspace/Solr/Solr-Test-main/solr/core/build/resources/test/solr/collection1/conf/currency.xml to /configs/conf1/currency.xml
  2> 208136 INFO  (TEST-RecoveryAfterSoftCommitTest.test-seed#[29DCE295C440B786]) [] o.a.s.c.ZkTestServer put /home/jenkins/jenkins-agent/workspace/Solr/Solr-Test-main/solr/core/build/resources/test/solr/collection1/conf/enumsConfig.xml to /configs/conf1/enumsConfig.xml
  2> 208137 INFO  (TEST-RecoveryAfterSoftCommitTest.test-seed#[29DCE295C440B786]) [] o.a.s.c.ZkTestServer put /home/jenkins/jenkins-agent/workspace/Solr/Solr-Test-main/solr/core/build/resources/test/solr/collection1/conf/open-exchange-rates.json to /configs/conf1/open-exchange-rates.json
  2> 208138 INFO  (TEST-RecoveryAfterSoftCommitTest.test-seed#[29DCE295C440B786]) [] o.a.s.c.ZkTestServer put /home/jenkins/jenkins-agent/workspace/Solr/Solr-Test-main/solr/core/build/resources/test/solr/collection1/conf/mapping-ISOLatin1Accent.txt to /configs/conf1/mapping-ISOLatin1Accent.txt
  2> 208139 INFO  (TEST-RecoveryAfterSoftCommitTest.test-seed#[29DCE295C440B786]) [] o.a.s.c.ZkTestServer put /home/jenkins/jenkins-agent/workspace/Solr/Solr-Test-main/solr/core/build/resources/test/solr/collection1/conf/old_synonyms.txt to /configs/conf1/old_synonyms.txt
  2> 208139 INFO  (TEST-RecoveryAfterSoftCommitTest.test-seed#[29DCE295C440B786]) [] o.a.s.c.ZkTestServer put /home/jenkins/jenkins-agent/workspace/Solr/Solr-Test-main/solr/core/build/resources/test/solr/collection1/conf/synonyms.txt to /configs/conf1/synonyms.txt
  2> 208140 INFO  (TEST-RecoveryAfterSoftCommitTest.test-seed#[29DCE295C440B786]) [] o.a.s.c.AbstractFullDistribZkTestBase Will use NRT replicas unless explicitly asked otherwise
  2> 208279 INFO  (TEST-RecoveryAfterSoftCommitTest.test-seed#[29DCE295C440B786]) [] o.a.s.e.JettySolrRunner Start Jetty (configured port=0, binding port=0)
  2> 208279 INFO  (TEST-RecoveryAfterSoftCommitTest.test-seed#[29DCE295C440B786]) [] o.a.s.e.JettySolrRunner Trying to start Jetty on port 0 try number 2 ...
  2> 208279 INFO  (TEST-RecoveryAfterSoftCommitTest.test-seed#[29DCE295C440B786]) [] o.e.j.s.Server jetty-12.1.10; built: 2026-05-31T04:45:52.925Z; git: 986024525891c2c20ff08c58ba300dc3b9847586; jvm 21.0.4+7-LTS
  2> 208281 INFO  (TEST-RecoveryAfterSoftCommitTest.test-seed#[29DCE295C440B786]) [] o.e.j.s.DefaultSessionIdManager Session workerName=node0
  2> 208281 WARN  (TEST-RecoveryAfterSoftCommitTest.test-seed#[29DCE295C440B786]) [] o.e.j.e.s.ServletContextHandler BaseResource file:///home/jenkins/jenkins-agent/workspace/Solr/Solr-Test-main/solr/core/build/tmp/tests-cwd/./ is aliased to file:///home/jenkins/jenkins-agent/workspace/Solr/Solr-Test-main/solr/core/build/tmp/tests-cwd/ in oeje10s.ServletContextHandler@78dd7a8{/solr,/solr,b=file:///home/jenkins/jenkins-agent/workspace/Solr/Solr-Test-main/solr/core/build/tmp/tests-cwd/./,a=STOPPED,h=oeje10s.ServletHandler@eec98ef{STOPPED}}. May not be supported in future releases.
  2> 208282 INFO  (TEST-RecoveryAfterSoftCommitTest.test-seed#[29DCE295C440B786]) [] o.e.j.s.h.ContextHandler /solr Base Resource is an alias: file:///home/jenkins/jenkins-agent/workspace/Solr/Solr-Test-main/solr/core/build/tmp/tests-cwd/./ -> file:///home/jenkins/jenkins-agent/workspace/Solr/Solr-Test-main/solr/core/build/tmp/tests-cwd/
  2> 208282 INFO  (TEST-RecoveryAfterSoftCommitTest.test-seed#[29DCE295C440B786]) [] o.e.j.s.h.ContextHandler Started oeje10s.ServletContextHandler@78dd7a8{/solr,/solr,b=file:///home/jenkins/jenkins-agent/workspace/Solr/Solr-Test-main/solr/core/build/tmp/tests-cwd/,a=AVAILABLE,h=oeje10s.ServletHandler@eec98ef{STARTED}}
  2> 208282 INFO  (TEST-RecoveryAfterSoftCommitTest.test-seed#[29DCE295C440B786]) [] o.a.s.e.JettySolrRunner Jetty properties: {solr.data.dir=/home/jenkins/jenkins-agent/workspace/Solr/Solr-Test-main/solr/core/build/tmp/tests-tmp/org.apache.solr.cloud.RecoveryAfterSoftCommitTest_29DCE295C440B786-001/tempDir-001/control/data, hostPort=35347, coreRootDirectory=/home/jenkins/jenkins-agent/workspace/Solr/Solr-Test-main/solr/core/build/tmp/tests-tmp/org.apache.solr.cloud.RecoveryAfterSoftCommitTest_29DCE295C440B786-001/control-001/cores, replicaType=NRT}
  2> 208282 ERROR (TEST-RecoveryAfterSoftCommitTest.test-seed#[29DCE295C440B786]) [] o.a.s.u.StartupLoggingUtils Missing Java Option solr.logs.dir. Logging may be missing or incomplete.
  2> 208282 INFO  (TEST-RecoveryAfterSoftCommitTest.test-seed#[29DCE295C440B786]) [] o.a.s.s.CoreContainerProvider Using logger factory org.apache.logging.slf4j.Log4jLoggerFactory
  2> 208282 INFO  (TEST-RecoveryAfterSoftCommitTest.test-seed#[29DCE295C440B786]) [] o.a.s.s.CoreContainerProvider  ___      _       Welcome to Apache Solr™ version 11.0.0
  2> 208282 INFO  (TEST-RecoveryAfterSoftCommitTest.test-seed#[29DCE295C440B786]) [] o.a.s.s.CoreContainerProvider / __| ___| |_ _   Starting in cloud mode on port null
  2> 208282 INFO  (TEST-RecoveryAfterSoftCommitTest.test-seed#[29DCE295C440B786]) [] o.a.s.s.CoreContainerProvider \__ \/ _ \ | '_|  Install dir: /home/jenkins/jenkins-agent/workspace/Solr/Solr-Test-main/solr
  2> 208282 INFO  (TEST-RecoveryAfterSoftCommitTest.test-seed#[29DCE295C440B786]) [] o.a.s.s.CoreContainerProvider |___/\___/_|_|    Start time: 2026-08-15T23:42:39.394639384Z
  2> 208282 INFO  (TEST-RecoveryAfterSoftCommitTest.test-seed#[29DCE295C440B786]) [] o.a.s.s.CoreContainerProvider Solr Home: /home/jenkins/jenkins-agent/workspace/Solr/Solr-Test-main/solr/core/build/tmp/tests-tmp/org.apache.solr.cloud.RecoveryAfterSoftCommitTest_29DCE295C440B786-001/control-001 (source: servlet config: solr.solr.home)
  2> 208282 WARN  (TEST-RecoveryAfterSoftCommitTest.test-seed#[29DCE295C440B786]) [] o.a.s.c.c.SolrZkClient Using default ZkCredentialsInjector. ZkCredentialsInjector is not secure, it creates an empty list of credentials which leads to 'OPEN_ACL_UNSAFE' ACLs to Zookeeper nodes
  2> 208282 WARN  (TEST-RecoveryAfterSoftCommitTest.test-seed#[29DCE295C440B786]) [] o.a.s.c.c.SolrZkClient Using default ZkACLProvider. DefaultZkACLProvider is not secure, it creates 'OPEN_ACL_UNSAFE' ACLs to Zookeeper nodes
  2> 208283 INFO  (TEST-RecoveryAfterSoftCommitTest.test-seed#[29DCE295C440B786]) [] o.a.c.f.i.CuratorFrameworkImpl Starting
  2> 208284 INFO  (TEST-RecoveryAfterSoftCommitTest.test-seed#[29DCE295C440B786]) [] o.a.c.f.i.CuratorFrameworkImpl Default schema
  2> 208285 INFO  (TEST-RecoveryAfterSoftCommitTest.test-seed#[29DCE295C440B786]-EventThread) [] o.a.c.f.s.ConnectionStateManager State change: CONNECTED
  2> 208285 INFO  (TEST-RecoveryAfterSoftCommitTest.test-seed#[29DCE295C440B786]-EventThread) [] o.a.c.f.i.EnsembleTracker New config event received: {}
  2> 208285 INFO  (TEST-RecoveryAfterSoftCommitTest.test-seed#[29DCE295C440B786]-EventThread) [] o.a.c.f.i.EnsembleTracker New config event received: {}
  2> 208286 INFO  (Curator-Framework-0) [] o.a.c.f.i.CuratorFrameworkImpl backgroundOperationsLoop exiting
  2> 208387 INFO  (TEST-RecoveryAfterSoftCommitTest.test-seed#[29DCE295C440B786]) [] o.a.s.c.SolrXmlConfig Loading solr.xml from /home/jenkins/jenkins-agent/workspace/Solr/Solr-Test-main/solr/core/build/tmp/tests-tmp/org.apache.solr.cloud.RecoveryAfterSoftCommitTest_29DCE295C440B786-001/control-001/solr.xml
  2> 210130 INFO  (TEST-RecoveryAfterSoftCommitTest.test-seed#[29DCE295C440B786]) [] o.a.s.c.OpenTelemetryConfigurator OpenTelemetry tracer enabled with simple propagation only.
  2> 210130 INFO  (TEST-RecoveryAfterSoftCommitTest.test-seed#[29DCE295C440B786]) [] o.a.s.m.OtelRuntimeJvmMetrics JVM metrics are disabled
  2> 210140 INFO  (TEST-RecoveryAfterSoftCommitTest.test-seed#[29DCE295C440B786]) [] o.a.s.c.ZkContainer Zookeeper client=127.0.0.1:34081/solr
  2> 210140 WARN  (TEST-RecoveryAfterSoftCommitTest.test-seed#[29DCE295C440B786]) [] o.a.s.c.c.SolrZkClient Using default ZkCredentialsInjector. ZkCredentialsInjector is not secure, it creates an empty list of credentials which leads to 'OPEN_ACL_UNSAFE' ACLs to Zookeeper nodes
  2> 210140 WARN  (TEST-RecoveryAfterSoftCommitTest.test-seed#[29DCE295C440B786]) [] o.a.s.c.c.SolrZkClient Using default ZkACLProvider. DefaultZkACLProvider is not secure, it creates 'OPEN_ACL_UNSAFE' ACLs to Zookeeper nodes
  2> 210140 INFO  (TEST-RecoveryAfterSoftCommitTest.test-seed#[29DCE295C440B786]) [] o.a.c.f.i.CuratorFrameworkImpl Starting
  2> 210142 INFO  (TEST-RecoveryAfterSoftCommitTest.test-seed#[29DCE295C440B786]) [] o.a.c.f.i.CuratorFrameworkImpl Default schema
  2> 210143 INFO  (TEST-RecoveryAfterSoftCommitTest.test-seed#[29DCE295C440B786]-EventThread) [] o.a.c.f.s.ConnectionStateManager State change: CONNECTED
  2> 210143 INFO  (TEST-RecoveryAfterSoftCommitTest.test-seed#[29DCE295C440B786]-EventThread) [] o.a.c.f.i.EnsembleTracker New config event received: {}
  2> 210143 INFO  (TEST-RecoveryAfterSoftCommitTest.test-seed#[29DCE295C440B786]-EventThread) [] o.a.c.f.i.EnsembleTracker New config event received: {}
  2> 210143 INFO  (Curator-Framework-0) [] o.a.c.f.i.CuratorFrameworkImpl backgroundOperationsLoop exiting
  2> 210245 INFO  (TEST-RecoveryAfterSoftCommitTest.test-seed#[29DCE295C440B786]) [n:127.0.0.1:35347_solr] o.a.c.f.i.CuratorFrameworkImpl Starting
  2> 210246 INFO  (TEST-RecoveryAfterSoftCommitTest.test-seed#[29DCE295C440B786]) [n:127.0.0.1:35347_solr] o.a.c.f.i.CuratorFrameworkImpl Default schema
  2> 210247 INFO  (TEST-RecoveryAfterSoftCommitTest.test-seed#[29DCE295C440B786]-EventThread) [] o.a.c.f.s.ConnectionStateManager State change: CONNECTED
  2> 210247 INFO  (TEST-RecoveryAfterSoftCommitTest.test-seed#[29DCE295C440B786]-EventThread) [] o.a.c.f.i.EnsembleTracker New config event received: {}
  2> 210247 INFO  (TEST-RecoveryAfterSoftCommitTest.test-seed#[29DCE295C440B786]-EventThread) [] o.a.c.f.i.EnsembleTracker New config event received: {}
  2> 210263 WARN  (TEST-RecoveryAfterSoftCommitTest.test-seed#[29DCE295C440B786]) [n:127.0.0.1:35347_solr] o.a.s.c.ZkController Contents of zookeeper /security.json are world-readable; consider setting up ACLs as described in https://solr.apache.org/guide/solr/latest/deployment-guide/zookeeper-access-control.html
  2> 210266 INFO  (TEST-RecoveryAfterSoftCommitTest.test-seed#[29DCE295C440B786]) [n:127.0.0.1:35347_solr] o.a.s.c.ZkController The Overseer is enabled.  It will process all cluster commands & state updates.
  2> 210269 INFO  (TEST-RecoveryAfterSoftCommitTest.test-seed#[29DCE295C440B786]) [n:127.0.0.1:35347_solr] o.a.s.c.OverseerElectionContext I am going to be the leader 127.0.0.1:35347_solr
  2> 210269 INFO  (TEST-RecoveryAfterSoftCommitTest.test-seed#[29DCE295C440B786]) [n:127.0.0.1:35347_solr] o.a.s.c.Overseer Overseer (id=72118307914514436-127.0.0.1:35347_solr-n_0000000000) starting
  2> 210273 INFO  (TEST-RecoveryAfterSoftCommitTest.test-seed#[29DCE295C440B786]) [n:127.0.0.1:35347_solr] o.a.s.c.ZkController Register node as live in ZooKeeper: /live_nodes/127.0.0.1:35347_solr
  2> 210273 INFO  (OverseerStateUpdate-72118307914514436-127.0.0.1:35347_solr-n_0000000000) [n:127.0.0.1:35347_solr] o.a.s.c.Overseer Starting to work on the main queue : 127.0.0.1:35347_solr
  2> 210274 INFO  (OverseerStateUpdate-72118307914514436-127.0.0.1:35347_solr-n_0000000000) [n:127.0.0.1:35347_solr] o.a.s.c.c.ZkStateReader Updated live nodes from ZooKeeper... (0) -> (1)
  2> 210276 WARN  (TEST-RecoveryAfterSoftCommitTest.test-seed#[29DCE295C440B786]) [n:127.0.0.1:35347_solr] o.a.s.c.CoreContainer Not all security plugins configured!  authentication=disabled authorization=disabled.  Solr is only as secure as you make it. Consider configuring authentication/authorization before exposing Solr to users internal or external.  See https://s.apache.org/solrsecurity for more info
  2> 210344 INFO  (TEST-RecoveryAfterSoftCommitTest.test-seed#[29DCE295C440B786]) [n:127.0.0.1:35347_solr] o.a.s.c.CorePropertiesLocator Found 0 core definitions underneath /home/jenkins/jenkins-agent/workspace/Solr/Solr-Test-main/solr/core/build/tmp/tests-tmp/org.apache.solr.cloud.RecoveryAfterSoftCommitTest_29DCE295C440B786-001/control-001/cores
  2> 210395 INFO  (TEST-RecoveryAfterSoftCommitTest.test-seed#[29DCE295C440B786]) [n:127.0.0.1:35347_solr] o.e.j.e.s.ServletContextHandler Started oeje10s.ServletContextHandler@78dd7a8{/solr,/solr,b=file:///home/jenkins/jenkins-agent/workspace/Solr/Solr-Test-main/solr/core/build/tmp/tests-cwd/,a=AVAILABLE,h=oeje10s.ServletHandler@eec98ef{STARTED}}
  2> 210396 INFO  (TEST-RecoveryAfterSoftCommitTest.test-seed#[29DCE295C440B786]) [n:127.0.0.1:35347_solr] o.e.j.s.AbstractConnector Started oejs.ServerConnector@2ab75fb0{HTTP/1.1, (http/1.1, h2c)}{127.0.0.1:36839}
  2> 210396 INFO  (TEST-RecoveryAfterSoftCommitTest.test-seed#[29DCE295C440B786]) [n:127.0.0.1:35347_solr] o.e.j.s.Server Started oejs.Server@3ea8a628{STARTING}[12.1.10,sto=0] @2116ms
  2> 210399 WARN  (TEST-RecoveryAfterSoftCommitTest.test-seed#[29DCE295C440B786]) [] o.a.s.c.c.SolrZkClient Using default ZkCredentialsInjector. ZkCredentialsInjector is not secure, it creates an empty list of credentials which leads to 'OPEN_ACL_UNSAFE' ACLs to Zookeeper nodes
  2> 210399 WARN  (TEST-RecoveryAfterSoftCommitTest.test-seed#[29DCE295C440B786]) [] o.a.s.c.c.SolrZkClient Using default ZkACLProvider. DefaultZkACLProvider is not secure, it creates 'OPEN_ACL_UNSAFE' ACLs to Zookeeper nodes
  2> 210399 INFO  (TEST-RecoveryAfterSoftCommitTest.test-seed#[29DCE295C440B786]) [] o.a.c.f.i.CuratorFrameworkImpl Starting
  2> 210400 INFO  (TEST-RecoveryAfterSoftCommitTest.test-seed#[29DCE295C440B786]) [] o.a.c.f.i.CuratorFrameworkImpl Default schema
  2> 210401 INFO  (TEST-RecoveryAfterSoftCommitTest.test-seed#[29DCE295C440B786]-EventThread) [] o.a.c.f.s.ConnectionStateManager State change: CONNECTED
  2> 210402 INFO  (TEST-RecoveryAfterSoftCommitTest.test-seed#[29DCE295C440B786]-EventThread) [] o.a.c.f.i.EnsembleTracker New config event received: {}
  2> 210402 INFO  (TEST-RecoveryAfterSoftCommitTest.test-seed#[29DCE295C440B786]-EventThread) [] o.a.c.f.i.EnsembleTracker New config event received: {}
  2> 210402 INFO  (TEST-RecoveryAfterSoftCommitTest.test-seed#[29DCE295C440B786]) [] o.a.s.c.c.ZkStateReader Updated live nodes from ZooKeeper... (0) -> (1)
  2> 210403 INFO  (TEST-RecoveryAfterSoftCommitTest.test-seed#[29DCE295C440B786]) [] o.a.s.c.s.i.ZkClientClusterStateProvider Cluster at 127.0.0.1:34081/solr ready
  2> 210404 INFO  (SocketProxy-Acceptor-35347) [] o.a.s.u.SocketProxy accepted Socket[addr=/127.0.0.1,port=35840,localport=35347], receiveBufferSize: 65536
  2> 210406 INFO  (SocketProxy-Acceptor-35347) [] o.a.s.u.SocketProxy proxy connection Socket[addr=/127.0.0.1,port=36839,localport=56830], receiveBufferSize=65536
  2> 210411 INFO  (OverseerThreadFactory-2633-thread-1) [ c:control_collection t:null-6304] o.a.s.c.a.c.CreateCollectionCmd Create collection control_collection
  2> 210411 INFO  (OverseerThreadFactory-2633-thread-1) [ c:control_collection t:null-6304] o.a.s.c.a.c.CreateCollectionCmd solr.cloud.prs.enabled : false and collection prs : null, isPRS : false
  2> 210414 INFO  (OverseerThreadFactory-2633-thread-1) [ c:control_collection t:null-6304] o.a.s.c.c.ZkStateReader /collections/control_collection/state.json is deleted, stop watching children
  2> 210415 INFO  (zkCallback-2627-thread-1) [] o.a.s.c.c.ZkStateReader A cluster state change: [WatchedEvent state:SyncConnected type:NodeCreated path:/collections/control_collection/state.json zxid: -1] for collection [control_collection] has occurred - updating... (live nodes size: [1])
  2> 210419 INFO  (OverseerStateUpdate-72118307914514436-127.0.0.1:35347_solr-n_0000000000) [n:127.0.0.1:35347_solr] o.a.s.c.o.SliceMutator createReplica() {
  2>   "core":"control_collection_shard1_replica_n1",
  2>   "node_name":"127.0.0.1:35347_solr",
  2>   "base_url":"http://127.0.0.1:35347/solr",
  2>   "collection":"control_collection",
  2>   "shard":"shard1",
  2>   "state":"down",
  2>   "type":"NRT",
  2>   "operation":"ADDREPLICA",
  2>   "waitForFinalState":"false"} 
  2> 210522 INFO  (zkCallback-2627-thread-2) [] o.a.s.c.c.ZkStateReader A cluster state change: [WatchedEvent state:SyncConnected type:NodeDataChanged path:/collections/control_collection/state.json zxid: -1] for collection [control_collection] has occurred - updating... (live nodes size: [1])
  2> 210523 INFO  (SocketProxy-Acceptor-35347) [] o.a.s.u.SocketProxy accepted Socket[addr=/127.0.0.1,port=35854,localport=35347], receiveBufferSize: 65536
  2> 210524 INFO  (SocketProxy-Acceptor-35347) [] o.a.s.u.SocketProxy proxy connection Socket[addr=/127.0.0.1,port=36839,localport=56836], receiveBufferSize=65536
  2> 210525 INFO  (qtp1649416024-5644-null-6304) [n:127.0.0.1:35347_solr x:control_collection_shard1_replica_n1 t:null-6304] o.a.s.h.a.a.CreateCore core create command "org.apache.solr.client.api.model.CreateCoreParams@6331d9ad"
  2> 210556 INFO  (qtp1649416024-5644-null-6304) [n:127.0.0.1:35347_solr c:control_collection s:shard1 r:core_node2 x:control_collection_shard1_replica_n1 t:null-6304] o.a.s.s.IndexSchema Loaded schema test/1.0 with uniqueid field id
  2> 210569 INFO  (qtp1649416024-5644-null-6304) [n:127.0.0.1:35347_solr c:control_collection s:shard1 r:core_node2 x:control_collection_shard1_replica_n1 t:null-6304] o.a.s.c.CoreContainer Creating SolrCore 'control_collection_shard1_replica_n1' using configuration from configset conf1
  2> 210570 INFO  (qtp1649416024-5644-null-6304) [n:127.0.0.1:35347_solr c:control_collection s:shard1 r:core_node2 x:control_collection_shard1_replica_n1 t:null-6304] o.a.s.c.SolrCore Opening new SolrCore at [/home/jenkins/jenkins-agent/workspace/Solr/Solr-Test-main/solr/core/build/tmp/tests-tmp/org.apache.solr.cloud.RecoveryAfterSoftCommitTest_29DCE295C440B786-001/control-001/cores/control_collection_shard1_replica_n1], dataDir=[/home/jenkins/jenkins-agent/workspace/Solr/Solr-Test-main/solr/core/build/tmp/tests-tmp/org.apache.solr.cloud.RecoveryAfterSoftCommitTest_29DCE295C440B786-001/control-001/cores/control_collection_shard1_replica_n1/data/]
  2> 210570 INFO  (qtp1649416024-5644-null-6304) [n:127.0.0.1:35347_solr c:control_collection s:shard1 r:core_node2 x:control_collection_shard1_replica_n1 t:null-6304] o.a.s.u.RandomMergePolicy RandomMergePolicy wrapping class org.apache.lucene.index.LogDocMergePolicy: [LogDocMergePolicy: minMergeSize=1000, mergeFactor=19, maxMergeSize=9223372036854775807, maxMergeSizeForForcedMerge=9223372036854775807, calibrateSizeByDeletes=false, maxMergeDocs=2147483647, maxCFSSegmentSizeMB=8.796093022208E12, noCFSRatio=0.0]
  2> 210572 WARN  (qtp1649416024-5644-null-6304) [n:127.0.0.1:35347_solr c:control_collection s:shard1 r:core_node2 x:control_collection_shard1_replica_n1 t:null-6304] o.a.s.c.RequestHandlers INVALID paramSet a in requestHandler {type = requestHandler,name = /dump,class = DumpRequestHandler,attributes = {initParams=a, name=/dump, class=DumpRequestHandler},args = {defaults={a=A, b=B}}}
  2> 210602 INFO  (qtp1649416024-5644-null-6304) [n:127.0.0.1:35347_solr c:control_collection s:shard1 r:core_node2 x:control_collection_shard1_replica_n1 t:null-6304] o.a.s.u.UpdateLog Initializing UpdateLog: dataDir= defaultSyncLevel=FLUSH numRecordsToKeep=2 maxNumLogsToKeep=10
  2> 210602 INFO  (qtp1649416024-5644-null-6304) [n:127.0.0.1:35347_solr c:control_collection s:shard1 r:core_node2 x:control_collection_shard1_replica_n1 t:null-6304] o.a.s.u.CommitTracker Hard AutoCommit: disabled
  2> 210602 INFO  (qtp1649416024-5644-null-6304) [n:127.0.0.1:35347_solr c:control_collection s:shard1 r:core_node2 x:control_collection_shard1_replica_n1 t:null-6304] o.a.s.u.CommitTracker Soft AutoCommit: disabled
  2> 210604 INFO  (qtp1649416024-5644-null-6304) [n:127.0.0.1:35347_solr c:control_collection s:shard1 r:core_node2 x:control_collection_shard1_replica_n1 t:null-6304] o.a.s.u.RandomMergePolicy RandomMergePolicy wrapping class org.apache.lucene.index.LogByteSizeMergePolicy: [LogByteSizeMergePolicy: minMergeSize=16777216, mergeFactor=15, maxMergeSize=2147483648, maxMergeSizeForForcedMerge=9223372036854775807, calibrateSizeByDeletes=true, maxMergeDocs=2147483647, maxCFSSegmentSizeMB=8.796093022208E12, noCFSRatio=0.0]
  2> 210606 INFO  (qtp1649416024-5644-null-6304) [n:127.0.0.1:35347_solr c:control_collection s:shard1 r:core_node2 x:control_collection_shard1_replica_n1 t:null-6304] o.a.s.r.ManagedResourceStorage Configured ZooKeeperStorageIO with znodeBase: /configs/conf1
  2> 210606 INFO  (qtp1649416024-5644-null-6304) [n:127.0.0.1:35347_solr c:control_collection s:shard1 r:core_node2 x:control_collection_shard1_replica_n1 t:null-6304] o.a.s.r.ManagedResourceStorage Loaded null at path _rest_managed.json using ZooKeeperStorageIO:path=/configs/conf1
  2> 210606 INFO  (qtp1649416024-5644-null-6304) [n:127.0.0.1:35347_solr c:control_collection s:shard1 r:core_node2 x:control_collection_shard1_replica_n1 t:null-6304] o.a.s.h.ReplicationHandler Commits will be reserved for 10000 ms
  2> 210607 INFO  (searcherExecutor-2644-thread-1-processing-127.0.0.1:35347_solr control_collection_shard1_replica_n1 null-6304 control_collection shard1 core_node2) [n:127.0.0.1:35347_solr c:control_collection s:shard1 r:core_node2 x:control_collection_shard1_replica_n1 t:null-6304] o.a.s.c.SolrCore Registered new searcher autowarm time: 0 ms
  2> 210610 INFO  (qtp1649416024-5644-null-6304) [n:127.0.0.1:35347_solr c:control_collection s:shard1 r:core_node2 x:control_collection_shard1_replica_n1 t:null-6304] o.a.s.c.ZkShardTerms Successful update of terms at /collections/control_collection/terms/shard1 to Terms{values={core_node2=0}, version=0} for registerTerm
  2> 210610 INFO  (qtp1649416024-5644-null-6304) [n:127.0.0.1:35347_solr c:control_collection s:shard1 r:core_node2 x:control_collection_shard1_replica_n1 t:null-6304] o.a.s.c.ShardLeaderElectionContextBase make sure parent is created /collections/control_collection/leaders/shard1
  2> 210617 INFO  (qtp1649416024-5644-null-6304) [n:127.0.0.1:35347_solr c:control_collection s:shard1 r:core_node2 x:control_collection_shard1_replica_n1 t:null-6304] o.a.s.c.ShardLeaderElectionContext Enough replicas found to continue.
  2> 210617 INFO  (qtp1649416024-5644-null-6304) [n:127.0.0.1:35347_solr c:control_collection s:shard1 r:core_node2 x:control_collection_shard1_replica_n1 t:null-6304] o.a.s.c.ShardLeaderElectionContext I may be the new leader - try and sync
  2> 210617 INFO  (qtp1649416024-5644-null-6304) [n:127.0.0.1:35347_solr c:control_collection s:shard1 r:core_node2 x:control_collection_shard1_replica_n1 t:null-6304] o.a.s.c.SyncStrategy Sync replicas to http://127.0.0.1:35347/solr/control_collection_shard1_replica_n1/
  2> 210617 INFO  (qtp1649416024-5644-null-6304) [n:127.0.0.1:35347_solr c:control_collection s:shard1 r:core_node2 x:control_collection_shard1_replica_n1 t:null-6304] o.a.s.c.SyncStrategy Sync Success - now sync replicas to me
  2> 210618 INFO  (qtp1649416024-5644-null-6304) [n:127.0.0.1:35347_solr c:control_collection s:shard1 r:core_node2 x:control_collection_shard1_replica_n1 t:null-6304] o.a.s.c.SyncStrategy http://127.0.0.1:35347/solr/control_collection_shard1_replica_n1/ has no replicas
  2> 210618 INFO  (qtp1649416024-5644-null-6304) [n:127.0.0.1:35347_solr c:control_collection s:shard1 r:core_node2 x:control_collection_shard1_replica_n1 t:null-6304] o.a.s.c.ShardLeaderElectionContextBase Creating leader registration node /collections/control_collection/leaders/shard1/leader after winning as /collections/control_collection/leader_elect/shard1/election/72118307914514436-core_node2-n_0000000000
  2> 210722 INFO  (zkCallback-2627-thread-1) [] o.a.s.c.c.ZkStateReader A cluster state change: [WatchedEvent state:SyncConnected type:NodeDataChanged path:/collections/control_collection/state.json zxid: -1] for collection [control_collection] has occurred - updating... (live nodes size: [1])
  2> 210722 INFO  (qtp1649416024-5644-null-6304) [n:127.0.0.1:35347_solr c:control_collection s:shard1 r:core_node2 x:control_collection_shard1_replica_n1 t:null-6304] o.a.s.c.ShardLeaderElectionContext I am the new leader: http://127.0.0.1:35347/solr/control_collection_shard1_replica_n1/ shard1
  2> 210723 INFO  (qtp1649416024-5644-null-6304) [n:127.0.0.1:35347_solr c:control_collection s:shard1 r:core_node2 x:control_collection_shard1_replica_n1 t:null-6304] o.a.s.c.ZkController I am the leader, no recovery necessary
  2> 210726 INFO  (qtp1649416024-5644-null-6304) [n:127.0.0.1:35347_solr t:null-6304] o.a.s.s.HttpSolrCall [admin] path=/admin/cores params={coreNodeName=core_node2&collection.configName=conf1&newCollection=true&name=control_collection_shard1_replica_n1&action=CREATE&numShards=1&collection=control_collection&shard=shard1&wt=javabin&replicaType=NRT} status=0 QTime=200
  2> 210728 INFO  (qtp1649416024-5641-null-6303) [n:127.0.0.1:35347_solr c:control_collection t:null-6303] o.a.s.h.a.CollectionsHandler Wait for new collection to be active for at most 45 seconds. Check all shard replicas
  2> 210827 INFO  (zkCallback-2627-thread-2) [] o.a.s.c.c.ZkStateReader A cluster state change: [WatchedEvent state:SyncConnected type:NodeDataChanged path:/collections/control_collection/state.json zxid: -1] for collection [control_collection] has occurred - updating... (live nodes size: [1])
  2> 210828 INFO  (qtp1649416024-5641-null-6303) [n:127.0.0.1:35347_solr c:control_collection t:null-6303] o.a.s.s.HttpSolrCall [admin] path=/admin/collections params={collection.configName=conf1&name=control_collection&nrtReplicas=1&action=CREATE&numShards=1&createNodeSet=127.0.0.1:35347_solr&wt=javabin} status=0 QTime=421
  2> 210829 INFO  (TEST-RecoveryAfterSoftCommitTest.test-seed#[29DCE295C440B786]) [] o.a.s.c.AbstractFullDistribZkTestBase Waiting to see 1 active replicas in collection: control_collection
  2> 210830 INFO  (Curator-Framework-0) [] o.a.c.f.i.CuratorFrameworkImpl backgroundOperationsLoop exiting
  2> 210937 WARN  (TEST-RecoveryAfterSoftCommitTest.test-seed#[29DCE295C440B786]) [] o.a.s.c.c.SolrZkClient Using default ZkCredentialsInjector. ZkCredentialsInjector is not secure, it creates an empty list of credentials which leads to 'OPEN_ACL_UNSAFE' ACLs to Zookeeper nodes
  2> 210937 WARN  (TEST-RecoveryAfterSoftCommitTest.test-seed#[29DCE295C440B786]) [] o.a.s.c.c.SolrZkClient Using default ZkACLProvider. DefaultZkACLProvider is not secure, it creates 'OPEN_ACL_UNSAFE' ACLs to Zookeeper nodes
  2> 210937 INFO  (TEST-RecoveryAfterSoftCommitTest.test-seed#[29DCE295C440B786]) [] o.a.c.f.i.CuratorFrameworkImpl Starting
  2> 210938 INFO  (TEST-RecoveryAfterSoftCommitTest.test-seed#[29DCE295C440B786]) [] o.a.c.f.i.CuratorFrameworkImpl Default schema
  2> 210939 INFO  (TEST-RecoveryAfterSoftCommitTest.test-seed#[29DCE295C440B786]-EventThread) [] o.a.c.f.s.ConnectionStateManager State change: CONNECTED
  2> 210939 INFO  (TEST-RecoveryAfterSoftCommitTest.test-seed#[29DCE295C440B786]-EventThread) [] o.a.c.f.i.EnsembleTracker New config event received: {}
  2> 210939 INFO  (TEST-RecoveryAfterSoftCommitTest.test-seed#[29DCE295C440B786]-EventThread) [] o.a.c.f.i.EnsembleTracker New config event received: {}
  2> 210940 INFO  (TEST-RecoveryAfterSoftCommitTest.test-seed#[29DCE295C440B786]) [] o.a.s.c.c.ZkStateReader Updated live nodes from ZooKeeper... (0) -> (1)
  2> 210941 INFO  (TEST-RecoveryAfterSoftCommitTest.test-seed#[29DCE295C440B786]) [] o.a.s.c.s.i.ZkClientClusterStateProvider Cluster at 127.0.0.1:34081/solr ready
  2> 210941 INFO  (TEST-RecoveryAfterSoftCommitTest.test-seed#[29DCE295C440B786]) [] o.a.s.c.ChaosMonkey monkey: init - expire sessions:false cause connection loss:false
  2> 210942 INFO  (SocketProxy-Acceptor-35347) [] o.a.s.u.SocketProxy accepted Socket[addr=/127.0.0.1,port=56346,localport=35347], receiveBufferSize: 65536
  2> 210943 INFO  (SocketProxy-Acceptor-35347) [] o.a.s.u.SocketProxy proxy connection Socket[addr=/127.0.0.1,port=36839,localport=55582], receiveBufferSize=65536
  2> 210948 INFO  (OverseerThreadFactory-2633-thread-2) [ c:collection1 t:null-6306] o.a.s.c.a.c.CreateCollectionCmd Create collection collection1
  2> 210948 INFO  (OverseerThreadFactory-2633-thread-2) [ c:collection1 t:null-6306] o.a.s.c.a.c.CreateCollectionCmd solr.cloud.prs.enabled : false and collection prs : null, isPRS : false
  2> 210950 INFO  (OverseerThreadFactory-2633-thread-2) [ c:collection1 t:null-6306] o.a.s.c.c.ZkStateReader /collections/collection1/state.json is deleted, stop watching children
  2> 211053 INFO  (zkCallback-2627-thread-2) [] o.a.s.c.c.ZkStateReader A cluster state change: [WatchedEvent state:SyncConnected type:NodeCreated path:/collections/collection1/state.json zxid: -1] for collection [collection1] has occurred - updating... (live nodes size: [1])
  2> 211053 WARN  (OverseerThreadFactory-2633-thread-2) [ c:collection1 t:null-6306] o.a.s.c.a.c.CreateCollectionCmd It is unusual to create a collection (collection1) without cores.
  2> 211055 INFO  (qtp1649416024-5643-null-6305) [n:127.0.0.1:35347_solr c:collection1 t:null-6305] o.a.s.h.a.CollectionsHandler Wait for new collection to be active for at most 45 seconds. Check all shard replicas
  2> 211055 INFO  (qtp1649416024-5643-null-6305) [n:127.0.0.1:35347_solr c:collection1 t:null-6305] o.a.s.s.HttpSolrCall [admin] path=/admin/collections params={collection.configName=conf1&name=collection1&nrtReplicas=1&action=CREATE&numShards=1&createNodeSet=&wt=javabin} status=0 QTime=111
  2> 211056 INFO  (TEST-RecoveryAfterSoftCommitTest.test-seed#[29DCE295C440B786]) [] o.a.s.c.SolrCloudTestCase active slice count: 1 expected: 1
  2> 211056 INFO  (TEST-RecoveryAfterSoftCommitTest.test-seed#[29DCE295C440B786]) [] o.a.s.c.SolrCloudTestCase active replica count: 0 expected replica count: 0
  2> 211056 INFO  (TEST-RecoveryAfterSoftCommitTest.test-seed#[29DCE295C440B786]) [] o.a.s.c.AbstractFullDistribZkTestBase Creating jetty instances pullReplicaCount=0 numOtherReplicas=2
  2> 211211 INFO  (TEST-RecoveryAfterSoftCommitTest.test-seed#[29DCE295C440B786]) [] o.a.s.c.AbstractFullDistribZkTestBase create jetty 1 in directory /home/jenkins/jenkins-agent/workspace/Solr/Solr-Test-main/solr/core/build/tmp/tests-tmp/org.apache.solr.cloud.RecoveryAfterSoftCommitTest_29DCE295C440B786-001/shard-1-001 of type NRT for shard1
  2> 211212 INFO  (closeThreadPool-2656-thread-1) [] o.a.s.e.JettySolrRunner Start Jetty (configured port=0, binding port=0)
  2> 211212 INFO  (closeThreadPool-2656-thread-1) [] o.a.s.e.JettySolrRunner Trying to start Jetty on port 0 try number 2 ...
  2> 211212 INFO  (closeThreadPool-2656-thread-1) [] o.e.j.s.Server jetty-12.1.10; built: 2026-05-31T04:45:52.925Z; git: 986024525891c2c20ff08c58ba300dc3b9847586; jvm 21.0.4+7-LTS
  2> 211213 INFO  (closeThreadPool-2656-thread-1) [] o.e.j.s.DefaultSessionIdManager Session workerName=node0
  2> 211214 WARN  (closeThreadPool-2656-thread-1) [] o.e.j.e.s.ServletContextHandler BaseResource file:///home/jenkins/jenkins-agent/workspace/Solr/Solr-Test-main/solr/core/build/tmp/tests-cwd/./ is aliased to file:///home/jenkins/jenkins-agent/workspace/Solr/Solr-Test-main/solr/core/build/tmp/tests-cwd/ in oeje10s.ServletContextHandler@f003bd2{/solr,/solr,b=file:///home/jenkins/jenkins-agent/workspace/Solr/Solr-Test-main/solr/core/build/tmp/tests-cwd/./,a=STOPPED,h=oeje10s.ServletHandler@1e1b908e{STOPPED}}. May not be supported in future releases.
  2> 211215 INFO  (closeThreadPool-2656-thread-1) [] o.e.j.s.h.ContextHandler /solr Base Resource is an alias: file:///home/jenkins/jenkins-agent/workspace/Solr/Solr-Test-main/solr/core/build/tmp/tests-cwd/./ -> file:///home/jenkins/jenkins-agent/workspace/Solr/Solr-Test-main/solr/core/build/tmp/tests-cwd/
  2> 211215 INFO  (closeThreadPool-2656-thread-1) [] o.e.j.s.h.ContextHandler Started oeje10s.ServletContextHandler@f003bd2{/solr,/solr,b=file:///home/jenkins/jenkins-agent/workspace/Solr/Solr-Test-main/solr/core/build/tmp/tests-cwd/,a=AVAILABLE,h=oeje10s.ServletHandler@1e1b908e{STARTED}}
  2> 211215 INFO  (closeThreadPool-2656-thread-1) [] o.a.s.e.JettySolrRunner Jetty properties: {solrconfig=solrconfig.xml, solr.data.dir=/home/jenkins/jenkins-agent/workspace/Solr/Solr-Test-main/solr/core/build/tmp/tests-tmp/org.apache.solr.cloud.RecoveryAfterSoftCommitTest_29DCE295C440B786-001/tempDir-001/jetty1, hostPort=39353, coreRootDirectory=/home/jenkins/jenkins-agent/workspace/Solr/Solr-Test-main/solr/core/build/tmp/tests-tmp/org.apache.solr.cloud.RecoveryAfterSoftCommitTest_29DCE295C440B786-001/shard-1-001/cores, replicaType=NRT}
  2> 211215 ERROR (closeThreadPool-2656-thread-1) [] o.a.s.u.StartupLoggingUtils Missing Java Option solr.logs.dir. Logging may be missing or incomplete.
  2> 211215 INFO  (closeThreadPool-2656-thread-1) [] o.a.s.s.CoreContainerProvider Using logger factory org.apache.logging.slf4j.Log4jLoggerFactory
  2> 211215 INFO  (closeThreadPool-2656-thread-1) [] o.a.s.s.CoreContainerProvider  ___      _       Welcome to Apache Solr™ version 11.0.0
  2> 211215 INFO  (closeThreadPool-2656-thread-1) [] o.a.s.s.CoreContainerProvider / __| ___| |_ _   Starting in cloud mode on port null
  2> 211215 INFO  (closeThreadPool-2656-thread-1) [] o.a.s.s.CoreContainerProvider \__ \/ _ \ | '_|  Install dir: /home/jenkins/jenkins-agent/workspace/Solr/Solr-Test-main/solr
  2> 211215 INFO  (closeThreadPool-2656-thread-1) [] o.a.s.s.CoreContainerProvider |___/\___/_|_|    Start time: 2026-08-15T23:42:42.327937207Z
  2> 211216 INFO  (closeThreadPool-2656-thread-1) [] o.a.s.s.CoreContainerProvider Solr Home: /home/jenkins/jenkins-agent/workspace/Solr/Solr-Test-main/solr/core/build/tmp/tests-tmp/org.apache.solr.cloud.RecoveryAfterSoftCommitTest_29DCE295C440B786-001/shard-1-001 (source: servlet config: solr.solr.home)
  2> 211216 WARN  (closeThreadPool-2656-thread-1) [] o.a.s.c.c.SolrZkClient Using default ZkCredentialsInjector. ZkCredentialsInjector is not secure, it creates an empty list of credentials which leads to 'OPEN_ACL_UNSAFE' ACLs to Zookeeper nodes
  2> 211216 WARN  (closeThreadPool-2656-thread-1) [] o.a.s.c.c.SolrZkClient Using default ZkACLProvider. DefaultZkACLProvider is not secure, it creates 'OPEN_ACL_UNSAFE' ACLs to Zookeeper nodes
  2> 211216 INFO  (closeThreadPool-2656-thread-1) [] o.a.c.f.i.CuratorFrameworkImpl Starting
  2> 211218 INFO  (closeThreadPool-2656-thread-1) [] o.a.c.f.i.CuratorFrameworkImpl Default schema
  2> 211219 INFO  (closeThreadPool-2656-thread-1-EventThread) [] o.a.c.f.s.ConnectionStateManager State change: CONNECTED
  2> 211219 INFO  (closeThreadPool-2656-thread-1-EventThread) [] o.a.c.f.i.EnsembleTracker New config event received: {}
  2> 211219 INFO  (closeThreadPool-2656-thread-1-EventThread) [] o.a.c.f.i.EnsembleTracker New config event received: {}
  2> 211220 INFO  (Curator-Framework-0) [] o.a.c.f.i.CuratorFrameworkImpl backgroundOperationsLoop exiting
  2> 211321 INFO  (closeThreadPool-2656-thread-1) [] o.a.s.c.SolrXmlConfig Loading solr.xml from /home/jenkins/jenkins-agent/workspace/Solr/Solr-Test-main/solr/core/build/tmp/tests-tmp/org.apache.solr.cloud.RecoveryAfterSoftCommitTest_29DCE295C440B786-001/shard-1-001/solr.xml
  2> 211346 INFO  (TEST-RecoveryAfterSoftCommitTest.test-seed#[29DCE295C440B786]) [] o.a.s.c.AbstractFullDistribZkTestBase create jetty 2 in directory /home/jenkins/jenkins-agent/workspace/Solr/Solr-Test-main/solr/core/build/tmp/tests-tmp/org.apache.solr.cloud.RecoveryAfterSoftCommitTest_29DCE295C440B786-001/shard-2-001 of type NRT for shard1
  2> 211347 INFO  (closeThreadPool-2656-thread-2) [] o.a.s.e.JettySolrRunner Start Jetty (configured port=0, binding port=0)
  2> 211347 INFO  (closeThreadPool-2656-thread-2) [] o.a.s.e.JettySolrRunner Trying to start Jetty on port 0 try number 2 ...
  2> 211347 INFO  (closeThreadPool-2656-thread-2) [] o.e.j.s.Server jetty-12.1.10; built: 2026-05-31T04:45:52.925Z; git: 986024525891c2c20ff08c58ba300dc3b9847586; jvm 21.0.4+7-LTS
  2> 211348 INFO  (closeThreadPool-2656-thread-2) [] o.e.j.s.DefaultSessionIdManager Session workerName=node0
  2> 211349 WARN  (closeThreadPool-2656-thread-2) [] o.e.j.e.s.ServletContextHandler BaseResource file:///home/jenkins/jenkins-agent/workspace/Solr/Solr-Test-main/solr/core/build/tmp/tests-cwd/./ is aliased to file:///home/jenkins/jenkins-agent/workspace/Solr/Solr-Test-main/solr/core/build/tmp/tests-cwd/ in oeje10s.ServletContextHandler@2288eb04{/solr,/solr,b=file:///home/jenkins/jenkins-agent/workspace/Solr/Solr-Test-main/solr/core/build/tmp/tests-cwd/./,a=STOPPED,h=oeje10s.ServletHandler@3c56d500{STOPPED}}. May not be supported in future releases.
  2> 211350 INFO  (closeThreadPool-2656-thread-2) [] o.e.j.s.h.ContextHandler /solr Base Resource is an alias: file:///home/jenkins/jenkins-agent/workspace/Solr/Solr-Test-main/solr/core/build/tmp/tests-cwd/./ -> file:///home/jenkins/jenkins-agent/workspace/Solr/Solr-Test-main/solr/core/build/tmp/tests-cwd/
  2> 211350 INFO  (closeThreadPool-2656-thread-2) [] o.e.j.s.h.ContextHandler Started oeje10s.ServletContextHandler@2288eb04{/solr,/solr,b=file:///home/jenkins/jenkins-agent/workspace/Solr/Solr-Test-main/solr/core/build/tmp/tests-cwd/,a=AVAILABLE,h=oeje10s.ServletHandler@3c56d500{STARTED}}
  2> 211350 INFO  (closeThreadPool-2656-thread-2) [] o.a.s.e.JettySolrRunner Jetty properties: {solrconfig=solrconfig.xml, solr.data.dir=/home/jenkins/jenkins-agent/workspace/Solr/Solr-Test-main/solr/core/build/tmp/tests-tmp/org.apache.solr.cloud.RecoveryAfterSoftCommitTest_29DCE295C440B786-001/tempDir-001/jetty2, hostPort=40437, coreRootDirectory=/home/jenkins/jenkins-agent/workspace/Solr/Solr-Test-main/solr/core/build/tmp/tests-tmp/org.apache.solr.cloud.RecoveryAfterSoftCommitTest_29DCE295C440B786-001/shard-2-001/cores, replicaType=NRT}
  2> 211350 ERROR (closeThreadPool-2656-thread-2) [] o.a.s.u.StartupLoggingUtils Missing Java Option solr.logs.dir. Logging may be missing or incomplete.
  2> 211350 INFO  (closeThreadPool-2656-thread-2) [] o.a.s.s.CoreContainerProvider Using logger factory org.apache.logging.slf4j.Log4jLoggerFactory
  2> 211350 INFO  (closeThreadPool-2656-thread-2) [] o.a.s.s.CoreContainerProvider  ___      _       Welcome to Apache Solr™ version 11.0.0
  2> 211350 INFO  (closeThreadPool-2656-thread-2) [] o.a.s.s.CoreContainerProvider / __| ___| |_ _   Starting in cloud mode on port null
  2> 211350 INFO  (closeThreadPool-2656-thread-2) [] o.a.s.s.CoreContainerProvider \__ \/ _ \ | '_|  Install dir: /home/jenkins/jenkins-agent/workspace/Solr/Solr-Test-main/solr
  2> 211351 INFO  (closeThreadPool-2656-thread-2) [] o.a.s.s.CoreContainerProvider |___/\___/_|_|    Start time: 2026-08-15T23:42:42.463023806Z
  2> 211351 INFO  (closeThreadPool-2656-thread-2) [] o.a.s.s.CoreContainerProvider Solr Home: /home/jenkins/jenkins-agent/workspace/Solr/Solr-Test-main/solr/core/build/tmp/tests-tmp/org.apache.solr.cloud.RecoveryAfterSoftCommitTest_29DCE295C440B786-001/shard-2-001 (source: servlet config: solr.solr.home)
  2> 211351 WARN  (closeThreadPool-2656-thread-2) [] o.a.s.c.c.SolrZkClient Using default ZkCredentialsInjector. ZkCredentialsInjector is not secure, it creates an empty list of credentials which leads to 'OPEN_ACL_UNSAFE' ACLs to Zookeeper nodes
  2> 211351 WARN  (closeThreadPool-2656-thread-2) [] o.a.s.c.c.SolrZkClient Using default ZkACLProvider. DefaultZkACLProvider is not secure, it creates 'OPEN_ACL_UNSAFE' ACLs to Zookeeper nodes
  2> 211351 INFO  (closeThreadPool-2656-thread-2) [] o.a.c.f.i.CuratorFrameworkImpl Starting
  2> 211353 INFO  (closeThreadPool-2656-thread-2) [] o.a.c.f.i.CuratorFrameworkImpl Default schema
  2> 211354 INFO  (closeThreadPool-2656-thread-2-EventThread) [] o.a.c.f.s.ConnectionStateManager State change: CONNECTED
  2> 211354 INFO  (closeThreadPool-2656-thread-2-EventThread) [] o.a.c.f.i.EnsembleTracker New config event received: {}
  2> 211354 INFO  (closeThreadPool-2656-thread-2-EventThread) [] o.a.c.f.i.EnsembleTracker New config event received: {}
  2> 211355 INFO  (Curator-Framework-0) [] o.a.c.f.i.CuratorFrameworkImpl backgroundOperationsLoop exiting
  2> 211456 INFO  (closeThreadPool-2656-thread-2) [] o.a.s.c.SolrXmlConfig Loading solr.xml from /home/jenkins/jenkins-agent/workspace/Solr/Solr-Test-main/solr/core/build/tmp/tests-tmp/org.apache.solr.cloud.RecoveryAfterSoftCommitTest_29DCE295C440B786-001/shard-2-001/solr.xml
  2> 212226 INFO  (closeThreadPool-2656-thread-2) [] o.a.s.m.OtelRuntimeJvmMetrics JVM metrics are disabled
  2> 212236 INFO  (closeThreadPool-2656-thread-2) [] o.a.s.c.ZkContainer Zookeeper client=127.0.0.1:34081/solr
  2> 212236 WARN  (closeThreadPool-2656-thread-2) [] o.a.s.c.c.SolrZkClient Using default ZkCredentialsInjector. ZkCredentialsInjector is not secure, it creates an empty list of credentials which leads to 'OPEN_ACL_UNSAFE' ACLs to Zookeeper nodes
  2> 212236 WARN  (closeThreadPool-2656-thread-2) [] o.a.s.c.c.SolrZkClient Using default ZkACLProvider. DefaultZkACLProvider is not secure, it creates 'OPEN_ACL_UNSAFE' ACLs to Zookeeper nodes
  2> 212237 INFO  (closeThreadPool-2656-thread-2) [] o.a.c.f.i.CuratorFrameworkImpl Starting
  2> 212238 INFO  (closeThreadPool-2656-thread-2) [] o.a.c.f.i.CuratorFrameworkImpl Default schema
  2> 212239 INFO  (closeThreadPool-2656-thread-2-EventThread) [] o.a.c.f.s.ConnectionStateManager State change: CONNECTED
  2> 212239 INFO  (closeThreadPool-2656-thread-2-EventThread) [] o.a.c.f.i.EnsembleTracker New config event received: {}
  2> 212239 INFO  (closeThreadPool-2656-thread-2-EventThread) [] o.a.c.f.i.EnsembleTracker New config event received: {}
  2> 212240 INFO  (Curator-Framework-0) [] o.a.c.f.i.CuratorFrameworkImpl backgroundOperationsLoop exiting
  2> 212263 INFO  (closeThreadPool-2656-thread-1) [] o.a.s.m.OtelRuntimeJvmMetrics JVM metrics are disabled
  2> 212272 INFO  (closeThreadPool-2656-thread-1) [] o.a.s.c.ZkContainer Zookeeper client=127.0.0.1:34081/solr
  2> 212272 WARN  (closeThreadPool-2656-thread-1) [] o.a.s.c.c.SolrZkClient Using default ZkCredentialsInjector. ZkCredentialsInjector is not secure, it creates an empty list of credentials which leads to 'OPEN_ACL_UNSAFE' ACLs to Zookeeper nodes
  2> 212272 WARN  (closeThreadPool-2656-thread-1) [] o.a.s.c.c.SolrZkClient Using default ZkACLProvider. DefaultZkACLProvider is not secure, it creates 'OPEN_ACL_UNSAFE' ACLs to Zookeeper nodes
  2> 212272 INFO  (closeThreadPool-2656-thread-1) [] o.a.c.f.i.CuratorFrameworkImpl Starting
  2> 212274 INFO  (closeThreadPool-2656-thread-1) [] o.a.c.f.i.CuratorFrameworkImpl Default schema
  2> 212274 INFO  (closeThreadPool-2656-thread-1-EventThread) [] o.a.c.f.s.ConnectionStateManager State change: CONNECTED
  2> 212275 INFO  (closeThreadPool-2656-thread-1-EventThread) [] o.a.c.f.i.EnsembleTracker New config event received: {}
  2> 212275 INFO  (closeThreadPool-2656-thread-1-EventThread) [] o.a.c.f.i.EnsembleTracker New config event received: {}
  2> 212275 INFO  (Curator-Framework-0) [] o.a.c.f.i.CuratorFrameworkImpl backgroundOperationsLoop exiting
  2> 212341 INFO  (closeThreadPool-2656-thread-2) [n:127.0.0.1:40437_solr] o.a.c.f.i.CuratorFrameworkImpl Starting
  2> 212342 INFO  (closeThreadPool-2656-thread-2) [n:127.0.0.1:40437_solr] o.a.c.f.i.CuratorFrameworkImpl Default schema
  2> 212343 INFO  (closeThreadPool-2656-thread-2-EventThread) [] o.a.c.f.s.ConnectionStateManager State change: CONNECTED
  2> 212344 INFO  (closeThreadPool-2656-thread-2-EventThread) [] o.a.c.f.i.EnsembleTracker New config event received: {}
  2> 212344 INFO  (closeThreadPool-2656-thread-2-EventThread) [] o.a.c.f.i.EnsembleTracker New config event received: {}
  2> 212350 WARN  (closeThreadPool-2656-thread-2) [n:127.0.0.1:40437_solr] o.a.s.c.ZkController Contents of zookeeper /security.json are world-readable; consider setting up ACLs as described in https://solr.apache.org/guide/solr/latest/deployment-guide/zookeeper-access-control.html
  2> 212351 INFO  (closeThreadPool-2656-thread-2) [n:127.0.0.1:40437_solr] o.a.s.c.c.ZkStateReader Updated live nodes from ZooKeeper... (0) -> (1)
  2> 212353 INFO  (closeThreadPool-2656-thread-2) [n:127.0.0.1:40437_solr] o.a.s.c.ZkController The Overseer is enabled.  It will process all cluster commands & state updates.
  2> 212355 INFO  (closeThreadPool-2656-thread-2) [n:127.0.0.1:40437_solr] o.a.s.c.ZkController Publish node=127.0.0.1:40437_solr as DOWN
  2> 212357 INFO  (closeThreadPool-2656-thread-2) [n:127.0.0.1:40437_solr] o.a.s.c.ZkController Register node as live in ZooKeeper: /live_nodes/127.0.0.1:40437_solr
  2> 212358 INFO  (zkCallback-2627-thread-2) [] o.a.s.c.c.ZkStateReader Updated live nodes from ZooKeeper... (1) -> (2)
  2> 212358 INFO  (zkCallback-2653-thread-1) [] o.a.s.c.c.ZkStateReader Updated live nodes from ZooKeeper... (1) -> (2)
  2> 212358 INFO  (zkCallback-2688-thread-1) [] o.a.s.c.c.ZkStateReader Updated live nodes from ZooKeeper... (1) -> (2)
  2> 212360 WARN  (closeThreadPool-2656-thread-2) [n:127.0.0.1:40437_solr] o.a.s.c.CoreContainer Not all security plugins configured!  authentication=disabled authorization=disabled.  Solr is only as secure as you make it. Consider configuring authentication/authorization before exposing Solr to users internal or external.  See https://s.apache.org/solrsecurity for more info
  2> 212376 INFO  (closeThreadPool-2656-thread-1) [n:127.0.0.1:39353_solr] o.a.c.f.i.CuratorFrameworkImpl Starting
  2> 212378 INFO  (closeThreadPool-2656-thread-1) [n:127.0.0.1:39353_solr] o

[...truncated too long message...]

annot be instantiated.
java.security.policy: error adding Permission, java.net.URLPermission:
	java.util.ServiceConfigurationError: Locale provider adapter "CLDR"cannot be instantiated.
java.security.policy: error adding Permission, java.net.URLPermission:
	java.util.ServiceConfigurationError: Locale provider adapter "CLDR"cannot be instantiated.
java.security.policy: error adding Permission, java.net.URLPermission:
	java.util.ServiceConfigurationError: Locale provider adapter "CLDR"cannot be instantiated.
java.security.policy: error adding Permission, java.net.URLPermission:
	java.util.ServiceConfigurationError: Locale provider adapter "CLDR"cannot be instantiated.
java.security.policy: error adding Permission, java.net.URLPermission:
	java.util.ServiceConfigurationError: Locale provider adapter "CLDR"cannot be instantiated.
java.security.policy: error adding Permission, java.net.URLPermission:
	java.util.ServiceConfigurationError: Locale provider adapter "CLDR"cannot be instantiated.
java.security.policy: error adding Permission, java.net.URLPermission:
	java.util.ServiceConfigurationError: Locale provider adapter "CLDR"cannot be instantiated.
java.security.policy: error adding Permission, java.net.URLPermission:
	java.util.ServiceConfigurationError: Locale provider adapter "CLDR"cannot be instantiated.
java.security.policy: error adding Permission, java.net.URLPermission:
	java.util.ServiceConfigurationError: Locale provider adapter "CLDR"cannot be instantiated.
java.security.policy: error adding Permission, java.net.URLPermission:
	java.util.ServiceConfigurationError: Locale provider adapter "CLDR"cannot be instantiated.
java.security.policy: error adding Permission, java.net.URLPermission:
	java.util.ServiceConfigurationError: Locale provider adapter "CLDR"cannot be instantiated.
java.security.policy: error adding Permission, java.net.URLPermission:
	java.util.ServiceConfigurationError: Locale provider adapter "CLDR"cannot be instantiated.
java.security.policy: error adding Permission, java.net.URLPermission:
	java.util.ServiceConfigurationError: Locale provider adapter "CLDR"cannot be instantiated.
java.security.policy: error adding Permission, java.net.URLPermission:
	java.util.ServiceConfigurationError: Locale provider adapter "CLDR"cannot be instantiated.
java.security.policy: error adding Permission, java.net.URLPermission:
	java.util.ServiceConfigurationError: Locale provider adapter "CLDR"cannot be instantiated.
java.security.policy: error adding Permission, java.net.URLPermission:
	java.util.ServiceConfigurationError: Locale provider adapter "CLDR"cannot be instantiated.
java.security.policy: error adding Permission, java.net.URLPermission:
	java.util.ServiceConfigurationError: Locale provider adapter "CLDR"cannot be instantiated.
java.security.policy: error adding Permission, java.net.URLPermission:
	java.util.ServiceConfigurationError: Locale provider adapter "CLDR"cannot be instantiated.
java.security.policy: error adding Permission, java.net.URLPermission:
	java.util.ServiceConfigurationError: Locale provider adapter "CLDR"cannot be instantiated.
:solr:modules:scripting:test (SUCCESS): 24 test(s), 19 skipped

> Task :solr:modules:scripting:wipeTaskTemp
> Task :solr:modules:sql:compileTestJava
> Task :solr:modules:sql:testClasses

> Task :solr:modules:sql:test
WARNING: Using incubator modules: jdk.incubator.vector
WARNING: Using incubator modules: jdk.incubator.vector
WARNING: Using incubator modules: jdk.incubator.vector
WARNING: A command line option has enabled the Security Manager
WARNING: The Security Manager is deprecated and will be removed in a future release
WARNING: A command line option has enabled the Security Manager
WARNING: The Security Manager is deprecated and will be removed in a future release
WARNING: A command line option has enabled the Security Manager
WARNING: The Security Manager is deprecated and will be removed in a future release
java.security.policy: error adding Permission, java.net.URLPermission:
	java.util.ServiceConfigurationError: Locale provider adapter "CLDR"cannot be instantiated.
java.security.policy: error adding Permission, java.net.URLPermission:
	java.util.ServiceConfigurationError: Locale provider adapter "CLDR"cannot be instantiated.
java.security.policy: error adding Permission, java.net.URLPermission:
	java.util.ServiceConfigurationError: Locale provider adapter "CLDR"cannot be instantiated.
java.security.policy: error adding Permission, java.net.URLPermission:
	java.util.ServiceConfigurationError: Locale provider adapter "CLDR"cannot be instantiated.
java.security.policy: error adding Permission, java.net.URLPermission:
	java.util.ServiceConfigurationError: Locale provider adapter "CLDR"cannot be instantiated.
java.security.policy: error adding Permission, java.net.URLPermission:
	java.util.ServiceConfigurationError: Locale provider adapter "CLDR"cannot be instantiated.
java.security.policy: error adding Permission, java.net.URLPermission:
	java.util.ServiceConfigurationError: Locale provider adapter "CLDR"cannot be instantiated.
java.security.policy: error adding Permission, java.net.URLPermission:
	java.util.ServiceConfigurationError: Locale provider adapter "CLDR"cannot be instantiated.
java.security.policy: error adding Permission, java.net.URLPermission:
	java.util.ServiceConfigurationError: Locale provider adapter "CLDR"cannot be instantiated.
java.security.policy: error adding Permission, java.net.URLPermission:
	java.util.ServiceConfigurationError: Locale provider adapter "CLDR"cannot be instantiated.
java.security.policy: error adding Permission, java.net.URLPermission:
	java.util.ServiceConfigurationError: Locale provider adapter "CLDR"cannot be instantiated.
java.security.policy: error adding Permission, java.net.URLPermission:
	java.util.ServiceConfigurationError: Locale provider adapter "CLDR"cannot be instantiated.
java.security.policy: error adding Permission, java.net.URLPermission:
	java.util.ServiceConfigurationError: Locale provider adapter "CLDR"cannot be instantiated.
java.security.policy: error adding Permission, java.net.URLPermission:
	java.util.ServiceConfigurationError: Locale provider adapter "CLDR"cannot be instantiated.
java.security.policy: error adding Permission, java.net.URLPermission:
	java.util.ServiceConfigurationError: Locale provider adapter "CLDR"cannot be instantiated.
:solr:modules:sql:test (SUCCESS): 34 test(s)

> Task :checkWorkingCopyClean
> Task :solr:modules:sql:wipeTaskTemp
The slowest tests (exceeding 500 ms) during this run:
  63.68s TestCpuAllowedLimit.testDistribLimit2 (:solr:core)
  55.72s TestCpuAllowedLimit.testDistribLimit (:solr:core)
  43.06s TestRandomCollapseQParserPlugin.testRandomCollapseWithSort (:solr:core)
  40.45s PeerSyncReplicationTest.test (:solr:core)
  40.15s HttpJettySolrClientTest.testIdleTimeoutWithHttpClient (:solr:solrj-jetty)
  37.85s TestRandomFaceting.testRandomFaceting (:solr:core)
  34.81s TestCloudSearcherWarming.testPeersyncFailureReplicationSuccess (:solr:core)
  32.79s BasicDistributedZkTest.test (:solr:core)
  32.68s TestRandomFlRTGCloud.testRandomizedUpdatesAndRTGs (:solr:core)
  28.35s TestCoordinatorRole.testNRTRestart (:solr:core)
The slowest suites (exceeding 1s) during this run:
  124.87s TestCpuAllowedLimit (:solr:core)
  77.71s KnnQParserTest (:solr:core)
  65.96s TestCoordinatorRole (:solr:core)
  64.70s TestRecovery (:solr:core)
  62.76s MultiThreadedOCPTest (:solr:core)
  52.62s HttpJettySolrClientTest (:solr:solrj-jetty)
  51.94s TestTlogReplica (:solr:core)
  51.58s ReindexCollectionTest (:solr:core)
  49.85s TestPackages (:solr:core)
  49.43s CombinedQuerySolrCloudTest (:solr:core)
ERROR: The following test(s) have failed:
  - org.apache.solr.cloud.RecoveryAfterSoftCommitTest.test (:solr:core)
    Test history: https://develocity.apache.org/scans/tests?search.rootProjectNames=solr-root&tests.container=org.apache.solr.cloud.RecoveryAfterSoftCommitTest&tests.test=test http://fucit.org/solr-jenkins-reports/history-trend-of-recent-failures.html#series/org.apache.solr.cloud.RecoveryAfterSoftCommitTest.test
    Test output: /home/jenkins/jenkins-agent/workspace/Solr/Solr-Test-main/solr/core/build/test-results/test/outputs/OUTPUT-org.apache.solr.cloud.RecoveryAfterSoftCommitTest.txt
    Reproduce with: ./gradlew :solr:core:test --tests "org.apache.solr.cloud.RecoveryAfterSoftCommitTest.test" -Ptests.haltonfailure=false "-Ptests.jvmargs=-XX:TieredStopAtLevel=1 -XX:+UseParallelGC -XX:ActiveProcessorCount=1 -XX:ReservedCodeCacheSize=120m" -Ptests.seed=29DCE295C440B786 -Ptests.multiplier=2 -Ptests.useSecurityManager=true -Ptests.badapples=false -Ptests.file.encoding=UTF-8


[Incubating] Problems report is available at: file:///home/jenkins/jenkins-agent/workspace/Solr/Solr-Test-main/build/reports/problems/problems-report.html

Deprecated Gradle features were used in this build, making it incompatible with Gradle 10.

You can use '--warning-mode all' to show the individual deprecation warnings and determine if they come from your own scripts or plugins.

For more on this, please refer to https://docs.gradle.org/9.6.0/userguide/command_line_interface.html#sec:command_line_warnings in the Gradle documentation.

BUILD SUCCESSFUL in 38m 17s
153 actionable tasks: 153 executed

Publishing Build Scan to Develocity...

The Develocity server (develocity.apache.org) rejected the credential with prefix '7x3jzizm4zpygv7psbkg6byvm4'.
Your credential has expired.

Build step 'Invoke Gradle script' changed build result to SUCCESS
Archiving artifacts
‘**/*.events’ doesn’t match anything: ‘**’ exists but not ‘**/*.events’
No artifacts found that match the file pattern "**/*.events,heapdumps/**,**/hs_err_pid*". Configuration error?
Recording test results
[Checks API] No suitable checks publisher found.
Build step 'Publish JUnit test result report' changed build result to UNSTABLE
Email was triggered for: Unstable (Test Failures)
Sending email for trigger: Unstable (Test Failures)