You are viewing a plain text version of this content. The canonical link for it is here.
Posted to dev@lucene.apache.org by Policeman Jenkins Server <je...@thetaphi.de> on 2016/05/11 06:48:18 UTC

[JENKINS] Lucene-Solr-6.x-Linux (64bit/jdk1.8.0_92) - Build # 620 - Failure!

Build: http://jenkins.thetaphi.de/job/Lucene-Solr-6.x-Linux/620/
Java: 64bit/jdk1.8.0_92 -XX:+UseCompressedOops -XX:+UseG1GC

1 tests failed.
FAILED:  junit.framework.TestSuite.org.apache.solr.schema.TestManagedSchemaAPI

Error Message:
ObjectTracker found 4 object(s) that were not released!!! [MDCAwareThreadPoolExecutor, MockDirectoryWrapper, MockDirectoryWrapper, TransactionLog]

Stack Trace:
java.lang.AssertionError: ObjectTracker found 4 object(s) that were not released!!! [MDCAwareThreadPoolExecutor, MockDirectoryWrapper, MockDirectoryWrapper, TransactionLog]
	at __randomizedtesting.SeedInfo.seed([CFF8C6C8A7A48C6A]:0)
	at org.junit.Assert.fail(Assert.java:93)
	at org.junit.Assert.assertTrue(Assert.java:43)
	at org.junit.Assert.assertNull(Assert.java:551)
	at org.apache.solr.SolrTestCaseJ4.afterClass(SolrTestCaseJ4.java:256)
	at sun.reflect.GeneratedMethodAccessor31.invoke(Unknown Source)
	at sun.reflect.DelegatingMethodAccessorImpl.invoke(DelegatingMethodAccessorImpl.java:43)
	at java.lang.reflect.Method.invoke(Method.java:498)
	at com.carrotsearch.randomizedtesting.RandomizedRunner.invoke(RandomizedRunner.java:1764)
	at com.carrotsearch.randomizedtesting.RandomizedRunner$7.evaluate(RandomizedRunner.java:834)
	at com.carrotsearch.randomizedtesting.rules.StatementAdapter.evaluate(StatementAdapter.java:36)
	at com.carrotsearch.randomizedtesting.rules.SystemPropertiesRestoreRule$1.evaluate(SystemPropertiesRestoreRule.java:57)
	at org.apache.lucene.util.AbstractBeforeAfterRule$1.evaluate(AbstractBeforeAfterRule.java:45)
	at com.carrotsearch.randomizedtesting.rules.StatementAdapter.evaluate(StatementAdapter.java:36)
	at org.apache.lucene.util.TestRuleStoreClassName$1.evaluate(TestRuleStoreClassName.java:41)
	at com.carrotsearch.randomizedtesting.rules.NoShadowingOrOverridesOnMethodsRule$1.evaluate(NoShadowingOrOverridesOnMethodsRule.java:40)
	at com.carrotsearch.randomizedtesting.rules.NoShadowingOrOverridesOnMethodsRule$1.evaluate(NoShadowingOrOverridesOnMethodsRule.java:40)
	at com.carrotsearch.randomizedtesting.rules.StatementAdapter.evaluate(StatementAdapter.java:36)
	at com.carrotsearch.randomizedtesting.rules.StatementAdapter.evaluate(StatementAdapter.java:36)
	at com.carrotsearch.randomizedtesting.rules.StatementAdapter.evaluate(StatementAdapter.java:36)
	at org.apache.lucene.util.TestRuleAssertionsRequired$1.evaluate(TestRuleAssertionsRequired.java:53)
	at org.apache.lucene.util.TestRuleMarkFailure$1.evaluate(TestRuleMarkFailure.java:47)
	at org.apache.lucene.util.TestRuleIgnoreAfterMaxFailures$1.evaluate(TestRuleIgnoreAfterMaxFailures.java:64)
	at org.apache.lucene.util.TestRuleIgnoreTestSuites$1.evaluate(TestRuleIgnoreTestSuites.java:54)
	at com.carrotsearch.randomizedtesting.rules.StatementAdapter.evaluate(StatementAdapter.java:36)
	at com.carrotsearch.randomizedtesting.ThreadLeakControl$StatementRunner.run(ThreadLeakControl.java:367)
	at java.lang.Thread.run(Thread.java:745)




Build Log:
[...truncated 12222 lines...]
   [junit4] Suite: org.apache.solr.schema.TestManagedSchemaAPI
   [junit4]   2> Creating dataDir: /home/jenkins/workspace/Lucene-Solr-6.x-Linux/solr/build/solr-core/test/J2/temp/solr.schema.TestManagedSchemaAPI_CFF8C6C8A7A48C6A-001/init-core-data-001
   [junit4]   2> 1925187 INFO  (SUITE-TestManagedSchemaAPI-seed#[CFF8C6C8A7A48C6A]-worker) [    ] o.a.s.SolrTestCaseJ4 Randomized ssl (false) and clientAuth (false)
   [junit4]   2> 1925188 INFO  (SUITE-TestManagedSchemaAPI-seed#[CFF8C6C8A7A48C6A]-worker) [    ] o.a.s.c.ZkTestServer STARTING ZK TEST SERVER
   [junit4]   2> 1925188 INFO  (Thread-5356) [    ] o.a.s.c.ZkTestServer client port:0.0.0.0/0.0.0.0:0
   [junit4]   2> 1925188 INFO  (Thread-5356) [    ] o.a.s.c.ZkTestServer Starting server
   [junit4]   2> 1925288 INFO  (SUITE-TestManagedSchemaAPI-seed#[CFF8C6C8A7A48C6A]-worker) [    ] o.a.s.c.ZkTestServer start zk server on port:40107
   [junit4]   2> 1925289 INFO  (SUITE-TestManagedSchemaAPI-seed#[CFF8C6C8A7A48C6A]-worker) [    ] o.a.s.c.c.SolrZkClient Using default ZkCredentialsProvider
   [junit4]   2> 1925289 INFO  (SUITE-TestManagedSchemaAPI-seed#[CFF8C6C8A7A48C6A]-worker) [    ] o.a.s.c.c.ConnectionManager Waiting for client to connect to ZooKeeper
   [junit4]   2> 1925295 INFO  (zkCallback-2738-thread-1) [    ] o.a.s.c.c.ConnectionManager Watcher org.apache.solr.common.cloud.ConnectionManager@6e561d9b name:ZooKeeperConnection Watcher:127.0.0.1:40107 got event WatchedEvent state:SyncConnected type:None path:null path:null type:None
   [junit4]   2> 1925295 INFO  (SUITE-TestManagedSchemaAPI-seed#[CFF8C6C8A7A48C6A]-worker) [    ] o.a.s.c.c.ConnectionManager Client is connected to ZooKeeper
   [junit4]   2> 1925295 INFO  (SUITE-TestManagedSchemaAPI-seed#[CFF8C6C8A7A48C6A]-worker) [    ] o.a.s.c.c.SolrZkClient Using default ZkACLProvider
   [junit4]   2> 1925296 INFO  (SUITE-TestManagedSchemaAPI-seed#[CFF8C6C8A7A48C6A]-worker) [    ] o.a.s.c.c.SolrZkClient makePath: /solr/solr.xml
   [junit4]   2> 1925315 INFO  (jetty-launcher-2737-thread-1) [    ] o.e.j.s.Server jetty-9.3.8.v20160314
   [junit4]   2> 1925315 INFO  (jetty-launcher-2737-thread-2) [    ] o.e.j.s.Server jetty-9.3.8.v20160314
   [junit4]   2> 1925316 INFO  (jetty-launcher-2737-thread-2) [    ] o.e.j.s.h.ContextHandler Started o.e.j.s.ServletContextHandler@1b4bcfc3{/solr,null,AVAILABLE}
   [junit4]   2> 1925320 INFO  (jetty-launcher-2737-thread-2) [    ] o.e.j.s.ServerConnector Started ServerConnector@884e22a{HTTP/1.1,[http/1.1]}{127.0.0.1:४०३८२}
   [junit4]   2> 1925320 INFO  (jetty-launcher-2737-thread-2) [    ] o.e.j.s.Server Started @१९२७२७९ms
   [junit4]   2> 1925320 INFO  (jetty-launcher-2737-thread-2) [    ] o.a.s.c.s.e.JettySolrRunner Jetty properties: {hostContext=/solr, hostPort=40382}
   [junit4]   2> 1925320 INFO  (jetty-launcher-2737-thread-2) [    ] o.a.s.s.SolrDispatchFilter SolrDispatchFilter.init(): sun.misc.Launcher$AppClassLoader@73d16e93
   [junit4]   2> 1925320 INFO  (jetty-launcher-2737-thread-2) [    ] o.a.s.c.SolrResourceLoader new SolrResourceLoader for directory: '/home/jenkins/workspace/Lucene-Solr-6.x-Linux/solr/build/solr-core/test/J2/temp/solr.schema.TestManagedSchemaAPI_CFF8C6C8A7A48C6A-001/tempDir-001/node2'
   [junit4]   2> 1925321 INFO  (jetty-launcher-2737-thread-2) [    ] o.a.s.c.SolrResourceLoader JNDI not configured for solr (NoInitialContextEx)
   [junit4]   2> 1925321 INFO  (jetty-launcher-2737-thread-2) [    ] o.a.s.c.SolrResourceLoader solr home defaulted to 'solr/' (could not find system property or JNDI)
   [junit4]   2> 1925321 INFO  (jetty-launcher-2737-thread-2) [    ] o.a.s.c.c.SolrZkClient Using default ZkCredentialsProvider
   [junit4]   2> 1925321 INFO  (jetty-launcher-2737-thread-1) [    ] o.e.j.s.h.ContextHandler Started o.e.j.s.ServletContextHandler@6d3e7059{/solr,null,AVAILABLE}
   [junit4]   2> 1925321 INFO  (jetty-launcher-2737-thread-2) [    ] o.a.s.c.c.ConnectionManager Waiting for client to connect to ZooKeeper
   [junit4]   2> 1925322 INFO  (jetty-launcher-2737-thread-1) [    ] o.e.j.s.ServerConnector Started ServerConnector@772dc44d{HTTP/1.1,[http/1.1]}{127.0.0.1:३६७२४}
   [junit4]   2> 1925322 INFO  (jetty-launcher-2737-thread-1) [    ] o.e.j.s.Server Started @१९२७२८१ms
   [junit4]   2> 1925322 INFO  (jetty-launcher-2737-thread-1) [    ] o.a.s.c.s.e.JettySolrRunner Jetty properties: {hostContext=/solr, hostPort=36724}
   [junit4]   2> 1925322 INFO  (jetty-launcher-2737-thread-1) [    ] o.a.s.s.SolrDispatchFilter SolrDispatchFilter.init(): sun.misc.Launcher$AppClassLoader@73d16e93
   [junit4]   2> 1925322 INFO  (jetty-launcher-2737-thread-1) [    ] o.a.s.c.SolrResourceLoader new SolrResourceLoader for directory: '/home/jenkins/workspace/Lucene-Solr-6.x-Linux/solr/build/solr-core/test/J2/temp/solr.schema.TestManagedSchemaAPI_CFF8C6C8A7A48C6A-001/tempDir-001/node1'
   [junit4]   2> 1925322 INFO  (zkCallback-2739-thread-1) [    ] o.a.s.c.c.ConnectionManager Watcher org.apache.solr.common.cloud.ConnectionManager@480b19fc name:ZooKeeperConnection Watcher:127.0.0.1:40107/solr got event WatchedEvent state:SyncConnected type:None path:null path:null type:None
   [junit4]   2> 1925322 INFO  (jetty-launcher-2737-thread-1) [    ] o.a.s.c.SolrResourceLoader JNDI not configured for solr (NoInitialContextEx)
   [junit4]   2> 1925322 INFO  (jetty-launcher-2737-thread-2) [    ] o.a.s.c.c.ConnectionManager Client is connected to ZooKeeper
   [junit4]   2> 1925322 INFO  (jetty-launcher-2737-thread-1) [    ] o.a.s.c.SolrResourceLoader solr home defaulted to 'solr/' (could not find system property or JNDI)
   [junit4]   2> 1925322 INFO  (jetty-launcher-2737-thread-2) [    ] o.a.s.c.c.SolrZkClient Using default ZkACLProvider
   [junit4]   2> 1925322 INFO  (jetty-launcher-2737-thread-1) [    ] o.a.s.c.c.SolrZkClient Using default ZkCredentialsProvider
   [junit4]   2> 1925323 INFO  (jetty-launcher-2737-thread-2) [    ] o.a.s.s.SolrDispatchFilter solr.xml found in ZooKeeper. Loading...
   [junit4]   2> 1925323 INFO  (jetty-launcher-2737-thread-1) [    ] o.a.s.c.c.ConnectionManager Waiting for client to connect to ZooKeeper
   [junit4]   2> 1925323 INFO  (zkCallback-2740-thread-1) [    ] o.a.s.c.c.ConnectionManager Watcher org.apache.solr.common.cloud.ConnectionManager@1a28fb9a name:ZooKeeperConnection Watcher:127.0.0.1:40107/solr got event WatchedEvent state:SyncConnected type:None path:null path:null type:None
   [junit4]   2> 1925323 INFO  (jetty-launcher-2737-thread-1) [    ] o.a.s.c.c.ConnectionManager Client is connected to ZooKeeper
   [junit4]   2> 1925323 INFO  (jetty-launcher-2737-thread-1) [    ] o.a.s.c.c.SolrZkClient Using default ZkACLProvider
   [junit4]   2> 1925324 INFO  (jetty-launcher-2737-thread-1) [    ] o.a.s.s.SolrDispatchFilter solr.xml found in ZooKeeper. Loading...
   [junit4]   2> 1925326 WARN  (NIOServerCxn.Factory:0.0.0.0/0.0.0.0:0) [    ] o.a.z.s.NIOServerCnxn caught end of stream exception
   [junit4]   2> EndOfStreamException: Unable to read additional data from client sessionid 0x1549e9103d30001, likely client has closed socket
   [junit4]   2> 	at org.apache.zookeeper.server.NIOServerCnxn.doIO(NIOServerCnxn.java:228)
   [junit4]   2> 	at org.apache.zookeeper.server.NIOServerCnxnFactory.run(NIOServerCnxnFactory.java:208)
   [junit4]   2> 	at java.lang.Thread.run(Thread.java:745)
   [junit4]   2> 1925327 INFO  (jetty-launcher-2737-thread-2) [    ] o.a.s.c.CorePropertiesLocator Config-defined core root directory: /home/jenkins/workspace/Lucene-Solr-6.x-Linux/solr/build/solr-core/test/J2/temp/solr.schema.TestManagedSchemaAPI_CFF8C6C8A7A48C6A-001/tempDir-001/node2/.
   [junit4]   2> 1925327 INFO  (jetty-launcher-2737-thread-2) [    ] o.a.s.c.CoreContainer New CoreContainer 1910492384
   [junit4]   2> 1925327 INFO  (jetty-launcher-2737-thread-2) [    ] o.a.s.c.CoreContainer Loading cores into CoreContainer [instanceDir=/home/jenkins/workspace/Lucene-Solr-6.x-Linux/solr/build/solr-core/test/J2/temp/solr.schema.TestManagedSchemaAPI_CFF8C6C8A7A48C6A-001/tempDir-001/node2]
   [junit4]   2> 1925327 WARN  (jetty-launcher-2737-thread-2) [    ] o.a.s.c.CoreContainer Couldn't add files from /home/jenkins/workspace/Lucene-Solr-6.x-Linux/solr/build/solr-core/test/J2/temp/solr.schema.TestManagedSchemaAPI_CFF8C6C8A7A48C6A-001/tempDir-001/node2/lib to classpath: /home/jenkins/workspace/Lucene-Solr-6.x-Linux/solr/build/solr-core/test/J2/temp/solr.schema.TestManagedSchemaAPI_CFF8C6C8A7A48C6A-001/tempDir-001/node2/lib
   [junit4]   2> 1925327 INFO  (jetty-launcher-2737-thread-2) [    ] o.a.s.h.c.HttpShardHandlerFactory created with socketTimeout : 90000,urlScheme : ,connTimeout : 15000,maxConnectionsPerHost : 20,maxConnections : 10000,corePoolSize : 0,maximumPoolSize : 2147483647,maxThreadIdleTime : 5,sizeOfQueue : -1,fairnessPolicy : false,useRetries : false,
   [junit4]   2> 1925327 INFO  (jetty-launcher-2737-thread-1) [    ] o.a.s.c.CorePropertiesLocator Config-defined core root directory: /home/jenkins/workspace/Lucene-Solr-6.x-Linux/solr/build/solr-core/test/J2/temp/solr.schema.TestManagedSchemaAPI_CFF8C6C8A7A48C6A-001/tempDir-001/node1/.
   [junit4]   2> 1925327 INFO  (jetty-launcher-2737-thread-1) [    ] o.a.s.c.CoreContainer New CoreContainer 1445205358
   [junit4]   2> 1925327 INFO  (jetty-launcher-2737-thread-1) [    ] o.a.s.c.CoreContainer Loading cores into CoreContainer [instanceDir=/home/jenkins/workspace/Lucene-Solr-6.x-Linux/solr/build/solr-core/test/J2/temp/solr.schema.TestManagedSchemaAPI_CFF8C6C8A7A48C6A-001/tempDir-001/node1]
   [junit4]   2> 1925328 WARN  (jetty-launcher-2737-thread-1) [    ] o.a.s.c.CoreContainer Couldn't add files from /home/jenkins/workspace/Lucene-Solr-6.x-Linux/solr/build/solr-core/test/J2/temp/solr.schema.TestManagedSchemaAPI_CFF8C6C8A7A48C6A-001/tempDir-001/node1/lib to classpath: /home/jenkins/workspace/Lucene-Solr-6.x-Linux/solr/build/solr-core/test/J2/temp/solr.schema.TestManagedSchemaAPI_CFF8C6C8A7A48C6A-001/tempDir-001/node1/lib
   [junit4]   2> 1925328 INFO  (jetty-launcher-2737-thread-1) [    ] o.a.s.h.c.HttpShardHandlerFactory created with socketTimeout : 90000,urlScheme : ,connTimeout : 15000,maxConnectionsPerHost : 20,maxConnections : 10000,corePoolSize : 0,maximumPoolSize : 2147483647,maxThreadIdleTime : 5,sizeOfQueue : -1,fairnessPolicy : false,useRetries : false,
   [junit4]   2> 1925328 INFO  (jetty-launcher-2737-thread-2) [    ] o.a.s.u.UpdateShardHandler Creating UpdateShardHandler HTTP client with params: socketTimeout=340000&connTimeout=45000&retry=true
   [junit4]   2> 1925328 INFO  (jetty-launcher-2737-thread-1) [    ] o.a.s.u.UpdateShardHandler Creating UpdateShardHandler HTTP client with params: socketTimeout=340000&connTimeout=45000&retry=true
   [junit4]   2> 1925328 INFO  (jetty-launcher-2737-thread-2) [    ] o.a.s.l.LogWatcher SLF4J impl is org.slf4j.impl.Log4jLoggerFactory
   [junit4]   2> 1925328 INFO  (jetty-launcher-2737-thread-2) [    ] o.a.s.l.LogWatcher Registering Log Listener [Log4j (org.slf4j.impl.Log4jLoggerFactory)]
   [junit4]   2> 1925328 INFO  (jetty-launcher-2737-thread-2) [    ] o.a.s.c.ZkContainer Zookeeper client=127.0.0.1:40107/solr
   [junit4]   2> 1925328 INFO  (jetty-launcher-2737-thread-1) [    ] o.a.s.l.LogWatcher SLF4J impl is org.slf4j.impl.Log4jLoggerFactory
   [junit4]   2> 1925328 INFO  (jetty-launcher-2737-thread-2) [    ] o.a.s.c.ZkController zkHost includes chroot
   [junit4]   2> 1925329 INFO  (jetty-launcher-2737-thread-1) [    ] o.a.s.l.LogWatcher Registering Log Listener [Log4j (org.slf4j.impl.Log4jLoggerFactory)]
   [junit4]   2> 1925329 INFO  (jetty-launcher-2737-thread-2) [    ] o.a.s.c.c.SolrZkClient Using default ZkCredentialsProvider
   [junit4]   2> 1925329 INFO  (jetty-launcher-2737-thread-1) [    ] o.a.s.c.ZkContainer Zookeeper client=127.0.0.1:40107/solr
   [junit4]   2> 1925329 INFO  (jetty-launcher-2737-thread-1) [    ] o.a.s.c.ZkController zkHost includes chroot
   [junit4]   2> 1925329 INFO  (jetty-launcher-2737-thread-1) [    ] o.a.s.c.c.SolrZkClient Using default ZkCredentialsProvider
   [junit4]   2> 1925329 INFO  (jetty-launcher-2737-thread-2) [    ] o.a.s.c.c.ConnectionManager Waiting for client to connect to ZooKeeper
   [junit4]   2> 1925329 INFO  (jetty-launcher-2737-thread-1) [    ] o.a.s.c.c.ConnectionManager Waiting for client to connect to ZooKeeper
   [junit4]   2> 1925332 INFO  (zkCallback-2746-thread-1) [    ] o.a.s.c.c.ConnectionManager Watcher org.apache.solr.common.cloud.ConnectionManager@1b6bd3a4 name:ZooKeeperConnection Watcher:127.0.0.1:40107 got event WatchedEvent state:SyncConnected type:None path:null path:null type:None
   [junit4]   2> 1925332 INFO  (jetty-launcher-2737-thread-1) [    ] o.a.s.c.c.ConnectionManager Client is connected to ZooKeeper
   [junit4]   2> 1925332 INFO  (jetty-launcher-2737-thread-1) [    ] o.a.s.c.c.SolrZkClient Using default ZkACLProvider
   [junit4]   2> 1925342 INFO  (jetty-launcher-2737-thread-1) [n:127.0.0.1:36724_solr    ] o.a.s.c.ZkController Added new OnReconnect listener org.apache.solr.cloud.ZkController$$Lambda$77/1310151556@54e5e231
   [junit4]   2> 1925343 INFO  (jetty-launcher-2737-thread-1) [n:127.0.0.1:36724_solr    ] o.a.s.c.c.ConnectionManager Waiting for client to connect to ZooKeeper
   [junit4]   2> 1925344 INFO  (zkCallback-2745-thread-1) [    ] o.a.s.c.c.ConnectionManager Watcher org.apache.solr.common.cloud.ConnectionManager@4ef1d9ac name:ZooKeeperConnection Watcher:127.0.0.1:40107 got event WatchedEvent state:SyncConnected type:None path:null path:null type:None
   [junit4]   2> 1925345 INFO  (jetty-launcher-2737-thread-2) [    ] o.a.s.c.c.ConnectionManager Client is connected to ZooKeeper
   [junit4]   2> 1925345 INFO  (jetty-launcher-2737-thread-2) [    ] o.a.s.c.c.SolrZkClient Using default ZkACLProvider
   [junit4]   2> 1925349 INFO  (zkCallback-2747-thread-1-processing-n:127.0.0.1:36724_solr) [n:127.0.0.1:36724_solr    ] o.a.s.c.c.ConnectionManager Watcher org.apache.solr.common.cloud.ConnectionManager@7e2a94c4 name:ZooKeeperConnection Watcher:127.0.0.1:40107/solr got event WatchedEvent state:SyncConnected type:None path:null path:null type:None
   [junit4]   2> 1925350 INFO  (jetty-launcher-2737-thread-2) [n:127.0.0.1:40382_solr    ] o.a.s.c.ZkController Added new OnReconnect listener org.apache.solr.cloud.ZkController$$Lambda$77/1310151556@734867ee
   [junit4]   2> 1925350 INFO  (jetty-launcher-2737-thread-1) [n:127.0.0.1:36724_solr    ] o.a.s.c.c.ConnectionManager Client is connected to ZooKeeper
   [junit4]   2> 1925350 INFO  (jetty-launcher-2737-thread-2) [n:127.0.0.1:40382_solr    ] o.a.s.c.c.ConnectionManager Waiting for client to connect to ZooKeeper
   [junit4]   2> 1925351 INFO  (jetty-launcher-2737-thread-1) [n:127.0.0.1:36724_solr    ] o.a.s.c.c.SolrZkClient makePath: /overseer/queue
   [junit4]   2> 1925351 INFO  (zkCallback-2748-thread-1-processing-n:127.0.0.1:40382_solr) [n:127.0.0.1:40382_solr    ] o.a.s.c.c.ConnectionManager Watcher org.apache.solr.common.cloud.ConnectionManager@768ef59c name:ZooKeeperConnection Watcher:127.0.0.1:40107/solr got event WatchedEvent state:SyncConnected type:None path:null path:null type:None
   [junit4]   2> 1925351 INFO  (jetty-launcher-2737-thread-2) [n:127.0.0.1:40382_solr    ] o.a.s.c.c.ConnectionManager Client is connected to ZooKeeper
   [junit4]   2> 1925352 INFO  (jetty-launcher-2737-thread-2) [n:127.0.0.1:40382_solr    ] o.a.s.c.c.SolrZkClient makePath: /overseer/collection-queue-work
   [junit4]   2> 1925352 INFO  (jetty-launcher-2737-thread-1) [n:127.0.0.1:36724_solr    ] o.a.s.c.c.SolrZkClient makePath: /overseer/collection-queue-work
   [junit4]   2> 1925355 INFO  (jetty-launcher-2737-thread-1) [n:127.0.0.1:36724_solr    ] o.a.s.c.c.SolrZkClient makePath: /overseer/collection-map-running
   [junit4]   2> 1925355 INFO  (jetty-launcher-2737-thread-2) [n:127.0.0.1:40382_solr    ] o.a.s.c.c.SolrZkClient makePath: /overseer/collection-map-running
   [junit4]   2> 1925356 INFO  (jetty-launcher-2737-thread-2) [n:127.0.0.1:40382_solr    ] o.a.s.c.c.SolrZkClient makePath: /overseer/collection-map-completed
   [junit4]   2> 1925356 INFO  (jetty-launcher-2737-thread-1) [n:127.0.0.1:36724_solr    ] o.a.s.c.c.SolrZkClient makePath: /overseer/collection-map-completed
   [junit4]   2> 1925361 INFO  (jetty-launcher-2737-thread-1) [n:127.0.0.1:36724_solr    ] o.a.s.c.c.SolrZkClient makePath: /overseer/collection-map-failure
   [junit4]   2> 1925361 INFO  (jetty-launcher-2737-thread-2) [n:127.0.0.1:40382_solr    ] o.a.s.c.c.SolrZkClient makePath: /overseer/collection-map-failure
   [junit4]   2> 1925362 INFO  (jetty-launcher-2737-thread-1) [n:127.0.0.1:36724_solr    ] o.a.s.c.c.SolrZkClient makePath: /live_nodes
   [junit4]   2> 1925362 INFO  (jetty-launcher-2737-thread-2) [n:127.0.0.1:40382_solr    ] o.a.s.c.c.SolrZkClient makePath: /live_nodes
   [junit4]   2> 1925362 INFO  (jetty-launcher-2737-thread-2) [n:127.0.0.1:40382_solr    ] o.a.s.c.c.SolrZkClient makePath: /collections
   [junit4]   2> 1925362 INFO  (jetty-launcher-2737-thread-1) [n:127.0.0.1:36724_solr    ] o.a.s.c.c.SolrZkClient makePath: /collections
   [junit4]   2> 1925363 INFO  (jetty-launcher-2737-thread-2) [n:127.0.0.1:40382_solr    ] o.a.s.c.c.SolrZkClient makePath: /aliases.json
   [junit4]   2> 1925363 INFO  (jetty-launcher-2737-thread-1) [n:127.0.0.1:36724_solr    ] o.a.s.c.c.SolrZkClient makePath: /aliases.json
   [junit4]   2> 1925363 INFO  (jetty-launcher-2737-thread-2) [n:127.0.0.1:40382_solr    ] o.a.s.c.c.SolrZkClient makePath: /clusterstate.json
   [junit4]   2> 1925363 INFO  (jetty-launcher-2737-thread-1) [n:127.0.0.1:36724_solr    ] o.a.s.c.c.SolrZkClient makePath: /clusterstate.json
   [junit4]   2> 1925364 INFO  (jetty-launcher-2737-thread-1) [n:127.0.0.1:36724_solr    ] o.a.s.c.c.SolrZkClient makePath: /security.json
   [junit4]   2> 1925364 INFO  (jetty-launcher-2737-thread-2) [n:127.0.0.1:40382_solr    ] o.a.s.c.c.SolrZkClient makePath: /security.json
   [junit4]   2> 1925364 INFO  (jetty-launcher-2737-thread-1) [n:127.0.0.1:36724_solr    ] o.a.s.c.c.ZkStateReader Updating cluster state from ZooKeeper... 
   [junit4]   2> 1925364 INFO  (jetty-launcher-2737-thread-2) [n:127.0.0.1:40382_solr    ] o.a.s.c.c.ZkStateReader Updating cluster state from ZooKeeper... 
   [junit4]   2> 1925364 INFO  (jetty-launcher-2737-thread-1) [n:127.0.0.1:36724_solr    ] o.a.s.c.c.ZkStateReader Updated live nodes from ZooKeeper... (0) -> (0)
   [junit4]   2> 1925364 INFO  (jetty-launcher-2737-thread-2) [n:127.0.0.1:40382_solr    ] o.a.s.c.c.ZkStateReader Updated live nodes from ZooKeeper... (0) -> (0)
   [junit4]   2> 1925365 INFO  (jetty-launcher-2737-thread-2) [n:127.0.0.1:40382_solr    ] o.a.s.c.c.SolrZkClient makePath: /overseer_elect
   [junit4]   2> 1925365 INFO  (jetty-launcher-2737-thread-1) [n:127.0.0.1:36724_solr    ] o.a.s.c.c.SolrZkClient makePath: /overseer_elect
   [junit4]   2> 1925367 INFO  (jetty-launcher-2737-thread-1) [n:127.0.0.1:36724_solr    ] o.a.s.c.c.SolrZkClient makePath: /overseer_elect/election
   [junit4]   2> 1925367 INFO  (jetty-launcher-2737-thread-2) [n:127.0.0.1:40382_solr    ] o.a.s.c.c.SolrZkClient makePath: /overseer_elect/election
   [junit4]   2> 1925367 INFO  (jetty-launcher-2737-thread-2) [n:127.0.0.1:40382_solr    ] o.a.s.c.Overseer Overseer (id=null) closing
   [junit4]   2> 1925367 INFO  (jetty-launcher-2737-thread-1) [n:127.0.0.1:36724_solr    ] o.a.s.c.Overseer Overseer (id=null) closing
   [junit4]   2> 1925367 INFO  (jetty-launcher-2737-thread-2) [n:127.0.0.1:40382_solr    ] o.a.s.c.LeaderElector Joined leadership election with path: /overseer_elect/election/95875837753229318-127.0.0.1:40382_solr-n_0000000000
   [junit4]   2> 1925367 INFO  (jetty-launcher-2737-thread-1) [n:127.0.0.1:36724_solr    ] o.a.s.c.LeaderElector Joined leadership election with path: /overseer_elect/election/95875837753229317-127.0.0.1:36724_solr-n_0000000001
   [junit4]   2> 1925368 INFO  (jetty-launcher-2737-thread-2) [n:127.0.0.1:40382_solr    ] o.a.s.c.OverseerElectionContext I am going to be the leader 127.0.0.1:40382_solr
   [junit4]   2> 1925368 INFO  (jetty-launcher-2737-thread-2) [n:127.0.0.1:40382_solr    ] o.a.s.c.c.SolrZkClient makePath: /overseer_elect/leader
   [junit4]   2> 1925368 INFO  (jetty-launcher-2737-thread-1) [n:127.0.0.1:36724_solr    ] o.a.s.c.LeaderElector Watching path /overseer_elect/election/95875837753229318-127.0.0.1:40382_solr-n_0000000000 to know if I could be the leader
   [junit4]   2> 1925368 INFO  (jetty-launcher-2737-thread-1) [n:127.0.0.1:36724_solr    ] o.a.s.c.ZkController Register node as live in ZooKeeper:/live_nodes/127.0.0.1:36724_solr
   [junit4]   2> 1925368 INFO  (jetty-launcher-2737-thread-1) [n:127.0.0.1:36724_solr    ] o.a.s.c.c.SolrZkClient makePath: /live_nodes/127.0.0.1:36724_solr
   [junit4]   2> 1925368 INFO  (jetty-launcher-2737-thread-2) [n:127.0.0.1:40382_solr    ] o.a.s.c.Overseer Overseer (id=95875837753229318-127.0.0.1:40382_solr-n_0000000000) starting
   [junit4]   2> 1925369 INFO  (zkCallback-2748-thread-1-processing-n:127.0.0.1:40382_solr) [n:127.0.0.1:40382_solr    ] o.a.s.c.c.ZkStateReader A live node change: [WatchedEvent state:SyncConnected type:NodeChildrenChanged path:/live_nodes], has occurred - updating... (live nodes size: [0])
   [junit4]   2> 1925369 INFO  (zkCallback-2747-thread-1-processing-n:127.0.0.1:36724_solr) [n:127.0.0.1:36724_solr    ] o.a.s.c.c.ZkStateReader A live node change: [WatchedEvent state:SyncConnected type:NodeChildrenChanged path:/live_nodes], has occurred - updating... (live nodes size: [0])
   [junit4]   2> 1925369 INFO  (zkCallback-2748-thread-1-processing-n:127.0.0.1:40382_solr) [n:127.0.0.1:40382_solr    ] o.a.s.c.c.ZkStateReader Updated live nodes from ZooKeeper... (0) -> (1)
   [junit4]   2> 1925369 INFO  (jetty-launcher-2737-thread-2) [n:127.0.0.1:40382_solr    ] o.a.s.c.c.SolrZkClient makePath: /overseer/queue-work
   [junit4]   2> 1925369 INFO  (zkCallback-2747-thread-1-processing-n:127.0.0.1:36724_solr) [n:127.0.0.1:36724_solr    ] o.a.s.c.c.ZkStateReader Updated live nodes from ZooKeeper... (0) -> (1)
   [junit4]   2> 1925376 INFO  (jetty-launcher-2737-thread-1) [n:127.0.0.1:36724_solr    ] o.a.s.c.CoreContainer Security conf doesn't exist. Skipping setup for authorization module.
   [junit4]   2> 1925376 INFO  (jetty-launcher-2737-thread-1) [n:127.0.0.1:36724_solr    ] o.a.s.c.CoreContainer No authentication plugin used.
   [junit4]   2> 1925376 INFO  (jetty-launcher-2737-thread-1) [n:127.0.0.1:36724_solr    ] o.a.s.c.CorePropertiesLocator Looking for core definitions underneath /home/jenkins/workspace/Lucene-Solr-6.x-Linux/solr/build/solr-core/test/J2/temp/solr.schema.TestManagedSchemaAPI_CFF8C6C8A7A48C6A-001/tempDir-001/node1/.
   [junit4]   2> 1925376 INFO  (jetty-launcher-2737-thread-1) [n:127.0.0.1:36724_solr    ] o.a.s.c.CorePropertiesLocator Found 0 core definitions
   [junit4]   2> 1925377 INFO  (jetty-launcher-2737-thread-1) [n:127.0.0.1:36724_solr    ] o.a.s.s.SolrDispatchFilter user.dir=/home/jenkins/workspace/Lucene-Solr-6.x-Linux/solr/build/solr-core/test/J2
   [junit4]   2> 1925377 INFO  (jetty-launcher-2737-thread-1) [n:127.0.0.1:36724_solr    ] o.a.s.s.SolrDispatchFilter SolrDispatchFilter.init() done
   [junit4]   2> 1925378 INFO  (jetty-launcher-2737-thread-2) [n:127.0.0.1:40382_solr    ] o.a.s.c.OverseerAutoReplicaFailoverThread Starting OverseerAutoReplicaFailoverThread autoReplicaFailoverWorkLoopDelay=10000 autoReplicaFailoverWaitAfterExpiration=30000 autoReplicaFailoverBadNodeExpiration=60000
   [junit4]   2> 1925379 INFO  (OverseerCollectionConfigSetProcessor-95875837753229318-127.0.0.1:40382_solr-n_0000000000) [n:127.0.0.1:40382_solr    ] o.a.s.c.OverseerTaskProcessor Process current queue of overseer operations
   [junit4]   2> 1925379 INFO  (OverseerStateUpdate-95875837753229318-127.0.0.1:40382_solr-n_0000000000) [n:127.0.0.1:40382_solr    ] o.a.s.c.Overseer Starting to work on the main queue
   [junit4]   2> 1925379 INFO  (jetty-launcher-2737-thread-2) [n:127.0.0.1:40382_solr    ] o.a.s.c.ZkController Publish node=127.0.0.1:40382_solr as DOWN
   [junit4]   2> 1925379 INFO  (OverseerStateUpdate-95875837753229318-127.0.0.1:40382_solr-n_0000000000) [n:127.0.0.1:40382_solr    ] o.a.s.c.c.ZkStateReader Updated live nodes from ZooKeeper... (1) -> (1)
   [junit4]   2> 1925380 INFO  (OverseerStateUpdate-95875837753229318-127.0.0.1:40382_solr-n_0000000000) [n:127.0.0.1:40382_solr    ] o.a.s.c.Overseer processMessage: queueSize: 1, message = {
   [junit4]   2>   "operation":"downnode",
   [junit4]   2>   "node_name":"127.0.0.1:40382_solr"} current state version: 0
   [junit4]   2> 1925380 INFO  (OverseerStateUpdate-95875837753229318-127.0.0.1:40382_solr-n_0000000000) [n:127.0.0.1:40382_solr    ] o.a.s.c.o.NodeMutator DownNode state invoked for node: 127.0.0.1:40382_solr
   [junit4]   2> 1926379 INFO  (jetty-launcher-2737-thread-2) [n:127.0.0.1:40382_solr    ] o.a.s.c.ZkController Register node as live in ZooKeeper:/live_nodes/127.0.0.1:40382_solr
   [junit4]   2> 1926380 INFO  (jetty-launcher-2737-thread-2) [n:127.0.0.1:40382_solr    ] o.a.s.c.c.SolrZkClient makePath: /live_nodes/127.0.0.1:40382_solr
   [junit4]   2> 1926380 INFO  (zkCallback-2747-thread-1-processing-n:127.0.0.1:36724_solr) [n:127.0.0.1:36724_solr    ] o.a.s.c.c.ZkStateReader A live node change: [WatchedEvent state:SyncConnected type:NodeChildrenChanged path:/live_nodes], has occurred - updating... (live nodes size: [1])
   [junit4]   2> 1926380 INFO  (zkCallback-2748-thread-1-processing-n:127.0.0.1:40382_solr) [n:127.0.0.1:40382_solr    ] o.a.s.c.c.ZkStateReader A live node change: [WatchedEvent state:SyncConnected type:NodeChildrenChanged path:/live_nodes], has occurred - updating... (live nodes size: [1])
   [junit4]   2> 1926381 INFO  (zkCallback-2747-thread-1-processing-n:127.0.0.1:36724_solr) [n:127.0.0.1:36724_solr    ] o.a.s.c.c.ZkStateReader Updated live nodes from ZooKeeper... (1) -> (2)
   [junit4]   2> 1926381 INFO  (zkCallback-2748-thread-1-processing-n:127.0.0.1:40382_solr) [n:127.0.0.1:40382_solr    ] o.a.s.c.c.ZkStateReader Updated live nodes from ZooKeeper... (1) -> (2)
   [junit4]   2> 1926391 INFO  (jetty-launcher-2737-thread-2) [n:127.0.0.1:40382_solr    ] o.a.s.c.CoreContainer Security conf doesn't exist. Skipping setup for authorization module.
   [junit4]   2> 1926391 INFO  (jetty-launcher-2737-thread-2) [n:127.0.0.1:40382_solr    ] o.a.s.c.CoreContainer No authentication plugin used.
   [junit4]   2> 1926392 INFO  (jetty-launcher-2737-thread-2) [n:127.0.0.1:40382_solr    ] o.a.s.c.CorePropertiesLocator Looking for core definitions underneath /home/jenkins/workspace/Lucene-Solr-6.x-Linux/solr/build/solr-core/test/J2/temp/solr.schema.TestManagedSchemaAPI_CFF8C6C8A7A48C6A-001/tempDir-001/node2/.
   [junit4]   2> 1926392 INFO  (jetty-launcher-2737-thread-2) [n:127.0.0.1:40382_solr    ] o.a.s.c.CorePropertiesLocator Found 0 core definitions
   [junit4]   2> 1926392 INFO  (jetty-launcher-2737-thread-2) [n:127.0.0.1:40382_solr    ] o.a.s.s.SolrDispatchFilter user.dir=/home/jenkins/workspace/Lucene-Solr-6.x-Linux/solr/build/solr-core/test/J2
   [junit4]   2> 1926392 INFO  (jetty-launcher-2737-thread-2) [n:127.0.0.1:40382_solr    ] o.a.s.s.SolrDispatchFilter SolrDispatchFilter.init() done
   [junit4]   2> 1926392 INFO  (SUITE-TestManagedSchemaAPI-seed#[CFF8C6C8A7A48C6A]-worker) [    ] o.a.s.c.c.SolrZkClient Using default ZkCredentialsProvider
   [junit4]   2> 1926393 INFO  (SUITE-TestManagedSchemaAPI-seed#[CFF8C6C8A7A48C6A]-worker) [    ] o.a.s.c.c.ConnectionManager Waiting for client to connect to ZooKeeper
   [junit4]   2> 1926393 INFO  (zkCallback-2749-thread-1) [    ] o.a.s.c.c.ConnectionManager Watcher org.apache.solr.common.cloud.ConnectionManager@1ea23c4e name:ZooKeeperConnection Watcher:127.0.0.1:40107 got event WatchedEvent state:SyncConnected type:None path:null path:null type:None
   [junit4]   2> 1926393 INFO  (SUITE-TestManagedSchemaAPI-seed#[CFF8C6C8A7A48C6A]-worker) [    ] o.a.s.c.c.ConnectionManager Client is connected to ZooKeeper
   [junit4]   2> 1926394 INFO  (SUITE-TestManagedSchemaAPI-seed#[CFF8C6C8A7A48C6A]-worker) [    ] o.a.s.c.c.SolrZkClient Using default ZkACLProvider
   [junit4]   2> 1926394 INFO  (SUITE-TestManagedSchemaAPI-seed#[CFF8C6C8A7A48C6A]-worker) [    ] o.a.s.c.s.i.CloudSolrClient Final constructed zkHost string: 127.0.0.1:40107/solr
   [junit4]   2> 1926394 INFO  (SUITE-TestManagedSchemaAPI-seed#[CFF8C6C8A7A48C6A]-worker) [    ] o.a.s.c.c.SolrZkClient Using default ZkCredentialsProvider
   [junit4]   2> 1926394 INFO  (SUITE-TestManagedSchemaAPI-seed#[CFF8C6C8A7A48C6A]-worker) [    ] o.a.s.c.c.ConnectionManager Waiting for client to connect to ZooKeeper
   [junit4]   2> 1926395 INFO  (zkCallback-2751-thread-1) [    ] o.a.s.c.c.ConnectionManager Watcher org.apache.solr.common.cloud.ConnectionManager@4aee57aa name:ZooKeeperConnection Watcher:127.0.0.1:40107/solr got event WatchedEvent state:SyncConnected type:None path:null path:null type:None
   [junit4]   2> 1926395 INFO  (SUITE-TestManagedSchemaAPI-seed#[CFF8C6C8A7A48C6A]-worker) [    ] o.a.s.c.c.ConnectionManager Client is connected to ZooKeeper
   [junit4]   2> 1926395 INFO  (SUITE-TestManagedSchemaAPI-seed#[CFF8C6C8A7A48C6A]-worker) [    ] o.a.s.c.c.SolrZkClient Using default ZkACLProvider
   [junit4]   2> 1926395 INFO  (SUITE-TestManagedSchemaAPI-seed#[CFF8C6C8A7A48C6A]-worker) [    ] o.a.s.c.c.ZkStateReader Updating cluster state from ZooKeeper... 
   [junit4]   2> 1926395 INFO  (SUITE-TestManagedSchemaAPI-seed#[CFF8C6C8A7A48C6A]-worker) [    ] o.a.s.c.c.ZkStateReader Updated live nodes from ZooKeeper... (0) -> (2)
   [junit4]   2> 1926396 INFO  (SUITE-TestManagedSchemaAPI-seed#[CFF8C6C8A7A48C6A]-worker) [    ] o.a.s.c.c.SolrZkClient makePath: /configs/conf1/solrconfig.xml
   [junit4]   2> 1926397 INFO  (SUITE-TestManagedSchemaAPI-seed#[CFF8C6C8A7A48C6A]-worker) [    ] o.a.s.c.c.SolrZkClient makePath: /configs/conf1/managed-schema
   [junit4]   2> 1926415 INFO  (TEST-TestManagedSchemaAPI.test-seed#[CFF8C6C8A7A48C6A]) [    ] o.a.s.SolrTestCaseJ4 ###Starting test
   [junit4]   2> 1926418 INFO  (qtp1996060622-16324) [n:127.0.0.1:36724_solr    ] o.a.s.h.a.CollectionsHandler Invoked Collection Action :create with params replicationFactor=2&collection.configName=conf1&name=testschemaapi&action=CREATE&numShards=1&wt=javabin&version=2 and sendToOCPQueue=true
   [junit4]   2> 1926419 INFO  (OverseerCollectionConfigSetProcessor-95875837753229318-127.0.0.1:40382_solr-n_0000000000) [n:127.0.0.1:40382_solr    ] o.a.s.c.OverseerTaskProcessor Overseer Collection Message Handler: Get the message id:/overseer/collection-queue-work/qn-0000000000 message:{
   [junit4]   2>   "name":"testschemaapi",
   [junit4]   2>   "fromApi":"true",
   [junit4]   2>   "replicationFactor":"2",
   [junit4]   2>   "collection.configName":"conf1",
   [junit4]   2>   "numShards":"1",
   [junit4]   2>   "stateFormat":"2",
   [junit4]   2>   "operation":"create"}
   [junit4]   2> 1926419 INFO  (OverseerThreadFactory-7465-thread-1-processing-n:127.0.0.1:40382_solr) [n:127.0.0.1:40382_solr    ] o.a.s.c.OverseerCollectionMessageHandler OverseerCollectionMessageHandler.processMessage : create , {
   [junit4]   2>   "name":"testschemaapi",
   [junit4]   2>   "fromApi":"true",
   [junit4]   2>   "replicationFactor":"2",
   [junit4]   2>   "collection.configName":"conf1",
   [junit4]   2>   "numShards":"1",
   [junit4]   2>   "stateFormat":"2",
   [junit4]   2>   "operation":"create"}
   [junit4]   2> 1926419 INFO  (OverseerThreadFactory-7465-thread-1-processing-n:127.0.0.1:40382_solr) [n:127.0.0.1:40382_solr    ] o.a.s.c.OverseerCollectionMessageHandler Create collection testschemaapi
   [junit4]   2> 1926419 INFO  (OverseerThreadFactory-7465-thread-1-processing-n:127.0.0.1:40382_solr) [n:127.0.0.1:40382_solr    ] o.a.s.c.OverseerCollectionMessageHandler creating collections conf node /collections/testschemaapi 
   [junit4]   2> 1926420 INFO  (OverseerThreadFactory-7465-thread-1-processing-n:127.0.0.1:40382_solr) [n:127.0.0.1:40382_solr    ] o.a.s.c.c.SolrZkClient makePath: /collections/testschemaapi
   [junit4]   2> 1926420 INFO  (zkCallback-2748-thread-1-processing-n:127.0.0.1:40382_solr) [n:127.0.0.1:40382_solr    ] o.a.s.c.c.ZkStateReader A collections change: [WatchedEvent state:SyncConnected type:NodeChildrenChanged path:/collections], has occurred - updating...
   [junit4]   2> 1926420 INFO  (zkCallback-2747-thread-1-processing-n:127.0.0.1:36724_solr) [n:127.0.0.1:36724_solr    ] o.a.s.c.c.ZkStateReader A collections change: [WatchedEvent state:SyncConnected type:NodeChildrenChanged path:/collections], has occurred - updating...
   [junit4]   2> 1926420 INFO  (zkCallback-2751-thread-1) [    ] o.a.s.c.c.ZkStateReader A collections change: [WatchedEvent state:SyncConnected type:NodeChildrenChanged path:/collections], has occurred - updating...
   [junit4]   2> 1926421 INFO  (OverseerStateUpdate-95875837753229318-127.0.0.1:40382_solr-n_0000000000) [n:127.0.0.1:40382_solr    ] o.a.s.c.Overseer processMessage: queueSize: 1, message = {
   [junit4]   2>   "name":"testschemaapi",
   [junit4]   2>   "fromApi":"true",
   [junit4]   2>   "replicationFactor":"2",
   [junit4]   2>   "collection.configName":"conf1",
   [junit4]   2>   "numShards":"1",
   [junit4]   2>   "stateFormat":"2",
   [junit4]   2>   "operation":"create"} current state version: 0
   [junit4]   2> 1926421 INFO  (OverseerStateUpdate-95875837753229318-127.0.0.1:40382_solr-n_0000000000) [n:127.0.0.1:40382_solr    ] o.a.s.c.o.ClusterStateMutator building a new cName: testschemaapi
   [junit4]   2> 1926422 INFO  (OverseerStateUpdate-95875837753229318-127.0.0.1:40382_solr-n_0000000000) [n:127.0.0.1:40382_solr    ] o.a.s.c.o.ZkStateWriter going to create_collection /collections/testschemaapi/state.json
   [junit4]   2> 1926521 INFO  (OverseerThreadFactory-7465-thread-1-processing-n:127.0.0.1:40382_solr) [n:127.0.0.1:40382_solr    ] o.a.s.c.OverseerCollectionMessageHandler Creating SolrCores for new collection testschemaapi, shardNames [shard1] , replicationFactor : 2
   [junit4]   2> 1926521 INFO  (OverseerThreadFactory-7465-thread-1-processing-n:127.0.0.1:40382_solr) [n:127.0.0.1:40382_solr    ] o.a.s.c.OverseerCollectionMessageHandler Creating core testschemaapi_shard1_replica1 as part of shard shard1 of collection testschemaapi on 127.0.0.1:36724_solr
   [junit4]   2> 1926521 INFO  (OverseerThreadFactory-7465-thread-1-processing-n:127.0.0.1:40382_solr) [n:127.0.0.1:40382_solr    ] o.a.s.c.OverseerCollectionMessageHandler Creating core testschemaapi_shard1_replica2 as part of shard shard1 of collection testschemaapi on 127.0.0.1:40382_solr
   [junit4]   2> 1926522 INFO  (qtp1996060622-16328) [n:127.0.0.1:36724_solr    ] o.a.s.h.a.CoreAdminOperation core create command qt=/admin/cores&collection.configName=conf1&name=testschemaapi_shard1_replica1&action=CREATE&numShards=1&collection=testschemaapi&shard=shard1&wt=javabin&version=2
   [junit4]   2> 1926522 INFO  (qtp1370664619-16325) [n:127.0.0.1:40382_solr    ] o.a.s.h.a.CoreAdminOperation core create command qt=/admin/cores&collection.configName=conf1&name=testschemaapi_shard1_replica2&action=CREATE&numShards=1&collection=testschemaapi&shard=shard1&wt=javabin&version=2
   [junit4]   2> 1926523 INFO  (qtp1996060622-16328) [n:127.0.0.1:36724_solr    ] o.a.s.c.CoreDescriptor Created CoreDescriptor: {name=testschemaapi_shard1_replica1, collection.configName=conf1, config=solrconfig.xml, transient=false, schema=schema.xml, loadOnStartup=true, configSetProperties=configsetprops.json, collection=testschemaapi, numShards=1, dataDir=data/, shard=shard1}
   [junit4]   2> 1926523 INFO  (qtp1370664619-16325) [n:127.0.0.1:40382_solr    ] o.a.s.c.CoreDescriptor Created CoreDescriptor: {name=testschemaapi_shard1_replica2, collection.configName=conf1, config=solrconfig.xml, transient=false, schema=schema.xml, loadOnStartup=true, configSetProperties=configsetprops.json, collection=testschemaapi, numShards=1, dataDir=data/, shard=shard1}
   [junit4]   2> 1926523 INFO  (qtp1996060622-16328) [n:127.0.0.1:36724_solr c:testschemaapi s:shard1  x:testschemaapi_shard1_replica1] o.a.s.c.ZkController publishing state=down
   [junit4]   2> 1926523 INFO  (qtp1370664619-16325) [n:127.0.0.1:40382_solr c:testschemaapi s:shard1  x:testschemaapi_shard1_replica2] o.a.s.c.ZkController publishing state=down
   [junit4]   2> 1926524 INFO  (qtp1370664619-16325) [n:127.0.0.1:40382_solr c:testschemaapi s:shard1  x:testschemaapi_shard1_replica2] o.a.s.c.ZkController Registering watch for collection testschemaapi
   [junit4]   2> 1926524 INFO  (OverseerStateUpdate-95875837753229318-127.0.0.1:40382_solr-n_0000000000) [n:127.0.0.1:40382_solr    ] o.a.s.c.Overseer processMessage: queueSize: 2, message = {
   [junit4]   2>   "core":"testschemaapi_shard1_replica1",
   [junit4]   2>   "roles":null,
   [junit4]   2>   "base_url":"http://127.0.0.1:36724/solr",
   [junit4]   2>   "node_name":"127.0.0.1:36724_solr",
   [junit4]   2>   "numShards":"1",
   [junit4]   2>   "state":"down",
   [junit4]   2>   "shard":"shard1",
   [junit4]   2>   "collection":"testschemaapi",
   [junit4]   2>   "operation":"state"} current state version: 0
   [junit4]   2> 1926524 INFO  (qtp1370664619-16325) [n:127.0.0.1:40382_solr c:testschemaapi s:shard1  x:testschemaapi_shard1_replica2] o.a.s.c.c.ZkStateReader addZkWatch [testschemaapi]
   [junit4]   2> 1926524 INFO  (qtp1996060622-16328) [n:127.0.0.1:36724_solr c:testschemaapi s:shard1  x:testschemaapi_shard1_replica1] o.a.s.c.ZkController Registering watch for collection testschemaapi
   [junit4]   2> 1926524 INFO  (qtp1996060622-16328) [n:127.0.0.1:36724_solr c:testschemaapi s:shard1  x:testschemaapi_shard1_replica1] o.a.s.c.c.ZkStateReader addZkWatch [testschemaapi]
   [junit4]   2> 1926524 INFO  (OverseerStateUpdate-95875837753229318-127.0.0.1:40382_solr-n_0000000000) [n:127.0.0.1:40382_solr    ] o.a.s.c.o.ReplicaMutator Update state numShards=1 message={
   [junit4]   2>   "core":"testschemaapi_shard1_replica1",
   [junit4]   2>   "roles":null,
   [junit4]   2>   "base_url":"http://127.0.0.1:36724/solr",
   [junit4]   2>   "node_name":"127.0.0.1:36724_solr",
   [junit4]   2>   "numShards":"1",
   [junit4]   2>   "state":"down",
   [junit4]   2>   "shard":"shard1",
   [junit4]   2>   "collection":"testschemaapi",
   [junit4]   2>   "operation":"state"}
   [junit4]   2> 1926524 INFO  (qtp1370664619-16325) [n:127.0.0.1:40382_solr c:testschemaapi s:shard1  x:testschemaapi_shard1_replica2] o.a.s.c.c.ZkStateReader Add data for [testschemaapi] ver [0]
   [junit4]   2> 1926524 INFO  (qtp1996060622-16328) [n:127.0.0.1:36724_solr c:testschemaapi s:shard1  x:testschemaapi_shard1_replica1] o.a.s.c.c.ZkStateReader Add data for [testschemaapi] ver [0]
   [junit4]   2> 1926524 INFO  (qtp1370664619-16325) [n:127.0.0.1:40382_solr c:testschemaapi s:shard1  x:testschemaapi_shard1_replica2] o.a.s.c.ZkController look for our core node name
   [junit4]   2> 1926524 INFO  (qtp1996060622-16328) [n:127.0.0.1:36724_solr c:testschemaapi s:shard1  x:testschemaapi_shard1_replica1] o.a.s.c.ZkController look for our core node name
   [junit4]   2> 1926525 INFO  (OverseerStateUpdate-95875837753229318-127.0.0.1:40382_solr-n_0000000000) [n:127.0.0.1:40382_solr    ] o.a.s.c.Overseer processMessage: queueSize: 2, message = {
   [junit4]   2>   "core":"testschemaapi_shard1_replica2",
   [junit4]   2>   "roles":null,
   [junit4]   2>   "base_url":"http://127.0.0.1:40382/solr",
   [junit4]   2>   "node_name":"127.0.0.1:40382_solr",
   [junit4]   2>   "numShards":"1",
   [junit4]   2>   "state":"down",
   [junit4]   2>   "shard":"shard1",
   [junit4]   2>   "collection":"testschemaapi",
   [junit4]   2>   "operation":"state"} current state version: 0
   [junit4]   2> 1926525 INFO  (OverseerStateUpdate-95875837753229318-127.0.0.1:40382_solr-n_0000000000) [n:127.0.0.1:40382_solr    ] o.a.s.c.o.ReplicaMutator Update state numShards=1 message={
   [junit4]   2>   "core":"testschemaapi_shard1_replica2",
   [junit4]   2>   "roles":null,
   [junit4]   2>   "base_url":"http://127.0.0.1:40382/solr",
   [junit4]   2>   "node_name":"127.0.0.1:40382_solr",
   [junit4]   2>   "numShards":"1",
   [junit4]   2>   "state":"down",
   [junit4]   2>   "shard":"shard1",
   [junit4]   2>   "collection":"testschemaapi",
   [junit4]   2>   "operation":"state"}
   [junit4]   2> 1926626 INFO  (OverseerStateUpdate-95875837753229318-127.0.0.1:40382_solr-n_0000000000) [n:127.0.0.1:40382_solr    ] o.a.s.c.o.ZkStateWriter going to update_collection /collections/testschemaapi/state.json version: 0
   [junit4]   2> 1926626 INFO  (zkCallback-2748-thread-1-processing-n:127.0.0.1:40382_solr) [n:127.0.0.1:40382_solr    ] o.a.s.c.c.ZkStateReader A cluster state change: [WatchedEvent state:SyncConnected type:NodeDataChanged path:/collections/testschemaapi/state.json] for collection [testschemaapi] has occurred - updating... (live nodes size: [2])
   [junit4]   2> 1926626 INFO  (zkCallback-2747-thread-1-processing-n:127.0.0.1:36724_solr) [n:127.0.0.1:36724_solr    ] o.a.s.c.c.ZkStateReader A cluster state change: [WatchedEvent state:SyncConnected type:NodeDataChanged path:/collections/testschemaapi/state.json] for collection [testschemaapi] has occurred - updating... (live nodes size: [2])
   [junit4]   2> 1926626 INFO  (zkCallback-2748-thread-1-processing-n:127.0.0.1:40382_solr) [n:127.0.0.1:40382_solr    ] o.a.s.c.c.ZkStateReader Updating data for [testschemaapi] from [0] to [1]
   [junit4]   2> 1926626 INFO  (zkCallback-2747-thread-1-processing-n:127.0.0.1:36724_solr) [n:127.0.0.1:36724_solr    ] o.a.s.c.c.ZkStateReader Updating data for [testschemaapi] from [0] to [1]
   [junit4]   2> 1927524 INFO  (qtp1370664619-16325) [n:127.0.0.1:40382_solr c:testschemaapi s:shard1  x:testschemaapi_shard1_replica2] o.a.s.c.ZkController waiting to find shard id in clusterstate for testschemaapi_shard1_replica2
   [junit4]   2> 1927524 INFO  (qtp1370664619-16325) [n:127.0.0.1:40382_solr c:testschemaapi s:shard1  x:testschemaapi_shard1_replica2] o.a.s.c.ZkController Check for collection zkNode:testschemaapi
   [junit4]   2> 1927524 INFO  (qtp1996060622-16328) [n:127.0.0.1:36724_solr c:testschemaapi s:shard1  x:testschemaapi_shard1_replica1] o.a.s.c.ZkController waiting to find shard id in clusterstate for testschemaapi_shard1_replica1
   [junit4]   2> 1927525 INFO  (qtp1996060622-16328) [n:127.0.0.1:36724_solr c:testschemaapi s:shard1  x:testschemaapi_shard1_replica1] o.a.s.c.ZkController Check for collection zkNode:testschemaapi
   [junit4]   2> 1927525 INFO  (qtp1370664619-16325) [n:127.0.0.1:40382_solr c:testschemaapi s:shard1  x:testschemaapi_shard1_replica2] o.a.s.c.ZkController Collection zkNode exists
   [junit4]   2> 1927525 INFO  (qtp1370664619-16325) [n:127.0.0.1:40382_solr c:testschemaapi s:shard1  x:testschemaapi_shard1_replica2] o.a.s.c.c.ZkStateReader Load collection config from: [/collections/testschemaapi]
   [junit4]   2> 1927525 INFO  (qtp1996060622-16328) [n:127.0.0.1:36724_solr c:testschemaapi s:shard1  x:testschemaapi_shard1_replica1] o.a.s.c.ZkController Collection zkNode exists
   [junit4]   2> 1927525 INFO  (qtp1996060622-16328) [n:127.0.0.1:36724_solr c:testschemaapi s:shard1  x:testschemaapi_shard1_replica1] o.a.s.c.c.ZkStateReader Load collection config from: [/collections/testschemaapi]
   [junit4]   2> 1927525 INFO  (qtp1370664619-16325) [n:127.0.0.1:40382_solr c:testschemaapi s:shard1  x:testschemaapi_shard1_replica2] o.a.s.c.c.ZkStateReader path=[/collections/testschemaapi] [configName]=[conf1] specified config exists in ZooKeeper
   [junit4]   2> 1927525 INFO  (qtp1370664619-16325) [n:127.0.0.1:40382_solr c:testschemaapi s:shard1  x:testschemaapi_shard1_replica2] o.a.s.c.SolrResourceLoader new SolrResourceLoader for directory: '/home/jenkins/workspace/Lucene-Solr-6.x-Linux/solr/build/solr-core/test/J2/temp/solr.schema.TestManagedSchemaAPI_CFF8C6C8A7A48C6A-001/tempDir-001/node2/testschemaapi_shard1_replica2'
   [junit4]   2> 1927525 INFO  (qtp1996060622-16328) [n:127.0.0.1:36724_solr c:testschemaapi s:shard1  x:testschemaapi_shard1_replica1] o.a.s.c.c.ZkStateReader path=[/collections/testschemaapi] [configName]=[conf1] specified config exists in ZooKeeper
   [junit4]   2> 1927526 INFO  (qtp1370664619-16325) [n:127.0.0.1:40382_solr c:testschemaapi s:shard1  x:testschemaapi_shard1_replica2] o.a.s.c.SolrResourceLoader JNDI not configured for solr (NoInitialContextEx)
   [junit4]   2> 1927526 INFO  (qtp1996060622-16328) [n:127.0.0.1:36724_solr c:testschemaapi s:shard1  x:testschemaapi_shard1_replica1] o.a.s.c.SolrResourceLoader new SolrResourceLoader for directory: '/home/jenkins/workspace/Lucene-Solr-6.x-Linux/solr/build/solr-core/test/J2/temp/solr.schema.TestManagedSchemaAPI_CFF8C6C8A7A48C6A-001/tempDir-001/node1/testschemaapi_shard1_replica1'
   [junit4]   2> 1927526 INFO  (qtp1370664619-16325) [n:127.0.0.1:40382_solr c:testschemaapi s:shard1  x:testschemaapi_shard1_replica2] o.a.s.c.SolrResourceLoader solr home defaulted to 'solr/' (could not find system property or JNDI)
   [junit4]   2> 1927526 INFO  (qtp1996060622-16328) [n:127.0.0.1:36724_solr c:testschemaapi s:shard1  x:testschemaapi_shard1_replica1] o.a.s.c.SolrResourceLoader JNDI not configured for solr (NoInitialContextEx)
   [junit4]   2> 1927526 INFO  (qtp1996060622-16328) [n:127.0.0.1:36724_solr c:testschemaapi s:shard1  x:testschemaapi_shard1_replica1] o.a.s.c.SolrResourceLoader solr home defaulted to 'solr/' (could not find system property or JNDI)
   [junit4]   2> 1927527 INFO  (qtp1370664619-16325) [n:127.0.0.1:40382_solr c:testschemaapi s:shard1  x:testschemaapi_shard1_replica2] o.a.s.c.Config loaded config solrconfig.xml with version 0 
   [junit4]   2> 1927527 INFO  (qtp1996060622-16328) [n:127.0.0.1:36724_solr c:testschemaapi s:shard1  x:testschemaapi_shard1_replica1] o.a.s.c.Config loaded config solrconfig.xml with version 0 
   [junit4]   2> 1927529 INFO  (qtp1996060622-16328) [n:127.0.0.1:36724_solr c:testschemaapi s:shard1  x:testschemaapi_shard1_replica1] o.a.s.c.SolrConfig current version of requestparams : -1
   [junit4]   2> 1927529 INFO  (qtp1370664619-16325) [n:127.0.0.1:40382_solr c:testschemaapi s:shard1  x:testschemaapi_shard1_replica2] o.a.s.c.SolrConfig current version of requestparams : -1
   [junit4]   2> 1927531 INFO  (qtp1996060622-16328) [n:127.0.0.1:36724_solr c:testschemaapi s:shard1  x:testschemaapi_shard1_replica1] o.a.s.c.SolrConfig Using Lucene MatchVersion: 6.1.0
   [junit4]   2> 1927531 INFO  (qtp1370664619-16325) [n:127.0.0.1:40382_solr c:testschemaapi s:shard1  x:testschemaapi_shard1_replica2] o.a.s.c.SolrConfig Using Lucene MatchVersion: 6.1.0
   [junit4]   2> 1927534 INFO  (qtp1996060622-16328) [n:127.0.0.1:36724_solr c:testschemaapi s:shard1  x:testschemaapi_shard1_replica1] o.a.s.c.SolrConfig Loaded SolrConfig: solrconfig.xml
   [junit4]   2> 1927534 INFO  (qtp1370664619-16325) [n:127.0.0.1:40382_solr c:testschemaapi s:shard1  x:testschemaapi_shard1_replica2] o.a.s.c.SolrConfig Loaded SolrConfig: solrconfig.xml
   [junit4]   2> 1927536 INFO  (qtp1996060622-16328) [n:127.0.0.1:36724_solr c:testschemaapi s:shard1  x:testschemaapi_shard1_replica1] o.a.s.s.IndexSchema [testschemaapi_shard1_replica1] Schema name=minimal
   [junit4]   2> 1927536 INFO  (qtp1370664619-16325) [n:127.0.0.1:40382_solr c:testschemaapi s:shard1  x:testschemaapi_shard1_replica2] o.a.s.s.IndexSchema [testschemaapi_shard1_replica2] Schema name=minimal
   [junit4]   2> 1927538 INFO  (qtp1996060622-16328) [n:127.0.0.1:36724_solr c:testschemaapi s:shard1  x:testschemaapi_shard1_replica1] o.a.s.s.IndexSchema unique key field: id
   [junit4]   2> 1927538 INFO  (qtp1370664619-16325) [n:127.0.0.1:40382_solr c:testschemaapi s:shard1  x:testschemaapi_shard1_replica2] o.a.s.s.IndexSchema unique key field: id
   [junit4]   2> 1927539 INFO  (qtp1996060622-16328) [n:127.0.0.1:36724_solr c:testschemaapi s:shard1  x:testschemaapi_shard1_replica1] o.a.s.c.ConfigSetProperties Did not find ConfigSet properties, assuming default properties: Can't find resource 'configsetprops.json' in classpath or '/configs/conf1', cwd=/home/jenkins/workspace/Lucene-Solr-6.x-Linux/solr/build/solr-core/test/J2
   [junit4]   2> 1927539 INFO  (qtp1370664619-16325) [n:127.0.0.1:40382_solr c:testschemaapi s:shard1  x:testschemaapi_shard1_replica2] o.a.s.c.ConfigSetProperties Did not find ConfigSet properties, assuming default properties: Can't find resource 'configsetprops.json' in classpath or '/configs/conf1', cwd=/home/jenkins/workspace/Lucene-Solr-6.x-Linux/solr/build/solr-core/test/J2
   [junit4]   2> 1927539 INFO  (qtp1996060622-16328) [n:127.0.0.1:36724_solr c:testschemaapi s:shard1  x:testschemaapi_shard1_replica1] o.a.s.c.CoreContainer Creating SolrCore 'testschemaapi_shard1_replica1' using configuration from collection testschemaapi
   [junit4]   2> 1927539 INFO  (qtp1370664619-16325) [n:127.0.0.1:40382_solr c:testschemaapi s:shard1  x:testschemaapi_shard1_replica2] o.a.s.c.CoreContainer Creating SolrCore 'testschemaapi_shard1_replica2' using configuration from collection testschemaapi
   [junit4]   2> 1927539 INFO  (qtp1996060622-16328) [n:127.0.0.1:36724_solr c:testschemaapi s:shard1 r:core_node1 x:testschemaapi_shard1_replica1] o.a.s.c.SolrCore org.apache.solr.core.MockDirectoryFactory
   [junit4]   2> 1927539 INFO  (qtp1370664619-16325) [n:127.0.0.1:40382_solr c:testschemaapi s:shard1 r:core_node2 x:testschemaapi_shard1_replica2] o.a.s.c.SolrCore org.apache.solr.core.MockDirectoryFactory
   [junit4]   2> 1927540 INFO  (qtp1996060622-16328) [n:127.0.0.1:36724_solr c:testschemaapi s:shard1 r:core_node1 x:testschemaapi_shard1_replica1] o.a.s.c.SolrCore [[testschemaapi_shard1_replica1] ] Opening new SolrCore at [/home/jenkins/workspace/Lucene-Solr-6.x-Linux/solr/build/solr-core/test/J2/temp/solr.schema.TestManagedSchemaAPI_CFF8C6C8A7A48C6A-001/tempDir-001/node1/testschemaapi_shard1_replica1], dataDir=[/home/jenkins/workspace/Lucene-Solr-6.x-Linux/solr/build/solr-core/test/J2/temp/solr.schema.TestManagedSchemaAPI_CFF8C6C8A7A48C6A-001/tempDir-001/node1/./testschemaapi_shard1_replica1/data/]
   [junit4]   2> 1927540 INFO  (qtp1370664619-16325) [n:127.0.0.1:40382_solr c:testschemaapi s:shard1 r:core_node2 x:testschemaapi_shard1_replica2] o.a.s.c.SolrCore [[testschemaapi_shard1_replica2] ] Opening new SolrCore at [/home/jenkins/workspace/Lucene-Solr-6.x-Linux/solr/build/solr-core/test/J2/temp/solr.schema.TestManagedSchemaAPI_CFF8C6C8A7A48C6A-001/tempDir-001/node2/testschemaapi_shard1_replica2], dataDir=[/home/jenkins/workspace/Lucene-Solr-6.x-Linux/solr/build/solr-core/test/J2/temp/solr.schema.TestManagedSchemaAPI_CFF8C6C8A7A48C6A-001/tempDir-001/node2/./testschemaapi_shard1_replica2/data/]
   [junit4]   2> 1927540 INFO  (qtp1996060622-16328) [n:127.0.0.1:36724_solr c:testschemaapi s:shard1 r:core_node1 x:testschemaapi_shard1_replica1] o.a.s.c.SolrCore JMX monitoring not detected for core: testschemaapi_shard1_replica1
   [junit4]   2> 1927540 INFO  (qtp1370664619-16325) [n:127.0.0.1:40382_solr c:testschemaapi s:shard1 r:core_node2 x:testschemaapi_shard1_replica2] o.a.s.c.SolrCore JMX monitoring not detected for core: testschemaapi_shard1_replica2
   [junit4]   2> 1927540 INFO  (qtp1996060622-16328) [n:127.0.0.1:36724_solr c:testschemaapi s:shard1 r:core_node1 x:testschemaapi_shard1_replica1] o.a.s.c.CachingDirectoryFactory return new directory for /home/jenkins/workspace/Lucene-Solr-6.x-Linux/solr/build/solr-core/test/J2/temp/solr.schema.TestManagedSchemaAPI_CFF8C6C8A7A48C6A-001/tempDir-001/node1/./testschemaapi_shard1_replica1/data
   [junit4]   2> 1927540 INFO  (qtp1996060622-16328) [n:127.0.0.1:36724_solr c:testschemaapi s:shard1 r:core_node1 x:testschemaapi_shard1_replica1] o.a.s.c.SolrCore New index directory detected: old=null new=/home/jenkins/workspace/Lucene-Solr-6.x-Linux/solr/build/solr-core/test/J2/temp/solr.schema.TestManagedSchemaAPI_CFF8C6C8A7A48C6A-001/tempDir-001/node1/./testschemaapi_shard1_replica1/data/index/
   [junit4]   2> 1927540 INFO  (qtp1370664619-16325) [n:127.0.0.1:40382_solr c:testschemaapi s:shard1 r:core_node2 x:testschemaapi_shard1_replica2] o.a.s.c.CachingDirectoryFactory return new directory for /home/jenkins/workspace/Lucene-Solr-6.x-Linux/solr/build/solr-core/test/J2/temp/solr.schema.TestManagedSchemaAPI_CFF8C6C8A7A48C6A-001/tempDir-001/node2/./testschemaapi_shard1_replica2/data
   [junit4]   2> 1927540 WARN  (qtp1996060622-16328) [n:127.0.0.1:36724_solr c:testschemaapi s:shard1 r:core_node1 x:testschemaapi_shard1_replica1] o.a.s.c.SolrCore [testschemaapi_shard1_replica1] Solr index directory '/home/jenkins/workspace/Lucene-Solr-6.x-Linux/solr/build/solr-core/test/J2/temp/solr.schema.TestManagedSchemaAPI_CFF8C6C8A7A48C6A-001/tempDir-001/node1/./testschemaapi_shard1_replica1/data/index' doesn't exist. Creating new index...
   [junit4]   2> 1927540 INFO  (qtp1370664619-16325) [n:127.0.0.1:40382_solr c:testschemaapi s:shard1 r:core_node2 x:testschemaapi_shard1_replica2] o.a.s.c.SolrCore New index directory detected: old=null new=/home/jenkins/workspace/Lucene-Solr-6.x-Linux/solr/build/solr-core/test/J2/temp/solr.schema.TestManagedSchemaAPI_CFF8C6C8A7A48C6A-001/tempDir-001/node2/./testschemaapi_shard1_replica2/data/index/
   [junit4]   2> 1927541 WARN  (qtp1370664619-16325) [n:127.0.0.1:40382_solr c:testschemaapi s:shard1 r:core_node2 x:testschemaapi_shard1_replica2] o.a.s.c.SolrCore [testschemaapi_shard1_replica2] Solr index directory '/home/jenkins/workspace/Lucene-Solr-6.x-Linux/solr/build/solr-core/test/J2/temp/solr.schema.TestManagedSchemaAPI_CFF8C6C8A7A48C6A-001/tempDir-001/node2/./testschemaapi_shard1_replica2/data/index' doesn't exist. Creating new index...
   [junit4]   2> 1927541 INFO  (qtp1996060622-16328) [n:127.0.0.1:36724_solr c:testschemaapi s:shard1 r:core_node1 x:testschemaapi_shard1_replica1] o.a.s.c.CachingDirectoryFactory return new directory for /home/jenkins/workspace/Lucene-Solr-6.x-Linux/solr/build/solr-core/test/J2/temp/solr.schema.TestManagedSchemaAPI_CFF8C6C8A7A48C6A-001/tempDir-001/node1/./testschemaapi_shard1_replica1/data/index
   [junit4]   2> 1927541 INFO  (qtp1370664619-16325) [n:127.0.0.1:40382_solr c:testschemaapi s:shard1 r:core_node2 x:testschemaapi_shard1_replica2] o.a.s.c.CachingDirectoryFactory return new directory for /home/jenkins/workspace/Lucene-Solr-6.x-Linux/solr/build/solr-core/test/J2/temp/solr.schema.TestManagedSchemaAPI_CFF8C6C8A7A48C6A-001/tempDir-001/node2/./testschemaapi_shard1_replica2/data/index
   [junit4]   2> 1927541 INFO  (qtp1996060622-16328) [n:127.0.0.1:36724_solr c:testschemaapi s:shard1 r:core_node1 x:testschemaapi_shard1_replica1] o.a.s.c.SolrDeletionPolicy SolrDeletionPolicy.onCommit: commits: num=1
   [junit4]   2> 	commit{dir=MockDirectoryWrapper(RAMDirectory@4a94f85 lockFactory=org.apache.lucene.store.SingleInstanceLockFactory@79be2964),segFN=segments_1,generation=1}
   [junit4]   2> 1927541 INFO  (qtp1996060622-16328) [n:127.0.0.1:36724_solr c:testschemaapi s:shard1 r:core_node1 x:testschemaapi_shard1_replica1] o.a.s.c.SolrDeletionPolicy newest commit generation = 1
   [junit4]   2> 1927541 INFO  (qtp1370664619-16325) [n:127.0.0.1:40382_solr c:testschemaapi s:shard1 r:core_node2 x:testschemaapi_shard1_replica2] o.a.s.c.SolrDeletionPolicy SolrDeletionPolicy.onCommit: commits: num=1
   [junit4]   2> 	commit{dir=MockDirectoryWrapper(RAMDirectory@69d75f58 lockFactory=org.apache.lucene.store.SingleInstanceLockFactory@52b31d90),segFN=segments_1,generation=1}
   [junit4]   2> 1927542 INFO  (qtp1370664619-16325) [n:127.0.0.1:40382_solr c:testschemaapi s:shard1 r:core_node2 x:testschemaapi_shard1_replica2] o.a.s.c.SolrDeletionPolicy newest commit generation = 1
   [junit4]   2> 1927542 INFO  (OldIndexDirectoryCleanupThreadForCore-testschemaapi_shard1_replica1) [n:127.0.0.1:36724_solr c:testschemaapi s:shard1 r:core_node1 x:testschemaapi_shard1_replica1] o.a.s.c.SolrCore Looking for old index directories to cleanup for core testschemaapi_shard1_replica1 in /home/jenkins/workspace/Lucene-Solr-6.x-Linux/solr/build/solr-core/test/J2/temp/solr.schema.TestManagedSchemaAPI_CFF8C6C8A7A48C6A-001/tempDir-001/node1/./testschemaapi_shard1_replica1/data/
   [junit4]   2> 1927542 INFO  (OldIndexDirectoryCleanupThreadForCore-testschemaapi_shard1_replica2) [n:127.0.0.1:40382_solr c:testschemaapi s:shard1 r:core_node2 x:testschemaapi_shard1_replica2] o.a.s.c.SolrCore Looking for old index directories to cleanup for core testschemaapi_shard1_replica2 in /home/jenkins/workspace/Lucene-Solr-6.x-Linux/solr/build/solr-core/test/J2/temp/solr.schema.TestManagedSchemaAPI_CFF8C6C8A7A48C6A-001/tempDir-001/node2/./testschemaapi_shard1_replica2/data/
   [junit4]   2> 1927542 WARN  (OldIndexDirectoryCleanupThreadForCore-testschemaapi_shard1_replica1) [n:127.0.0.1:36724_solr c:testschemaapi s:shard1 r:core_node1 x:testschemaapi_shard1_replica1] o.a.s.c.DirectoryFactory /home/jenkins/workspace/Lucene-Solr-6.x-Linux/solr/build/solr-core/test/J2/temp/solr.schema.TestManagedSchemaAPI_CFF8C6C8A7A48C6A-001/tempDir-001/node1/./testschemaapi_shard1_replica1/data/ does not point to a valid data directory; skipping clean-up of old index directories.
   [junit4]   2> 1927542 WARN  (OldIndexDirectoryCleanupThreadForCore-testschemaapi_shard1_replica2) [n:127.0.0.1:40382_solr c:testschemaapi s:shard1 r:core_node2 x:testschemaapi_shard1_replica2] o.a.s.c.DirectoryFactory /home/jenkins/workspace/Lucene-Solr-6.x-Linux/solr/build/solr-core/test/J2/temp/solr.schema.TestManagedSchemaAPI_CFF8C6C8A7A48C6A-001/tempDir-001/node2/./testschemaapi_shard1_replica2/data/ does not point to a valid data directory; skipping clean-up of old index directories.
   [junit4]   2> 1927543 INFO  (qtp1996060622-16328) [n:127.0.0.1:36724_solr c:testschemaapi s:shard1 r:core_node1 x:testschemaapi_shard1_replica1] o.a.s.c.SolrCore no updateRequestProcessorChain defined as default, creating implicit default
   [junit4]   2> 1927543 INFO  (qtp1370664619-16325) [n:127.0.0.1:40382_solr c:testschemaapi s:shard1 r:core_node2 x:testschemaapi_shard1_replica2] o.a.s.c.SolrCore no updateRequestProcessorChain defined as default, creating implicit default
   [junit4]   2> 1927544 INFO  (qtp1996060622-16328) [n:127.0.0.1:36724_solr c:testschemaapi s:shard1 r:core_node1 x:testschemaapi_shard1_replica1] o.a.s.h.l.XMLLoader xsltCacheLifetimeSeconds=60
   [junit4]   2> 1927544 INFO  (qtp1370664619-16325) [n:127.0.0.1:40382_solr c:testschemaapi s:shard1 r:core_node2 x:testschemaapi_shard1_replica2] o.a.s.h.l.XMLLoader xsltCacheLifetimeSeconds=60
   [junit4]   2> 1927544 INFO  (qtp1996060622-16328) [n:127.0.0.1:36724_solr c:testschemaapi s:shard1 r:core_node1 x:testschemaapi_shard1_replica1] o.a.s.h.l.XMLLoader xsltCacheLifetimeSeconds=60
   [junit4]   2> 1927545 INFO  (qtp1370664619-16325) [n:127.0.0.1:40382_solr c:testschemaapi s:shard1 r:core_node2 x:testschemaapi_shard1_replica2] o.a.s.h.l.XMLLoader xsltCacheLifetimeSeconds=60
   [junit4]   2> 1927545 INFO  (qtp1996060622-16328) [n:127.0.0.1:36724_solr c:testschemaapi s:shard1 r:core_node1 x:testschemaapi_shard1_replica1] o.a.s.h.l.XMLLoader xsltCacheLifetimeSeconds=60
   [junit4]   2> 1927545 INFO  (qtp1370664619-16325) [n:127.0.0.1:40382_solr c:testschemaapi s:shard1 r:core_node2 x:testschemaapi_shard1_replica2] o.a.s.h.l.XMLLoader xsltCacheLifetimeSeconds=60
   [junit4]   2> 1927545 INFO  (qtp1996060622-16328) [n:127.0.0.1:36724_solr c:testschemaapi s:shard1 r:core_node1 x:testschemaapi_shard1_replica1] o.a.s.h.l.XMLLoader xsltCacheLifetimeSeconds=60
   [junit4]   2> 1927546 INFO  (qtp1370664619-16325) [n:127.0.0.1:40382_solr c:testschemaapi s:shard1 r:core_node2 x:testschemaapi_shard1_replica2] o.a.s.h.l.XMLLoader xsltCacheLifetimeSeconds=60
   [junit4]   2> 1927546 INFO  (qtp1996060622-16328) [n:127.0.0.1:36724_solr c:testschemaapi s:shard1 r:core_node1 x:testschemaapi_shard1_replica1] o.a.s.c.RequestHandlers Registered paths: /admin/mbeans,/update/csv,/sql,/update/json/docs,/admin/luke,/graph,/export,/select,/admin/segments,/get,/admin/system,/replication,/admin/properties,/config,/stream,/schema,/admin/plugins,/admin/logging,/update/json,/admin/ping,/admin/threads,/update,/admin/file
   [junit4]   2> 1927546 INFO  (qtp1996060622-16328) [n:127.0.0.1:36724_solr c:testschemaapi s:shard1 r:core_node1 x:testschemaapi_shard1_replica1] o.a.s.c.SolrCore Using default statsCache cache: org.apache.solr.search.stats.LocalStatsCache
   [junit4]   2> 1927546 INFO  (qtp1996060622-16328) [n:127.0.0.1:36724_solr c:testschemaapi s:shard1 r:core_node1 x:testschemaapi_shard1_replica1] o.a.s.u.UpdateHandler Using UpdateLog implementation: org.apache.solr.update.UpdateLog
   [junit4]   2> 1927547 INFO  (qtp1996060622-16328) [n:127.0.0.1:36724_solr c:testschemaapi s:shard1 r:core_node1 x:testschemaapi_shard1_replica1] o.a.s.u.UpdateLog Initializing UpdateLog: dataDir=null defaultSyncLevel=FLUSH numRecordsToKeep=100 maxNumLogsToKeep=10 numVersionBuckets=65536
   [junit4]   2> 1927547 INFO  (qtp1370664619-16325) [n:127.0.0.1:40382_solr c:testschemaapi s:shard1 r:core_node2 x:testschemaapi_shard1_replica2] o.a.s.c.RequestHandlers Registered paths: /admin/mbeans,/update/csv,/sql,/update/json/docs,/admin/luke,/graph,/export,/select,/admin/segments,/get,/admin/system,/replication,/admin/properties,/config,/stream,/schema,/admin/plugins,/admin/logging,/update/json,/admin/ping,/admin/threads,/update,/admin/file
   [junit4]   2> 1927547 INFO  (qtp1370664619-16325) [n:127.0.0.1:40382_solr c:testschemaapi s:shard1 r:core_node2 x:testschemaapi_shard1_replica2] o.a.s.c.SolrCore Using default statsCache cache: org.apache.solr.search.stats.LocalStatsCache
   [junit4]   2> 1927547 INFO  (qtp1370664619-16325) [n:127.0.0.1:40382_solr c:testschemaapi s:shard1 r:core_node2 x:testschemaapi_shard1_replica2] o.a.s.u.UpdateHandler Using UpdateLog implementation: org.apache.solr.update.UpdateLog
   [junit4]   2> 1927547 INFO  (qtp1370664619-16325) [n:127.0.0.1:40382_solr c:testschemaapi s:shard1 r:core_node2 x:testschemaapi_shard1_replica2] o.a.s.u.UpdateLog Initializing UpdateLog: dataDir=null defaultSyncLevel=FLUSH numRecordsToKeep=100 maxNumLogsToKeep=10 numVersionBuckets=65536
   [junit4]   2> 1927547 INFO  (qtp1996060622-16328) [n:127.0.0.1:36724_solr c:testschemaapi s:shard1 r:core_node1 x:testschemaapi_shard1_replica1] o.a.s.u.CommitTracker Hard AutoCommit: disabled
   [junit4]   2> 1927547 INFO  (qtp1996060622-16328) [n:127.0.0.1:36724_solr c:testschemaapi s:shard1 r:core_node1 x:testschemaapi_shard1_replica1] o.a.s.u.CommitTracker Soft AutoCommit: disabled
   [junit4]   2> 1927548 INFO  (qtp1996060622-16328) [n:127.0.0.1:36724_solr c:testschemaapi s:shard1 r:core_node1 x:testschemaapi_shard1_replica1] o.a.s.c.SolrDeletionPolicy SolrDeletionPolicy.onInit: commits: num=1
   [junit4]   2> 	commit{dir=MockDirectoryWrapper(RAMDirectory@4a94f85 lockFactory=org.apache.lucene.store.SingleInstanceLockFactory@79be2964),segFN=segments_1,generation=1}
   [junit4]   2> 1927548 INFO  (qtp1996060622-16328) [n:127.0.0.1:36724_solr c:testschemaapi s:shard1 r:core_node1 x:testschemaapi_shard1_replica1] o.a.s.c.SolrDeletionPolicy newest commit generation = 1
   [junit4]   2> 1927548 INFO  (qtp1996060622-16328) [n:127.0.0.1:36724_solr c:testschemaapi s:shard1 r:core_node1 x:testschemaapi_shard1_replica1] o.a.s.s.SolrIndexSearcher Opening [Searcher@3d1b2d96[testschemaapi_shard1_replica1] main]
   [junit4]   2> 1927548 INFO  (qtp1996060622-16328) [n:127.0.0.1:36724_solr c:testschemaapi s:shard1 r:core_node1 x:testschemaapi_shard1_replica1] o.a.s.c.c.ZkStateReader Load collection config from: [/collections/testschemaapi]
   [junit4]   2> 1927548 INFO  (qtp1370664619-16325) [n:127.0.0.1:40382_solr c:testschemaapi s:shard1 r:core_node2 x:testschemaapi_shard1_replica2] o.a.s.u.CommitTracker Hard AutoCommit: disabled
   [junit4]   2> 1927548 INFO  (qtp1370664619-16325) [n:127.0.0.1:40382_solr c:testschemaapi s:shard1 r:core_node2 x:testschemaapi_shard1_replica2] o.a.s.u.CommitTracker Soft AutoCommit: disabled
   [junit4]   2> 1927548 INFO  (qtp1996060622-16328) [n:127.0.0.1:36724_solr c:testschemaapi s:shard1 r:core_node1 x:testschemaapi_shard1_replica1] o.a.s.c.c.ZkStateReader path=[/collections/testschemaapi] [configName]=[conf1] specified config exists in ZooKeeper
   [junit4]   2> 1927548 INFO  (qtp1996060622-16328) [n:127.0.0.1:36724_solr c:testschemaapi s:shard1 r:core_node1 x:testschemaapi_shard1_replica1] o.a.s.r.ManagedResourceStorage Setting up ZooKeeper-based storage for the RestManager with znodeBase: /configs/conf1
   [junit4]   2> 1927548 INFO  (qtp1370664619-16325) [n:127.0.0.1:40382_solr c:testschemaapi s:shard1 r:core_node2 x:testschemaapi_shard1_replica2] o.a.s.c.SolrDeletionPolicy SolrDeletionPolicy.onInit: commits: num=1
   [junit4]   2> 	commit{dir=MockDirectoryWrapper(RAMDirectory@69d75f58 lockFactory=org.apache.lucene.store.SingleInstanceLockFactory@52b31d90),segFN=segments_1,generation=1}
   [junit4]   2> 1927548 INFO  (qtp1370664619-16325) [n:127.0.0.1:40382_solr c:testschemaapi s:shard1 r:core_node2 x:testschemaapi_shard1_replica2] o.a.s.c.SolrDeletionPolicy newest commit generation = 1
   [junit4]   2> 1927548 INFO  (qtp1996060622-16328) [n:127.0.0.1:36724_solr c:testschemaapi s:shard1 r:core_node1 x:testschemaapi_shard1_replica1] o.a.s.r.ManagedResourceStorage Configured ZooKeeperStorageIO with znodeBase: /configs/conf1
   [junit4]   2> 1927548 INFO  (qtp1370664619-16325) [n:127.0.0.1:40382_solr c:testschemaapi s:shard1 r:core_node2 x:testschemaapi_shard1_replica2] o.a.s.s.SolrIndexSearcher Opening [Searcher@44723593[testschemaapi_shard1_replica2] main]
   [junit4]   2> 1927548 INFO  (qtp1996060622-16328) [n:127.0.0.1:36724_solr c:testschemaapi s:shard1 r:core_node1 x:testschemaapi_shard1_replica1] o.a.s.r.RestManager Initializing RestManager with initArgs: {}
   [junit4]   2> 1927548 INFO  (qtp1370664619-16325) [n:127.0.0.1:40382_solr c:testschemaapi s:shard1 r:core_node2 x:testschemaapi_shard1_replica2] o.a.s.c.c.ZkStateReader Load collection config from: [/collections/testschemaapi]
   [junit4]   2> 1927548 INFO  (qtp1996060622-16328) [n:127.0.0.1:36724_solr c:testschemaapi s:shard1 r:core_node1 x:testschemaapi_shard1_replica1] o.a.s.r.ManagedResourceStorage Reading _rest_managed.json using ZooKeeperStorageIO:path=/configs/conf1
   [junit4]   2> 1927549 INFO  (qtp1996060622-16328) [n:127.0.0.1:36724_solr c:testschemaapi s:shard1 r:core_node1 x:testschemaapi_shard1_replica1] o.a.s.r.ManagedResourceStorage No data found for znode /configs/conf1/_rest_managed.json
   [junit4]   2> 1927549 INFO  (qtp1996060622-16328) [n:127.0.0.1:36724_solr c:testschemaapi s:shard1 r:core_node1 x:testschemaapi_shard1_replica1] o.a.s.r.ManagedResourceStorage Loaded null at path _rest_managed.json using ZooKeeperStorageIO:path=/configs/conf1
   [junit4]   2> 1927549 INFO  (qtp1370664619-16325) [n:127.0.0.1:40382_solr c:testschemaapi s:shard1 r:core_node2 x:testschemaapi_shard1_replica2] o.a.s.c.c.ZkStateReader path=[/collections/testschemaapi] [configName]=[conf1] specified config exists in ZooKeeper
   [junit4]   2> 1927549 INFO  (qtp1996060622-16328) [n:127.0.0.1:36724_solr c:testschemaapi s:shard1 r:core_node1 x:testschemaapi_shard1_replica1] o.a.s.r.RestManager Initializing 0 registered ManagedResources
   [junit4]   2> 1927549 INFO  (qtp1370664619-16325) [n:127.0.0.1:40382_solr c:testschemaapi s:shard1 r:core_node2 x:testschemaapi_shard1_replica2] o.a.s.r.ManagedResourceStorage Setting up ZooKeeper-based storage for the RestManager with znodeBase: /configs/conf1
   [junit4]   2> 1927549 INFO  (qtp1996060622-16328) [n:127.0.0.1:36724_solr c:testschemaapi s:shard1 r:core_node1 x:testschemaapi_shard1_replica1] o.a.s.s.ZkIndexSchemaReader Creating ZooKeeper watch for the managed schema at /configs/conf1/managed-schema
   [junit4]   2> 1927550 INFO  (qtp1370664619-16325) [n:127.0.0.1:40382_solr c:testschemaapi s:shard1 r:core_node2 x:testschemaapi_shard1_replica2] o.a.s.r.ManagedResourceStorage Configured ZooKeeperStorageIO with znodeBase: /configs/conf1
   [junit4]   2> 1927550 INFO  (qtp1370664619-16325) [n:127.0.0.1:40382_solr c:testschemaapi s:shard1 r:core_node2 x:testschemaapi_shard1_replica2] o.a.s.r.RestManager Initializing RestManager with initArgs: {}
   [junit4]   2> 1927550 INFO  (qtp1370664619-16325) [n:127.0.0.1:40382_solr c:testschemaapi s:shard1 r:core_node2 x:testschemaapi_shard1_replica2] o.a.s.r.ManagedResourceStorage Reading _rest_managed.json using ZooKeeperStorageIO:path=/configs/conf1
   [junit4]   2> 1927550 INFO  (qtp1996060622-16328) [n:127.0.0.1:36724_solr c:testschemaapi s:shard1 r:core_node1 x:testschemaapi_shard1_replica1] o.a.s.c.ZkController Added new OnReconnect listener ZkIndexSchemaReader: /configs/conf1/managed-schema, uniqueCoreId: testschemaapi_shard1_replica1:407346786199582
   [junit4]   2> 1927550 INFO  (qtp1996060622-16328) [n:127.0.0.1:36724_solr c:testschemaapi s:shard1 r:core_node1 x:testschemaapi_shard1_replica1] o.a.s.h.ReplicationHandler Commits will be reserved for  10000
   [junit4]   2> 1927550 INFO  (qtp1370664619-16325) [n:127.0.0.1:40382_solr c:testschemaapi s:shard1 r:core_node2 x:testschemaapi_shard1_replica2] o.a.s.r.ManagedResourceStorage No data found for znode /configs/conf1/_rest_managed.json
   [junit4]   2> 1927550 INFO  (searcherExecutor-7468-thread-1-processing-n:127.0.0.1:36724_solr x:testschemaapi_shard1_replica1 s:shard1 c:testschemaapi r:core_node1) [n:127.0.0.1:36724_solr c:testschemaapi s:shard1 r:core_node1 x:testschemaapi_shard1_replica1] o.a.s.c.SolrCore [testschemaapi_shard1_replica1] Registered new searcher Searcher@3d1b2d96[testschemaapi_shard1_replica1] main{ExitableDirectoryReader(UninvertingDirectoryReader())}
   [junit4]   2> 1927550 INFO  (qtp1370664619-16325) [n:127.0.0.1:40382_solr c:testschemaapi s:shard1 r:core_node2 x:testschemaapi_shard1_replica2] o.a.s.r.ManagedResourceStorage Loaded null at path _rest_managed.json using ZooKeeperStorageIO:path=/configs/conf1
   [junit4]   2> 1927550 INFO  (qtp1996060622-16328) [n:127.0.0.1:36724_solr c:testschemaapi s:shard1 r:core_node1 x:testschemaapi_shard1_replica1] o.a.s.u.UpdateLog Looking up max value of version field to seed version buckets
   [junit4]   2> 1927550 INFO  (qtp1370664619-16325) [n:127.0.0.1:40382_solr c:testschemaapi s:shard1 r:core_node2 x:testschemaapi_shard1_replica2] o.a.s.r.RestManager Initializing 0 registered ManagedResources
   [junit4]   2> 1927551 INFO  (qtp1996060622-16328) [n:127.0.0.1:36724_solr c:testschemaapi s:shard1 r:core_node1 x:testschemaapi_shard1_replica1] o.a.s.u.VersionInfo Refreshing highest value of _version_ for 65536 version buckets from index
   [junit4]   2> 1927551 INFO  (qtp1370664619-16325) [n:127.0.0.1:40382_solr c:testschemaapi s:shard1 r:core_node2 x:testschemaapi_shard1_replica2] o.a.s.s.ZkIndexSchemaReader Creating ZooKeeper watch for the managed schema at /configs/conf1/managed-schema
   [junit4]   2> 1927551 INFO  (qtp1996060622-16328) [n:127.0.0.1:36724_solr c:testschemaapi s:shard1 r:core_node1 x:testschemaapi_shard1_replica1] o.a.s.u.VersionInfo No terms found for _version_, cannot seed version bucket highest value from index
   [junit4]   2> 1927551 INFO  (qtp1996060622-16328) [n:127.0.0.1:36724_solr c:testschemaapi s:shard1 r:core_node1 x:testschemaapi_shard1_replica1] o.a.s.u.UpdateLog Could not find max version in index or recent updates, using new clock 1534013406528405504
   [junit4]   2> 1927551 INFO  (qtp1370664619-16325) [n:127.0.0.1:40382_solr c:testschemaapi s:shard1 r:core_node2 x:testschemaapi_shard1_replica2] o.a.s.c.ZkController Added new OnReconnect listener ZkIndexSchemaReader: /configs/conf1/managed-schema, uniqueCoreId: testschemaapi_shard1_replica2:407346786262900
   [junit4]   2> 1927551 INFO  (qtp1370664619-16325) [n:127.0.0.1:40382_solr c:testschemaapi s:shard1 r:core_node2 x:testschemaapi_shard1_replica2] o.a.s.h.ReplicationHandler Commits will be reserved for  10000
   [junit4]   2> 1927551 INFO  (searcherExecutor-7469-thread-1-processing-n:127.0.0.1:40382_solr x:testschemaapi_shard1_replica2 s:shard1 c:testschemaapi r:core_node2) [n:127.0.0.1:40382_solr c:testschemaapi s:shard1 r:core_node2 x:testschemaapi_shard1_replica2] o.a.s.c.SolrCore [testschemaapi_shard1_replica2] Registered new searcher Searcher@44723593[testschemaapi_shard1_replica2] main{ExitableDirectoryReader(UninvertingDirectoryReader())}
   [junit4]   2> 1927551 INFO  (qtp1370664619-16325) [n:127.0.0.1:40382_solr c:testschemaapi s:shard1 r:core_node2 x:testschemaapi_shard1_replica2] o.a.s.u.UpdateLog Looking up max value of version field to seed version buckets
   [junit4]   2> 1927551 INFO  (qtp1370664619-16325) [n:127.0.0.1:40382_solr c:testschemaapi s:shard1 r:core_node2 x:testschemaapi_shard1_replica2] o.a.s.u.VersionInfo Refreshing highest value of _version_ for 65536 version buckets from index
   [junit4]   2> 1927551 INFO  (qtp1370664619-16325) [n:127.0.0.1:40382_solr c:testschemaapi s:shard1 r:core_node2 x:testschemaapi_shard1_replica2] o.a.s.u.VersionInfo No terms found for _version_, cannot seed version bucket highest value from index
   [junit4]   2> 1927551 INFO  (qtp1370664619-16325) [n:127.0.0.1:40382_solr c:testschemaapi s:shard1 r:core_node2 x:testschemaapi_shard1_replica2] o.a.s.u.UpdateLog Could not find max version in index or recent updates, using new clock 1534013406528405504
   [junit4]   2> 1927553 INFO  (qtp1996060622-16328) [n:127.0.0.1:36724_solr c:testschemaapi s:shard1 r:core_node1 x:testschemaapi_shard1_replica1] o.a.s.u.UpdateLog Took 2.0ms to seed version buckets with highest version 1534013406528405504
   [junit4]   2> 1927553 INFO  (qtp1996060622-16328) [n:127.0.0.1:36724_solr c:testschemaapi s:shard1 r:core_node1 x:testschemaapi_shard1_replica1] o.a.s.c.ZkController watch zkdir /configs/conf1
   [junit4]   2> 1927553 INFO  (qtp1996060622-16328) [n:127.0.0.1:36724_solr c:testschemaapi s:shard1 r:core_node1 x:testschemaapi_shard1_replica1] o.a.s.c.CoreContainer registering core: testschemaapi_shard1_replica1
   [junit4]   2> 1927553 INFO  (qtp1370664619-16325) [n:127.0.0.1:40382_solr c:testschemaapi s:shard1 r:core_node2 x:testschemaapi_shard1_replica2] o.a.s.u.UpdateLog Took 1.0ms to seed version buckets with highest version 1534013406528405504
   [junit4]   2> 1927553 INFO  (qtp1996060622-16328) [n:127.0.0.1:36724_solr c:testschemaapi s:shard1 r:core_node1 x:testschemaapi_shard1_replica1] o.a.s.c.ZkController Register replica - core:testschemaapi_shard1_replica1 address:http://127.0.0.1:36724/solr collection:testschemaapi shard:shard1
   [junit4]   2> 1927553 INFO  (qtp1370664619-16325) [n:127.0.0.1:40382_solr c:testschemaapi s:shard1 r:core_node2 x:testschemaapi_shard1_replica2] o.a.s.c.ZkController watch zkdir /configs/conf1
   [junit4]   2> 1927554 INFO  (qtp1996060622-16328) [n:127.0.0.1:36724_solr c:testschemaapi s:shard1 r:core_node1 x:testschemaapi_shard1_replica1] o.a.s.c.c.SolrZkClient makePath: /collections/testschemaapi/leader_elect/shard1/election
   [junit4]   2> 1927554 INFO  (qtp1370664619-16325) [n:127.0.0.1:40382_solr c:testschemaapi s:shard1 r:core_node2 x:testschemaapi_shard1_replica2] o.a.s.c.CoreContainer registering core: testschemaapi_shard1_replica2
   [junit4]   2> 1927554 INFO  (qtp1370664619-16325) [n:127.0.0.1:40382_solr c:testschemaapi s:shard1 r:core_node2 x:testschemaapi_shard1_replica2] o.a.s.c.ZkController Register replica - core:testschemaapi_shard1_replica2 address:http://127.0.0.1:40382/solr collection:testschemaapi shard:shard1
   [junit4]   2> 1927554 INFO  (qtp1370664619-16325) [n:127.0.0.1:40382_solr c:testschemaapi s:shard1 r:core_node2 x:testschemaapi_shard1_replica2] o.a.s.c.c.SolrZkClient makePath: /collections/testschemaapi/leader_elect/shard1/election
   [junit4]   2> 1927555 INFO  (qtp1996060622-16328) [n:127.0.0.1:36724_solr c:testschemaapi s:shard1 r:core_node1 x:testschemaapi_shard1_replica1] o.a.s.c.LeaderElector Joined leadership election with path: /collections/testschemaapi/leader_elect/shard1/election/95875837753229317-core_node1-n_0000000000
   [junit4]   2> 1927555 INFO  (qtp1370664619-16325) [n:127.0.0.1:40382_solr c:testschemaapi s:shard1 r:core_node2 x:testschemaapi_shard1_replica2] o.a.s.c.LeaderElector Joined leadership election with path: /collections/testschemaapi/leader_elect/shard1/election/95875837753229318-core_node2-n_0000000001
   [junit4]   2> 1927555 INFO  (qtp1996060622-16328) [n:127.0.0.1:36724_solr c:testschemaapi s:shard1 r:core_node1 x:testschemaapi_shard1_replica1] o.a.s.c.ShardLeaderElectionContext Running the leader process for shard=shard1 and weAreReplacement=false and leaderVoteWait=10000
   [junit4]   2> 1927555 INFO  (qtp1370664619-16325) [n:127.0.0.1:40382_solr c:testschemaapi s:shard1 r:core_node2 x:testschemaapi_shard1_replica2] o.a.s.c.LeaderElector Watching path /collections/testschemaapi/leader_elect/shard1/election/95875837753229317-core_node1-n_0000000000 to know if I could be the leader
   [junit4]   2> 1927556 INFO  (qtp1996060622-16328) [n:127.0.0.1:36724_solr c:testschemaapi s:shard1 r:core_node1 x:testschemaapi_shard1_replica1] o.a.s.c.ShardLeaderElectionContext Enough replicas found to continue.
   [junit4]   2> 1927556 INFO  (qtp1996060622-16328) [n:127.0.0.1:36724_solr c:testschemaapi s:shard1 r:core_node1 x:testschemaapi_shard1_replica1] o.a.s.c.ShardLeaderElectionContext I may be the new leader - try and sync
   [junit4]   2> 1927556 INFO  (qtp1996060622-16328) [n:127.0.0.1:36724_solr c:testschemaapi s:shard1 r:core_node1 x:testschemaapi_shard1_replica1] o.a.s.c.SyncStrategy Sync replicas to http://127.0.0.1:36724/solr/testschemaapi_shard1_replica1/
   [junit4]   2> 1927556 INFO  (OverseerStateUpdate-95875837753229318-127.0.0.1:40382_solr-n_0000000000) [n:127.0.0.1:40382_solr    ] o.a.s.c.Overseer processMessage: queueSize: 1, message = {
   [junit4]   2>   "operation":"leader",
   [junit4]   2>   "shard":"shard1",
   [junit4]   2>   "collection":"testschemaapi"} current state version: 0
   [junit4]   2> 1927556 INFO  (qtp1996060622-16328) [n:127.0.0.1:36724_solr c:testschemaapi s:shard1 r:core_node1 x:testschemaapi_shard1_replica1] o.a.s.u.PeerSync PeerSync: core=testschemaapi_shard1_replica1 url=http://127.0.0.1:36724/solr START replicas=[http://127.0.0.1:40382/solr/testschemaapi_shard1_replica2/] nUpdates=100
   [junit4]   2> 1927556 INFO  (qtp1996060622-16328) [n:127.0.0.1:36724_solr c:testschemaapi s:shard1 r:core_node1 x:testschemaapi_shard1_replica1] o.a.s.u.PeerSync PeerSync: core=testschemaapi_shard1_replica1 url=http://127.0.0.1:36724/solr DONE.  We have no versions.  sync failed.
   [junit4]   2> 1927556 INFO  (qtp1996060622-16328) [n:127.0.0.1:36724_solr c:testschemaapi s:shard1 r:core_node1 x:testschemaapi_shard1_replica1] o.a.s.c.SyncStrategy Leader's attempt to sync with shard failed, moving to the next candidate
   [junit4]   2> 1927557 INFO  (qtp1996060622-16328) [n:127.0.0.1:36724_solr c:testschemaapi s:shard1 r:core_node1 x:testschemaapi_shard1_replica1] o.a.s.c.ShardLeaderElectionContext We failed sync, but we have no versions - we can't sync in that case - we were active before, so become leader anyway
   [junit4]   2> 1927558 INFO  (qtp1996060622-16328) [n:127.0.0.1:36724_solr c:testschemaapi s:shard1 r:core_node1 x:testschemaapi_shard1_replica1] o.a.s.c.c.SolrZkClient makePath: /collections/testschemaapi/leaders/shard1
   [junit4]   2> 1927559 INFO  (qtp1370664619-16329) [n:127.0.0.1:40382_solr c:testschemaapi s:shard1 r:core_node2 x:testschemaapi_shard1_replica2] o.a.s.c.S.Request [testschemaapi_shard1_replica2]  webapp=/solr path=/get params={distrib=false&qt=/get&fingerprint=false&getVersions=100&wt=javabin&version=2} status=0 QTime=0
   [junit4]   2> 1927559 INFO  (qtp1996060622-16328) [n:127.0.0.1:36724_solr c:testschemaapi s:shard1 r:core_node1 x:testschemaapi_shard1_replica1] o.a.s.c.ShardLeaderElectionContextBase Creating leader registration node /collections/testschemaapi/leaders/shard1/leader after winning as /collections/testschemaapi/leader_elect/shard1/election/95875837753229317-core_node1-n_0000000000
   [junit4]   2> 1927560 INFO  (qtp1996060622-16328) [n:127.0.0.1:36724_solr c:testschemaapi s:shard1 r:core_node1 x:testschemaapi_shard1_replica1] o.a.s.c.ShardLeaderElectionContext I am the new leader: http://127.0.0.1:36724/solr/testschemaapi_shard1_replica1/ shard1
   [junit4]   2> 1927560 INFO  (OverseerStateUpdate-95875837753229318-127.0.0.1:40382_solr-n_0000000000) [n:127.0.0.1:40382_solr    ] o.a.s.c.Overseer processMessage: queueSize: 1, message = {
   [junit4]   2>   "operation":"leader",
   [junit4]   2>   "shard":"shard1",
   [junit4]   2>   "collection":"testschemaapi",
   [junit4]   2>   "base_url":"http://127.0.0.1:36724/solr",
   [junit4]   2>   "core":"testschemaapi_shard1_replica1",
   [junit4]   2>   "state":"active"} current state version: 0
   [junit4]   2> 1927661 INFO  (OverseerStateUpdate-95875837753229318-127.0.0.1:40382_solr-n_0000000000) [n:127.0.0.1:40382_solr    ] o.a.s.c.o.ZkStateWriter going to update_collection /collections/testschemaapi/state.json version: 1
   [junit4]   2> 1927662 INFO  (zkCallback-2748-thread-1-processing-n:127.0.0.1:40382_solr) [n:127.0.0.1:40382_solr    ] o.a.s.c.c.ZkStateReader A cluster state change: [WatchedEvent state:SyncConnected type:NodeDataChanged path:/collections/testschemaapi/state.json] for collection [testschemaapi] has occurred - updating... (live nodes size: [2])
   [junit4]   2> 1927662 INFO  (zkCallback-2747-thread-1-processing-n:127.0.0.1:36724_solr) [n:127.0.0.1:36724_solr    ] o.a.s.c.c.ZkStateReader A cluster state change: [WatchedEvent state:SyncConnected type:NodeDataChanged path:/collections/testschemaapi/state.json] for collection [testschemaapi] has occurred - updating... (live nodes size: [2])
   [junit4]   2> 1927662 INFO  (zkCallback-2748-thread-1-processing-n:127.0.0.1:40382_solr) [n:127.0.0.1:40382_solr    ] o.a.s.c.c.ZkStateReader Updating data for [testschemaapi] from [1] to [2]
   [junit4]   2> 1927662 INFO  (zkCallback-2747-thread-1-processing-n:127.0.0.1:36724_solr) [n:127.0.0.1:36724_solr    ] o.a.s.c.c.ZkStateReader Updating data for [testschemaapi] from [1] to [2]
   [junit4]   2> 1927711 INFO  (qtp1996060622-16328) [n:127.0.0.1:36724_solr c:testschemaapi s:shard1 r:core_node1 x:testschemaapi_shard1_replica1] o.a.s.c.ZkController We are http://127.0.0.1:36724/solr/testschemaapi_shard1_replica1/ and leader is http://127.0.0.1:36724/solr/testschemaapi_shard1_replica1/
   [junit4]   2> 1927711 INFO  (qtp1996060622-16328) [n:127.0.0.1:36724_solr c:testschemaapi s:shard1 r:core_node1 x:testschemaapi_shard1_replica1] o.a.s.c.ZkController No LogReplay needed for core=testschemaapi_shard1_replica1 baseURL=http://127.0.0.1:36724/solr
   [junit4]   2> 1927711 INFO  (qtp1996060622-16328) [n:127.0.0.1:36724_solr c:testschemaapi s:shard1 r:core_node1 x:testschemaapi_shard1_replica1] o.a.s.c.ZkController I am the leader, no recovery necessary
   [junit4]   2> 1927711 INFO  (qtp1996060622-16328) [n:127.0.0.1:36724_solr c:testschemaapi s:shard1 r:core_node1 x:testschemaapi_shard1_replica1] o.a.s.c.ZkController publishing state=active
   [junit4]   2> 1927712 INFO  (OverseerStateUpdate-95875837753229318-127.0.0.1:40382_solr-n_0000000000) [n:127.0.0.1:40382_solr    ] o.a.s.c.Overseer processMessage: queueSize: 1, message = {
   [junit4]   2>   "core":"testschemaapi_shard1_replica1",
   [junit4]   2>   "core_node_name":"core_node1",
   [junit4]   2>   "roles":null,
   [junit4]   2>   "base_url":"http://127.0.0.1:36724/solr",
   [junit4]   2>   "node_name":"127.0.0.1:36724_solr",
   [junit4]   2>   "numShards":"1",
   [junit4]   2>   "state":"active",
   [junit4]   2>   "shard":"shard1",
   [junit4]   2>   "collection":"testschemaapi",
   [junit4]   2>   "operation":"state"} current state version: 0
   [junit4]   2> 1927712 INFO  (OverseerStateUpdate-95875837753229318-127.0.0.1:40382_solr-n_0000000000) [n:127.0.0.1:40382_solr    ] o.a.s.c.o.ReplicaMutator Update state numShards=1 message={
   [junit4]   2>   "core":"testschemaapi_shard1_replica1",
   [junit4]   2>   "core_node_name":"core_node1",
   [junit4]   2>   "roles":null,
   [junit4]   2>   "base_url":"http://127.0.0.1:36724/solr",
   [junit4]   2>   "node_name":"127.0.0.1:36724_solr",
   [junit4]   2>   "numShards":"1",
   [junit4]   2>   "state":"active",
   [junit4]   2>   "shard":"shard1",
   [junit4]   2>   "collection":"testschemaapi",
   [junit4]   2>   "operation":"state"}
   [junit4]   2> 1927712 INFO  (qtp1996060622-16328) [n:127.0.0.1:36724_solr c:testschemaapi s:shard1 r:core_node1 x:testschemaapi_shard1_replica1] o.a.s.s.HttpSolrCall [admin] webapp=null path=/admin/cores params={qt=/admin/cores&collection.configName=conf1&name=testschemaapi_shard1_replica1&action=CREATE&numShards=1&collection=testschemaapi&shard=shard1&wt=javabin&version=2} status=0 QTime=1190
   [junit4]   2> 1927813 INFO  (OverseerStateUpdate-95875837753229318-127.0.0.1:40382_solr-n_0000000000) [n:127.0.0.1:40382_solr    ] o.a.s.c.o.ZkStateWriter going to update_collection /collections/testschemaapi/state.json version: 2
   [junit4]   2> 1927813 INFO  (zkCallback-2748-thread-1-processing-n:127.0.0.1:40382_solr) [n:127.0.0.1:40382_solr    ] o.a.s.c.c.ZkStateReader A cluster state change: [WatchedEvent state:SyncConnected type:NodeDataChanged path:/collections/testschemaapi/state.json] for collection [testschemaapi] has occurred - updating... (live nodes size: [2])
   [junit4]   2> 1927813 INFO  (zkCallback-2747-thread-1-processing-n:127.0.0.1:36724_solr) [n:127.0.0.1:36724_solr    ] o.a.s.c.c.ZkStateReader A cluster state change: [WatchedEvent state:SyncConnected type:NodeDataChanged path:/collections/testschemaapi/state.json] for collection [testschemaapi] has occurred - updating... (live nodes size: [2])
   [junit4]   2> 1927814 INFO  (zkCallback-2747-thread-1-processing-n:127.0.0.1:36724_solr) [n:127.0.0.1:36724_solr    ] o.a.s.c.c.ZkStateReader Updating data for [testschemaapi] from [2] to [3]
   [junit4]   2> 1927814 INFO  (zkCallback-2748-thread-1-processing-n:127.0.0.1:40382_solr) [n:127.0.0.1:40382_solr    ] o.a.s.c.c.ZkStateReader Updating data for [testschemaapi] from [2] to [3]
   [junit4]   2> 1928558 INFO  (qtp1370664619-16325) [n:127.0.0.1:40382_solr c:testschemaapi s:shard1 r:core_node2 x:testschemaapi_shard1_replica2] o.a.s.c.ZkController We are http://127.0.0.1:40382/solr/testschemaapi_shard1_replica2/ and leader is http://127.0.0.1:36724/solr/testschemaapi_shard1_replica1/
   [junit4]   2> 1928559 INFO  (qtp1370664619-16325) [n:127.0.0.1:40382_solr c:testschemaapi s:shard1 r:core_node2 x:testschemaapi_shard1_replica2] o.a.s.c.ZkController No LogReplay needed for core=testschemaapi_shard1_replica2 baseURL=http://127.0.0.1:40382/solr
   [junit4]   2> 1928559 INFO  (qtp1370664619-16325) [n:127.0.0.1:40382_solr c:testschemaapi s:shard1 r:core_node2 x:testschemaapi_shard1_replica2] o.a.s.c.ZkController Core needs to recover:testschemaapi_shard1_replica2
   [junit4]   2> 1928559 INFO  (updateExecutor-2741-thread-1-processin

[...truncated too long message...]

/solr-core/test/J2/temp/solr.schema.TestManagedSchemaAPI_CFF8C6C8A7A48C6A-001/tempDir-001/node1/./testschemaapi_shard1_replica1/data [CachedDir<<refCount=0;path=/home/jenkins/workspace/Lucene-Solr-6.x-Linux/solr/build/solr-core/test/J2/temp/solr.schema.TestManagedSchemaAPI_CFF8C6C8A7A48C6A-001/tempDir-001/node1/./testschemaapi_shard1_replica1/data;done=false>>]
   [junit4]   2> 1937795 INFO  (Thread-5392) [n:127.0.0.1:36724_solr c:testschemaapi s:shard1 r:core_node1 x:testschemaapi_shard1_replica1] o.a.s.c.CachingDirectoryFactory Closing directory, CoreContainer#isShutdown=true
   [junit4]   2> 1937795 INFO  (Thread-5392) [n:127.0.0.1:36724_solr c:testschemaapi s:shard1 r:core_node1 x:testschemaapi_shard1_replica1] o.a.s.c.CachingDirectoryFactory Closing directory: /home/jenkins/workspace/Lucene-Solr-6.x-Linux/solr/build/solr-core/test/J2/temp/solr.schema.TestManagedSchemaAPI_CFF8C6C8A7A48C6A-001/tempDir-001/node1/./testschemaapi_shard1_replica1/data
   [junit4]   2> 1937795 INFO  (Thread-5392) [n:127.0.0.1:36724_solr c:testschemaapi s:shard1 r:core_node1 x:testschemaapi_shard1_replica1] o.a.s.c.CachingDirectoryFactory looking to close /home/jenkins/workspace/Lucene-Solr-6.x-Linux/solr/build/solr-core/test/J2/temp/solr.schema.TestManagedSchemaAPI_CFF8C6C8A7A48C6A-001/tempDir-001/node1/./testschemaapi_shard1_replica1/data/index [CachedDir<<refCount=0;path=/home/jenkins/workspace/Lucene-Solr-6.x-Linux/solr/build/solr-core/test/J2/temp/solr.schema.TestManagedSchemaAPI_CFF8C6C8A7A48C6A-001/tempDir-001/node1/./testschemaapi_shard1_replica1/data/index;done=false>>]
   [junit4]   2> 1937795 INFO  (Thread-5392) [n:127.0.0.1:36724_solr c:testschemaapi s:shard1 r:core_node1 x:testschemaapi_shard1_replica1] o.a.s.c.CachingDirectoryFactory Closing directory, CoreContainer#isShutdown=true
   [junit4]   2> 1937795 INFO  (Thread-5392) [n:127.0.0.1:36724_solr c:testschemaapi s:shard1 r:core_node1 x:testschemaapi_shard1_replica1] o.a.s.c.CachingDirectoryFactory Closing directory: /home/jenkins/workspace/Lucene-Solr-6.x-Linux/solr/build/solr-core/test/J2/temp/solr.schema.TestManagedSchemaAPI_CFF8C6C8A7A48C6A-001/tempDir-001/node1/./testschemaapi_shard1_replica1/data/index
   [junit4]   2> 1937795 WARN  (Thread-5392) [n:127.0.0.1:36724_solr c:testschemaapi s:shard1 r:core_node1 x:testschemaapi_shard1_replica1] o.a.s.c.ZkController listener throws error
   [junit4]   2> org.apache.solr.common.SolrException: Unable to reload core [testschemaapi_shard1_replica1]
   [junit4]   2> 	at org.apache.solr.core.CoreContainer.reload(CoreContainer.java:921)
   [junit4]   2> 	at org.apache.solr.core.SolrCore.lambda$getConfListener$6(SolrCore.java:2490)
   [junit4]   2> 	at org.apache.solr.cloud.ZkController$4.run(ZkController.java:2423)
   [junit4]   2> Caused by: org.apache.solr.common.SolrException: Could not find config name for collection:testschemaapi
   [junit4]   2> 	at org.apache.solr.core.SolrCore.<init>(SolrCore.java:773)
   [junit4]   2> 	at org.apache.solr.core.SolrCore.reload(SolrCore.java:462)
   [junit4]   2> 	at org.apache.solr.core.CoreContainer.reload(CoreContainer.java:915)
   [junit4]   2> 	... 2 more
   [junit4]   2> Caused by: org.apache.solr.common.SolrException: Could not find config name for collection:testschemaapi
   [junit4]   2> 	at org.apache.solr.rest.ManagedResourceStorage.newStorageIO(ManagedResourceStorage.java:101)
   [junit4]   2> 	at org.apache.solr.core.SolrCore.initRestManager(SolrCore.java:2285)
   [junit4]   2> 	at org.apache.solr.core.SolrCore.<init>(SolrCore.java:749)
   [junit4]   2> 	... 4 more
   [junit4]   2> NOTE: test params are: codec=CheapBastard, sim=ClassicSimilarity, locale=hi-IN, timezone=Asia/Baghdad
   [junit4]   2> NOTE: Linux 4.4.0-21-generic amd64/Oracle Corporation 1.8.0_92 (64-bit)/cpus=12,threads=1,free=92389136,total=536870912
   [junit4]   2> NOTE: All tests run in this JVM: [DocValuesMultiTest, TestSimpleQParserPlugin, SuggesterWFSTTest, AtomicUpdatesTest, TestJmxIntegration, CdcrRequestHandlerTest, TestManagedStopFilterFactory, SuggestComponentTest, TestPivotHelperCode, HLLUtilTest, OverriddenZkACLAndCredentialsProvidersTest, TestSolrDeletionPolicy1, TestInfoStreamLogging, BasicAuthIntegrationTest, ConnectionManagerTest, BasicDistributedZk2Test, TestSearchPerf, UnloadDistributedZkTest, DirectUpdateHandlerTest, SampleTest, CurrencyFieldXmlFileTest, TestFuzzyAnalyzedSuggestions, SliceStateTest, ScriptEngineTest, TestPerFieldSimilarity, DistributedVersionInfoTest, LeaderFailoverAfterPartitionTest, SearchHandlerTest, XmlUpdateRequestHandlerTest, TestRTimerTree, TestRebalanceLeaders, TestCryptoKeys, TestNoOpRegenerator, UUIDUpdateProcessorFallbackTest, RemoteQueryErrorTest, TestXIncludeConfig, FieldMutatingUpdateProcessorTest, PrimitiveFieldTypeTest, RuleEngineTest, DistributedQueryComponentCustomSortTest, TestDefaultSearchFieldResource, TestMiniSolrCloudCluster, TestTrieFacet, SimpleFacetsTest, MergeStrategyTest, BinaryUpdateRequestHandlerTest, StatelessScriptUpdateProcessorFactoryTest, TestReload, TestSolrQueryParser, TestConfigSetsAPI, TestExclusionRuleCollectionAccess, EnumFieldTest, CollectionsAPISolrJTest, ZkStateReaderTest, TestSuggestSpellingConverter, TestMiniSolrCloudClusterSSL, TermVectorComponentDistributedTest, BadIndexSchemaTest, UpdateParamsTest, TestSolrConfigHandlerCloud, TestConfigSets, PluginInfoTest, TestCloudManagedSchema, TestSweetSpotSimilarityFactory, TestBlobHandler, AnalyticsMergeStrategyTest, ChangedSchemaMergeTest, TestElisionMultitermQuery, TestSizeLimitedDistributedMap, ResponseHeaderTest, TestPHPSerializedResponseWriter, TestPKIAuthenticationPlugin, TestExtendedDismaxParser, TestFieldTypeResource, TestBlendedInfixSuggestions, BufferStoreTest, OverseerTest, CleanupOldIndexTest, TestIndexSearcher, HighlighterMaxOffsetTest, RequestHandlersTest, TestSolrDynamicMBean, HdfsThreadLeakTest, ShowFileRequestHandlerTest, BaseCdcrDistributedZkTest, HighlighterConfigTest, TestJmxMonitoredMap, SuggesterTSTTest, HdfsCollectionsAPIDistributedZkTest, TestSolrQueryResponse, HardAutoCommitTest, DistribDocExpirationUpdateProcessorTest, LukeRequestHandlerTest, RecoveryZkTest, TestHdfsUpdateLog, DistributedExpandComponentTest, LeaderElectionTest, TestZkChroot, ShardRoutingCustomTest, TestDistributedGrouping, TestRealTimeGet, TestRangeQuery, StatsComponentTest, SolrCmdDistributorTest, TestFiltering, TestValueSourceCache, RequiredFieldsTest, RegexBoostProcessorTest, JSONWriterTest, QueryParsingTest, JsonLoaderTest, TestLFUCache, CdcrVersionReplicationTest, CollectionStateFormat2Test, DeleteInactiveReplicaTest, DistribCursorPagingTest, OverseerRolesTest, SaslZkACLProviderTest, SolrCloudExampleTest, TestCloudBackupRestore, TestCloudInspectUtil, TestCloudPivotFacet, TestConfigSetsAPIExclusivity, TestDistribDocBasedVersion, TestDownShardTolerantSearch, TestLeaderInitiatedRecoveryThread, TestRequestStatusCollectionAPI, TestShortCircuitedRequests, TlogReplayBufferedWhileIndexingTest, TriLevelCompositeIdRoutingTest, DirectoryFactoryTest, ExitableDirectoryReaderTest, TestConfigOverlay, TestConfigSetImmutable, TestReloadAndDeleteDocs, TestSolrConfigHandler, TestReplicationHandlerBackup, TestReqParamsAPI, CoreAdminRequestStatusTest, CoreMergeIndexesAdminHandlerTest, InfoHandlerTest, SecurityConfHandlerTest, SegmentsInfoRequestHandlerTest, DistributedDebugComponentTest, DistributedFacetPivotSmallAdvancedTest, DistributedFacetPivotSmallTest, DistributedFacetPivotWhiteBoxTest, DistributedSuggestComponentTest, TestDistributedStatsComponentCardinality, TestManagedResource, TestRestManager, TestBulkSchemaAPI, TestDynamicFieldResource, TestFieldCollectionResource, TestFieldResource, TestSchemaResource, TestSchemaSimilarityResource, TestSchemaVersionResource, TestSerializedLuceneMatchVersion, TestSolrQueryParserDefaultOperatorResource, BadCopyFieldTest, TestBulkSchemaConcurrent, TestCollationFieldDocValues, TestManagedSchema, TestManagedSchemaAPI]
   [junit4]   2> NOTE: reproduce with: ant test  -Dtestcase=TestManagedSchemaAPI -Dtests.seed=CFF8C6C8A7A48C6A -Dtests.multiplier=3 -Dtests.slow=true -Dtests.locale=hi-IN -Dtests.timezone=Asia/Baghdad -Dtests.asserts=true -Dtests.file.encoding=UTF-8
   [junit4] ERROR   0.00s J2 | TestManagedSchemaAPI (suite) <<<
   [junit4]    > Throwable #1: java.lang.AssertionError: ObjectTracker found 4 object(s) that were not released!!! [MDCAwareThreadPoolExecutor, MockDirectoryWrapper, MockDirectoryWrapper, TransactionLog]
   [junit4]    > 	at __randomizedtesting.SeedInfo.seed([CFF8C6C8A7A48C6A]:0)
   [junit4]    > 	at org.apache.solr.SolrTestCaseJ4.afterClass(SolrTestCaseJ4.java:256)
   [junit4]    > 	at java.lang.Thread.run(Thread.java:745)
   [junit4] Completed [535/598 (1!)] on J2 in 12.62s, 1 test, 1 failure <<< FAILURES!

[...truncated 231 lines...]
BUILD FAILED
/home/jenkins/workspace/Lucene-Solr-6.x-Linux/build.xml:740: The following error occurred while executing this line:
/home/jenkins/workspace/Lucene-Solr-6.x-Linux/build.xml:684: The following error occurred while executing this line:
/home/jenkins/workspace/Lucene-Solr-6.x-Linux/build.xml:59: The following error occurred while executing this line:
/home/jenkins/workspace/Lucene-Solr-6.x-Linux/solr/build.xml:233: The following error occurred while executing this line:
/home/jenkins/workspace/Lucene-Solr-6.x-Linux/solr/common-build.xml:529: The following error occurred while executing this line:
/home/jenkins/workspace/Lucene-Solr-6.x-Linux/lucene/common-build.xml:1457: The following error occurred while executing this line:
/home/jenkins/workspace/Lucene-Solr-6.x-Linux/lucene/common-build.xml:1014: There were test failures: 598 suites (10 ignored), 2419 tests, 1 suite-level error, 115 ignored (71 assumptions) [seed: CFF8C6C8A7A48C6A]

Total time: 58 minutes 41 seconds
Build step 'Invoke Ant' marked build as failure
Archiving artifacts
[WARNINGS] Skipping publisher since build result is FAILURE
Recording test results
Email was triggered for: Failure - Any
Sending email for trigger: Failure - Any



[JENKINS] Lucene-Solr-6.x-Linux (64bit/jdk1.8.0_92) - Build # 621 - Still Failing!

Posted by Policeman Jenkins Server <je...@thetaphi.de>.
Build: http://jenkins.thetaphi.de/job/Lucene-Solr-6.x-Linux/621/
Java: 64bit/jdk1.8.0_92 -XX:-UseCompressedOops -XX:+UseG1GC

1 tests failed.
FAILED:  org.apache.solr.cloud.RecoveryZkTest.test

Error Message:
Captured an uncaught exception in thread: Thread[id=8483, name=updateExecutor-1579-thread-2, state=RUNNABLE, group=TGRP-RecoveryZkTest]

Stack Trace:
com.carrotsearch.randomizedtesting.UncaughtExceptionError: Captured an uncaught exception in thread: Thread[id=8483, name=updateExecutor-1579-thread-2, state=RUNNABLE, group=TGRP-RecoveryZkTest]
	at __randomizedtesting.SeedInfo.seed([1007483C57D3B810:985377E6F92FD5E8]:0)
Caused by: org.apache.solr.common.SolrException: Replica: http://127.0.0.1:41530/collection1/ should have been marked under leader initiated recovery in ZkController but wasn't.
	at __randomizedtesting.SeedInfo.seed([1007483C57D3B810]:0)
	at org.apache.solr.cloud.LeaderInitiatedRecoveryThread.run(LeaderInitiatedRecoveryThread.java:88)
	at org.apache.solr.common.util.ExecutorUtil$MDCAwareThreadPoolExecutor.lambda$execute$0(ExecutorUtil.java:229)
	at java.util.concurrent.ThreadPoolExecutor.runWorker(ThreadPoolExecutor.java:1142)
	at java.util.concurrent.ThreadPoolExecutor$Worker.run(ThreadPoolExecutor.java:617)
	at java.lang.Thread.run(Thread.java:745)




Build Log:
[...truncated 11442 lines...]
   [junit4] Suite: org.apache.solr.cloud.RecoveryZkTest
   [junit4]   2> Creating dataDir: /home/jenkins/workspace/Lucene-Solr-6.x-Linux/solr/build/solr-core/test/J2/temp/solr.cloud.RecoveryZkTest_1007483C57D3B810-001/init-core-data-001
   [junit4]   2> 923918 INFO  (SUITE-RecoveryZkTest-seed#[1007483C57D3B810]-worker) [    ] o.a.s.SolrTestCaseJ4 Randomized ssl (false) and clientAuth (true)
   [junit4]   2> 923919 INFO  (SUITE-RecoveryZkTest-seed#[1007483C57D3B810]-worker) [    ] o.a.s.BaseDistributedSearchTestCase Setting hostContext system property: /
   [junit4]   2> 923920 INFO  (TEST-RecoveryZkTest.test-seed#[1007483C57D3B810]) [    ] o.a.s.c.ZkTestServer STARTING ZK TEST SERVER
   [junit4]   2> 923920 INFO  (Thread-2535) [    ] o.a.s.c.ZkTestServer client port:0.0.0.0/0.0.0.0:0
   [junit4]   2> 923920 INFO  (Thread-2535) [    ] o.a.s.c.ZkTestServer Starting server
   [junit4]   2> 924020 INFO  (TEST-RecoveryZkTest.test-seed#[1007483C57D3B810]) [    ] o.a.s.c.ZkTestServer start zk server on port:39180
   [junit4]   2> 924020 INFO  (TEST-RecoveryZkTest.test-seed#[1007483C57D3B810]) [    ] o.a.s.c.c.SolrZkClient Using default ZkCredentialsProvider
   [junit4]   2> 924021 INFO  (TEST-RecoveryZkTest.test-seed#[1007483C57D3B810]) [    ] o.a.s.c.c.ConnectionManager Waiting for client to connect to ZooKeeper
   [junit4]   2> 924023 INFO  (zkCallback-1569-thread-1) [    ] o.a.s.c.c.ConnectionManager Watcher org.apache.solr.common.cloud.ConnectionManager@277289dc name:ZooKeeperConnection Watcher:127.0.0.1:39180 got event WatchedEvent state:SyncConnected type:None path:null path:null type:None
   [junit4]   2> 924024 INFO  (TEST-RecoveryZkTest.test-seed#[1007483C57D3B810]) [    ] o.a.s.c.c.ConnectionManager Client is connected to ZooKeeper
   [junit4]   2> 924024 INFO  (TEST-RecoveryZkTest.test-seed#[1007483C57D3B810]) [    ] o.a.s.c.c.SolrZkClient Using default ZkACLProvider
   [junit4]   2> 924024 INFO  (TEST-RecoveryZkTest.test-seed#[1007483C57D3B810]) [    ] o.a.s.c.c.SolrZkClient makePath: /solr
   [junit4]   2> 924026 INFO  (TEST-RecoveryZkTest.test-seed#[1007483C57D3B810]) [    ] o.a.s.c.c.SolrZkClient Using default ZkCredentialsProvider
   [junit4]   2> 924027 INFO  (TEST-RecoveryZkTest.test-seed#[1007483C57D3B810]) [    ] o.a.s.c.c.ConnectionManager Waiting for client to connect to ZooKeeper
   [junit4]   2> 924027 INFO  (zkCallback-1570-thread-1) [    ] o.a.s.c.c.ConnectionManager Watcher org.apache.solr.common.cloud.ConnectionManager@ae27d22 name:ZooKeeperConnection Watcher:127.0.0.1:39180/solr got event WatchedEvent state:SyncConnected type:None path:null path:null type:None
   [junit4]   2> 924027 INFO  (TEST-RecoveryZkTest.test-seed#[1007483C57D3B810]) [    ] o.a.s.c.c.ConnectionManager Client is connected to ZooKeeper
   [junit4]   2> 924027 INFO  (TEST-RecoveryZkTest.test-seed#[1007483C57D3B810]) [    ] o.a.s.c.c.SolrZkClient Using default ZkACLProvider
   [junit4]   2> 924027 INFO  (TEST-RecoveryZkTest.test-seed#[1007483C57D3B810]) [    ] o.a.s.c.c.SolrZkClient makePath: /collections/collection1
   [junit4]   2> 924028 INFO  (TEST-RecoveryZkTest.test-seed#[1007483C57D3B810]) [    ] o.a.s.c.c.SolrZkClient makePath: /collections/collection1/shards
   [junit4]   2> 924029 INFO  (TEST-RecoveryZkTest.test-seed#[1007483C57D3B810]) [    ] o.a.s.c.c.SolrZkClient makePath: /collections/control_collection
   [junit4]   2> 924030 INFO  (TEST-RecoveryZkTest.test-seed#[1007483C57D3B810]) [    ] o.a.s.c.c.SolrZkClient makePath: /collections/control_collection/shards
   [junit4]   2> 924030 INFO  (TEST-RecoveryZkTest.test-seed#[1007483C57D3B810]) [    ] o.a.s.c.AbstractZkTestCase put /home/jenkins/workspace/Lucene-Solr-6.x-Linux/solr/core/src/test-files/solr/collection1/conf/solrconfig-tlog.xml to /configs/conf1/solrconfig.xml
   [junit4]   2> 924030 INFO  (TEST-RecoveryZkTest.test-seed#[1007483C57D3B810]) [    ] o.a.s.c.c.SolrZkClient makePath: /configs/conf1/solrconfig.xml
   [junit4]   2> 924031 INFO  (TEST-RecoveryZkTest.test-seed#[1007483C57D3B810]) [    ] o.a.s.c.AbstractZkTestCase put /home/jenkins/workspace/Lucene-Solr-6.x-Linux/solr/core/src/test-files/solr/collection1/conf/schema15.xml to /configs/conf1/schema.xml
   [junit4]   2> 924031 INFO  (TEST-RecoveryZkTest.test-seed#[1007483C57D3B810]) [    ] o.a.s.c.c.SolrZkClient makePath: /configs/conf1/schema.xml
   [junit4]   2> 924032 INFO  (TEST-RecoveryZkTest.test-seed#[1007483C57D3B810]) [    ] o.a.s.c.AbstractZkTestCase put /home/jenkins/workspace/Lucene-Solr-6.x-Linux/solr/core/src/test-files/solr/collection1/conf/solrconfig.snippet.randomindexconfig.xml to /configs/conf1/solrconfig.snippet.randomindexconfig.xml
   [junit4]   2> 924032 INFO  (TEST-RecoveryZkTest.test-seed#[1007483C57D3B810]) [    ] o.a.s.c.c.SolrZkClient makePath: /configs/conf1/solrconfig.snippet.randomindexconfig.xml
   [junit4]   2> 924033 INFO  (TEST-RecoveryZkTest.test-seed#[1007483C57D3B810]) [    ] o.a.s.c.AbstractZkTestCase put /home/jenkins/workspace/Lucene-Solr-6.x-Linux/solr/core/src/test-files/solr/collection1/conf/stopwords.txt to /configs/conf1/stopwords.txt
   [junit4]   2> 924033 INFO  (TEST-RecoveryZkTest.test-seed#[1007483C57D3B810]) [    ] o.a.s.c.c.SolrZkClient makePath: /configs/conf1/stopwords.txt
   [junit4]   2> 924034 INFO  (TEST-RecoveryZkTest.test-seed#[1007483C57D3B810]) [    ] o.a.s.c.AbstractZkTestCase put /home/jenkins/workspace/Lucene-Solr-6.x-Linux/solr/core/src/test-files/solr/collection1/conf/protwords.txt to /configs/conf1/protwords.txt
   [junit4]   2> 924034 INFO  (TEST-RecoveryZkTest.test-seed#[1007483C57D3B810]) [    ] o.a.s.c.c.SolrZkClient makePath: /configs/conf1/protwords.txt
   [junit4]   2> 924034 INFO  (TEST-RecoveryZkTest.test-seed#[1007483C57D3B810]) [    ] o.a.s.c.AbstractZkTestCase put /home/jenkins/workspace/Lucene-Solr-6.x-Linux/solr/core/src/test-files/solr/collection1/conf/currency.xml to /configs/conf1/currency.xml
   [junit4]   2> 924035 INFO  (TEST-RecoveryZkTest.test-seed#[1007483C57D3B810]) [    ] o.a.s.c.c.SolrZkClient makePath: /configs/conf1/currency.xml
   [junit4]   2> 924035 INFO  (TEST-RecoveryZkTest.test-seed#[1007483C57D3B810]) [    ] o.a.s.c.AbstractZkTestCase put /home/jenkins/workspace/Lucene-Solr-6.x-Linux/solr/core/src/test-files/solr/collection1/conf/enumsConfig.xml to /configs/conf1/enumsConfig.xml
   [junit4]   2> 924035 INFO  (TEST-RecoveryZkTest.test-seed#[1007483C57D3B810]) [    ] o.a.s.c.c.SolrZkClient makePath: /configs/conf1/enumsConfig.xml
   [junit4]   2> 924036 INFO  (TEST-RecoveryZkTest.test-seed#[1007483C57D3B810]) [    ] o.a.s.c.AbstractZkTestCase put /home/jenkins/workspace/Lucene-Solr-6.x-Linux/solr/core/src/test-files/solr/collection1/conf/open-exchange-rates.json to /configs/conf1/open-exchange-rates.json
   [junit4]   2> 924036 INFO  (TEST-RecoveryZkTest.test-seed#[1007483C57D3B810]) [    ] o.a.s.c.c.SolrZkClient makePath: /configs/conf1/open-exchange-rates.json
   [junit4]   2> 924037 INFO  (TEST-RecoveryZkTest.test-seed#[1007483C57D3B810]) [    ] o.a.s.c.AbstractZkTestCase put /home/jenkins/workspace/Lucene-Solr-6.x-Linux/solr/core/src/test-files/solr/collection1/conf/mapping-ISOLatin1Accent.txt to /configs/conf1/mapping-ISOLatin1Accent.txt
   [junit4]   2> 924037 INFO  (TEST-RecoveryZkTest.test-seed#[1007483C57D3B810]) [    ] o.a.s.c.c.SolrZkClient makePath: /configs/conf1/mapping-ISOLatin1Accent.txt
   [junit4]   2> 924038 INFO  (TEST-RecoveryZkTest.test-seed#[1007483C57D3B810]) [    ] o.a.s.c.AbstractZkTestCase put /home/jenkins/workspace/Lucene-Solr-6.x-Linux/solr/core/src/test-files/solr/collection1/conf/old_synonyms.txt to /configs/conf1/old_synonyms.txt
   [junit4]   2> 924038 INFO  (TEST-RecoveryZkTest.test-seed#[1007483C57D3B810]) [    ] o.a.s.c.c.SolrZkClient makePath: /configs/conf1/old_synonyms.txt
   [junit4]   2> 924039 INFO  (TEST-RecoveryZkTest.test-seed#[1007483C57D3B810]) [    ] o.a.s.c.AbstractZkTestCase put /home/jenkins/workspace/Lucene-Solr-6.x-Linux/solr/core/src/test-files/solr/collection1/conf/synonyms.txt to /configs/conf1/synonyms.txt
   [junit4]   2> 924039 INFO  (TEST-RecoveryZkTest.test-seed#[1007483C57D3B810]) [    ] o.a.s.c.c.SolrZkClient makePath: /configs/conf1/synonyms.txt
   [junit4]   2> 924096 INFO  (TEST-RecoveryZkTest.test-seed#[1007483C57D3B810]) [    ] o.a.s.SolrTestCaseJ4 Writing core.properties file to /home/jenkins/workspace/Lucene-Solr-6.x-Linux/solr/build/solr-core/test/J2/temp/solr.cloud.RecoveryZkTest_1007483C57D3B810-001/control-001/cores/collection1
   [junit4]   2> 924097 INFO  (TEST-RecoveryZkTest.test-seed#[1007483C57D3B810]) [    ] o.e.j.s.Server jetty-9.3.8.v20160314
   [junit4]   2> 924098 INFO  (TEST-RecoveryZkTest.test-seed#[1007483C57D3B810]) [    ] o.e.j.s.h.ContextHandler Started o.e.j.s.ServletContextHandler@aa845c7{/,null,AVAILABLE}
   [junit4]   2> 924099 INFO  (TEST-RecoveryZkTest.test-seed#[1007483C57D3B810]) [    ] o.e.j.s.ServerConnector Started ServerConnector@a8b196e{HTTP/1.1,[http/1.1]}{127.0.0.1:41619}
   [junit4]   2> 924099 INFO  (TEST-RecoveryZkTest.test-seed#[1007483C57D3B810]) [    ] o.e.j.s.Server Started @926009ms
   [junit4]   2> 924099 INFO  (TEST-RecoveryZkTest.test-seed#[1007483C57D3B810]) [    ] o.a.s.c.s.e.JettySolrRunner Jetty properties: {solr.data.dir=/home/jenkins/workspace/Lucene-Solr-6.x-Linux/solr/build/solr-core/test/J2/temp/solr.cloud.RecoveryZkTest_1007483C57D3B810-001/tempDir-001/control/data, hostContext=/, hostPort=41619, coreRootDirectory=/home/jenkins/workspace/Lucene-Solr-6.x-Linux/solr/build/solr-core/test/J2/temp/solr.cloud.RecoveryZkTest_1007483C57D3B810-001/control-001/cores}
   [junit4]   2> 924099 INFO  (TEST-RecoveryZkTest.test-seed#[1007483C57D3B810]) [    ] o.a.s.s.SolrDispatchFilter SolrDispatchFilter.init(): sun.misc.Launcher$AppClassLoader@73d16e93
   [junit4]   2> 924099 INFO  (TEST-RecoveryZkTest.test-seed#[1007483C57D3B810]) [    ] o.a.s.c.SolrResourceLoader new SolrResourceLoader for directory: '/home/jenkins/workspace/Lucene-Solr-6.x-Linux/solr/build/solr-core/test/J2/temp/solr.cloud.RecoveryZkTest_1007483C57D3B810-001/control-001'
   [junit4]   2> 924099 INFO  (TEST-RecoveryZkTest.test-seed#[1007483C57D3B810]) [    ] o.a.s.c.SolrResourceLoader JNDI not configured for solr (NoInitialContextEx)
   [junit4]   2> 924099 INFO  (TEST-RecoveryZkTest.test-seed#[1007483C57D3B810]) [    ] o.a.s.c.SolrResourceLoader solr home defaulted to 'solr/' (could not find system property or JNDI)
   [junit4]   2> 924099 INFO  (TEST-RecoveryZkTest.test-seed#[1007483C57D3B810]) [    ] o.a.s.c.c.SolrZkClient Using default ZkCredentialsProvider
   [junit4]   2> 924100 INFO  (TEST-RecoveryZkTest.test-seed#[1007483C57D3B810]) [    ] o.a.s.c.c.ConnectionManager Waiting for client to connect to ZooKeeper
   [junit4]   2> 924100 INFO  (zkCallback-1571-thread-1) [    ] o.a.s.c.c.ConnectionManager Watcher org.apache.solr.common.cloud.ConnectionManager@55536b62 name:ZooKeeperConnection Watcher:127.0.0.1:39180/solr got event WatchedEvent state:SyncConnected type:None path:null path:null type:None
   [junit4]   2> 924101 INFO  (TEST-RecoveryZkTest.test-seed#[1007483C57D3B810]) [    ] o.a.s.c.c.ConnectionManager Client is connected to ZooKeeper
   [junit4]   2> 924101 INFO  (TEST-RecoveryZkTest.test-seed#[1007483C57D3B810]) [    ] o.a.s.c.c.SolrZkClient Using default ZkACLProvider
   [junit4]   2> 924102 INFO  (TEST-RecoveryZkTest.test-seed#[1007483C57D3B810]) [    ] o.a.s.s.SolrDispatchFilter Loading solr.xml from SolrHome (not found in ZooKeeper)
   [junit4]   2> 924102 INFO  (TEST-RecoveryZkTest.test-seed#[1007483C57D3B810]) [    ] o.a.s.c.SolrXmlConfig Loading container configuration from /home/jenkins/workspace/Lucene-Solr-6.x-Linux/solr/build/solr-core/test/J2/temp/solr.cloud.RecoveryZkTest_1007483C57D3B810-001/control-001/solr.xml
   [junit4]   2> 924131 INFO  (TEST-RecoveryZkTest.test-seed#[1007483C57D3B810]) [    ] o.a.s.c.CorePropertiesLocator Config-defined core root directory: /home/jenkins/workspace/Lucene-Solr-6.x-Linux/solr/build/solr-core/test/J2/temp/solr.cloud.RecoveryZkTest_1007483C57D3B810-001/control-001/cores
   [junit4]   2> 924131 INFO  (TEST-RecoveryZkTest.test-seed#[1007483C57D3B810]) [    ] o.a.s.c.CoreContainer New CoreContainer 631902512
   [junit4]   2> 924131 INFO  (TEST-RecoveryZkTest.test-seed#[1007483C57D3B810]) [    ] o.a.s.c.CoreContainer Loading cores into CoreContainer [instanceDir=/home/jenkins/workspace/Lucene-Solr-6.x-Linux/solr/build/solr-core/test/J2/temp/solr.cloud.RecoveryZkTest_1007483C57D3B810-001/control-001]
   [junit4]   2> 924131 WARN  (TEST-RecoveryZkTest.test-seed#[1007483C57D3B810]) [    ] o.a.s.c.CoreContainer Couldn't add files from /home/jenkins/workspace/Lucene-Solr-6.x-Linux/solr/build/solr-core/test/J2/temp/solr.cloud.RecoveryZkTest_1007483C57D3B810-001/control-001/lib to classpath: /home/jenkins/workspace/Lucene-Solr-6.x-Linux/solr/build/solr-core/test/J2/temp/solr.cloud.RecoveryZkTest_1007483C57D3B810-001/control-001/lib
   [junit4]   2> 924131 INFO  (TEST-RecoveryZkTest.test-seed#[1007483C57D3B810]) [    ] o.a.s.h.c.HttpShardHandlerFactory created with socketTimeout : 90000,urlScheme : ,connTimeout : 15000,maxConnectionsPerHost : 20,maxConnections : 10000,corePoolSize : 0,maximumPoolSize : 2147483647,maxThreadIdleTime : 5,sizeOfQueue : -1,fairnessPolicy : false,useRetries : false,
   [junit4]   2> 924132 INFO  (TEST-RecoveryZkTest.test-seed#[1007483C57D3B810]) [    ] o.a.s.u.UpdateShardHandler Creating UpdateShardHandler HTTP client with params: socketTimeout=340000&connTimeout=45000&retry=true
   [junit4]   2> 924132 INFO  (TEST-RecoveryZkTest.test-seed#[1007483C57D3B810]) [    ] o.a.s.l.LogWatcher SLF4J impl is org.slf4j.impl.Log4jLoggerFactory
   [junit4]   2> 924132 INFO  (TEST-RecoveryZkTest.test-seed#[1007483C57D3B810]) [    ] o.a.s.l.LogWatcher Registering Log Listener [Log4j (org.slf4j.impl.Log4jLoggerFactory)]
   [junit4]   2> 924132 INFO  (TEST-RecoveryZkTest.test-seed#[1007483C57D3B810]) [    ] o.a.s.c.ZkContainer Zookeeper client=127.0.0.1:39180/solr
   [junit4]   2> 924132 INFO  (TEST-RecoveryZkTest.test-seed#[1007483C57D3B810]) [    ] o.a.s.c.ZkController zkHost includes chroot
   [junit4]   2> 924132 INFO  (TEST-RecoveryZkTest.test-seed#[1007483C57D3B810]) [    ] o.a.s.c.c.SolrZkClient Using default ZkCredentialsProvider
   [junit4]   2> 924133 INFO  (TEST-RecoveryZkTest.test-seed#[1007483C57D3B810]) [    ] o.a.s.c.c.ConnectionManager Waiting for client to connect to ZooKeeper
   [junit4]   2> 924134 INFO  (zkCallback-1574-thread-1) [    ] o.a.s.c.c.ConnectionManager Watcher org.apache.solr.common.cloud.ConnectionManager@2816cf9d name:ZooKeeperConnection Watcher:127.0.0.1:39180 got event WatchedEvent state:SyncConnected type:None path:null path:null type:None
   [junit4]   2> 924134 INFO  (TEST-RecoveryZkTest.test-seed#[1007483C57D3B810]) [    ] o.a.s.c.c.ConnectionManager Client is connected to ZooKeeper
   [junit4]   2> 924135 INFO  (TEST-RecoveryZkTest.test-seed#[1007483C57D3B810]) [    ] o.a.s.c.c.SolrZkClient Using default ZkACLProvider
   [junit4]   2> 924135 INFO  (TEST-RecoveryZkTest.test-seed#[1007483C57D3B810]) [n:127.0.0.1:41619_    ] o.a.s.c.ZkController Added new OnReconnect listener org.apache.solr.cloud.ZkController$$Lambda$38/887253371@5722a9df
   [junit4]   2> 924135 INFO  (TEST-RecoveryZkTest.test-seed#[1007483C57D3B810]) [n:127.0.0.1:41619_    ] o.a.s.c.c.ConnectionManager Waiting for client to connect to ZooKeeper
   [junit4]   2> 924136 INFO  (zkCallback-1575-thread-1-processing-n:127.0.0.1:41619_) [n:127.0.0.1:41619_    ] o.a.s.c.c.ConnectionManager Watcher org.apache.solr.common.cloud.ConnectionManager@49dba1b8 name:ZooKeeperConnection Watcher:127.0.0.1:39180/solr got event WatchedEvent state:SyncConnected type:None path:null path:null type:None
   [junit4]   2> 924136 INFO  (TEST-RecoveryZkTest.test-seed#[1007483C57D3B810]) [n:127.0.0.1:41619_    ] o.a.s.c.c.ConnectionManager Client is connected to ZooKeeper
   [junit4]   2> 924137 INFO  (TEST-RecoveryZkTest.test-seed#[1007483C57D3B810]) [n:127.0.0.1:41619_    ] o.a.s.c.c.SolrZkClient makePath: /overseer/queue
   [junit4]   2> 924137 INFO  (TEST-RecoveryZkTest.test-seed#[1007483C57D3B810]) [n:127.0.0.1:41619_    ] o.a.s.c.c.SolrZkClient makePath: /overseer/collection-queue-work
   [junit4]   2> 924138 INFO  (TEST-RecoveryZkTest.test-seed#[1007483C57D3B810]) [n:127.0.0.1:41619_    ] o.a.s.c.c.SolrZkClient makePath: /overseer/collection-map-running
   [junit4]   2> 924139 INFO  (TEST-RecoveryZkTest.test-seed#[1007483C57D3B810]) [n:127.0.0.1:41619_    ] o.a.s.c.c.SolrZkClient makePath: /overseer/collection-map-completed
   [junit4]   2> 924139 INFO  (TEST-RecoveryZkTest.test-seed#[1007483C57D3B810]) [n:127.0.0.1:41619_    ] o.a.s.c.c.SolrZkClient makePath: /overseer/collection-map-failure
   [junit4]   2> 924140 INFO  (TEST-RecoveryZkTest.test-seed#[1007483C57D3B810]) [n:127.0.0.1:41619_    ] o.a.s.c.c.SolrZkClient makePath: /live_nodes
   [junit4]   2> 924140 INFO  (TEST-RecoveryZkTest.test-seed#[1007483C57D3B810]) [n:127.0.0.1:41619_    ] o.a.s.c.c.SolrZkClient makePath: /aliases.json
   [junit4]   2> 924141 INFO  (TEST-RecoveryZkTest.test-seed#[1007483C57D3B810]) [n:127.0.0.1:41619_    ] o.a.s.c.c.SolrZkClient makePath: /clusterstate.json
   [junit4]   2> 924141 INFO  (TEST-RecoveryZkTest.test-seed#[1007483C57D3B810]) [n:127.0.0.1:41619_    ] o.a.s.c.c.SolrZkClient makePath: /security.json
   [junit4]   2> 924142 INFO  (TEST-RecoveryZkTest.test-seed#[1007483C57D3B810]) [n:127.0.0.1:41619_    ] o.a.s.c.c.ZkStateReader Updating cluster state from ZooKeeper... 
   [junit4]   2> 924142 INFO  (TEST-RecoveryZkTest.test-seed#[1007483C57D3B810]) [n:127.0.0.1:41619_    ] o.a.s.c.c.ZkStateReader Updated live nodes from ZooKeeper... (0) -> (0)
   [junit4]   2> 924143 INFO  (TEST-RecoveryZkTest.test-seed#[1007483C57D3B810]) [n:127.0.0.1:41619_    ] o.a.s.c.c.SolrZkClient makePath: /overseer_elect
   [junit4]   2> 924143 INFO  (TEST-RecoveryZkTest.test-seed#[1007483C57D3B810]) [n:127.0.0.1:41619_    ] o.a.s.c.c.SolrZkClient makePath: /overseer_elect/election
   [junit4]   2> 924143 INFO  (TEST-RecoveryZkTest.test-seed#[1007483C57D3B810]) [n:127.0.0.1:41619_    ] o.a.s.c.Overseer Overseer (id=null) closing
   [junit4]   2> 924144 INFO  (TEST-RecoveryZkTest.test-seed#[1007483C57D3B810]) [n:127.0.0.1:41619_    ] o.a.s.c.LeaderElector Joined leadership election with path: /overseer_elect/election/95876436540194820-127.0.0.1:41619_-n_0000000000
   [junit4]   2> 924144 INFO  (TEST-RecoveryZkTest.test-seed#[1007483C57D3B810]) [n:127.0.0.1:41619_    ] o.a.s.c.OverseerElectionContext I am going to be the leader 127.0.0.1:41619_
   [junit4]   2> 924144 INFO  (TEST-RecoveryZkTest.test-seed#[1007483C57D3B810]) [n:127.0.0.1:41619_    ] o.a.s.c.c.SolrZkClient makePath: /overseer_elect/leader
   [junit4]   2> 924144 INFO  (TEST-RecoveryZkTest.test-seed#[1007483C57D3B810]) [n:127.0.0.1:41619_    ] o.a.s.c.Overseer Overseer (id=95876436540194820-127.0.0.1:41619_-n_0000000000) starting
   [junit4]   2> 924145 INFO  (TEST-RecoveryZkTest.test-seed#[1007483C57D3B810]) [n:127.0.0.1:41619_    ] o.a.s.c.c.SolrZkClient makePath: /overseer/queue-work
   [junit4]   2> 924148 INFO  (TEST-RecoveryZkTest.test-seed#[1007483C57D3B810]) [n:127.0.0.1:41619_    ] o.a.s.c.OverseerAutoReplicaFailoverThread Starting OverseerAutoReplicaFailoverThread autoReplicaFailoverWorkLoopDelay=10000 autoReplicaFailoverWaitAfterExpiration=30000 autoReplicaFailoverBadNodeExpiration=60000
   [junit4]   2> 924148 INFO  (OverseerCollectionConfigSetProcessor-95876436540194820-127.0.0.1:41619_-n_0000000000) [n:127.0.0.1:41619_    ] o.a.s.c.OverseerTaskProcessor Process current queue of overseer operations
   [junit4]   2> 924148 INFO  (TEST-RecoveryZkTest.test-seed#[1007483C57D3B810]) [n:127.0.0.1:41619_    ] o.a.s.c.ZkController Register node as live in ZooKeeper:/live_nodes/127.0.0.1:41619_
   [junit4]   2> 924148 INFO  (OverseerStateUpdate-95876436540194820-127.0.0.1:41619_-n_0000000000) [n:127.0.0.1:41619_    ] o.a.s.c.Overseer Starting to work on the main queue
   [junit4]   2> 924148 INFO  (TEST-RecoveryZkTest.test-seed#[1007483C57D3B810]) [n:127.0.0.1:41619_    ] o.a.s.c.c.SolrZkClient makePath: /live_nodes/127.0.0.1:41619_
   [junit4]   2> 924149 INFO  (OverseerStateUpdate-95876436540194820-127.0.0.1:41619_-n_0000000000) [n:127.0.0.1:41619_    ] o.a.s.c.c.ZkStateReader Updated live nodes from ZooKeeper... (0) -> (1)
   [junit4]   2> 924149 INFO  (zkCallback-1575-thread-1-processing-n:127.0.0.1:41619_) [n:127.0.0.1:41619_    ] o.a.s.c.c.ZkStateReader A live node change: [WatchedEvent state:SyncConnected type:NodeChildrenChanged path:/live_nodes], has occurred - updating... (live nodes size: [1])
   [junit4]   2> 924149 INFO  (zkCallback-1575-thread-1-processing-n:127.0.0.1:41619_) [n:127.0.0.1:41619_    ] o.a.s.c.c.ZkStateReader Updated live nodes from ZooKeeper... (1) -> (1)
   [junit4]   2> 924155 INFO  (TEST-RecoveryZkTest.test-seed#[1007483C57D3B810]) [n:127.0.0.1:41619_    ] o.a.s.c.CoreContainer Security conf doesn't exist. Skipping setup for authorization module.
   [junit4]   2> 924155 INFO  (TEST-RecoveryZkTest.test-seed#[1007483C57D3B810]) [n:127.0.0.1:41619_    ] o.a.s.c.CoreContainer No authentication plugin used.
   [junit4]   2> 924155 INFO  (TEST-RecoveryZkTest.test-seed#[1007483C57D3B810]) [n:127.0.0.1:41619_    ] o.a.s.c.CorePropertiesLocator Looking for core definitions underneath /home/jenkins/workspace/Lucene-Solr-6.x-Linux/solr/build/solr-core/test/J2/temp/solr.cloud.RecoveryZkTest_1007483C57D3B810-001/control-001/cores
   [junit4]   2> 924156 INFO  (TEST-RecoveryZkTest.test-seed#[1007483C57D3B810]) [n:127.0.0.1:41619_    ] o.a.s.c.CoreDescriptor Created CoreDescriptor: {name=collection1, config=solrconfig.xml, transient=false, schema=schema.xml, loadOnStartup=true, configSetProperties=configsetprops.json, collection=control_collection, coreNodeName=, dataDir=data/, shard=}
   [junit4]   2> 924156 INFO  (TEST-RecoveryZkTest.test-seed#[1007483C57D3B810]) [n:127.0.0.1:41619_    ] o.a.s.c.CorePropertiesLocator Found core collection1 in /home/jenkins/workspace/Lucene-Solr-6.x-Linux/solr/build/solr-core/test/J2/temp/solr.cloud.RecoveryZkTest_1007483C57D3B810-001/control-001/cores/collection1
   [junit4]   2> 924156 INFO  (TEST-RecoveryZkTest.test-seed#[1007483C57D3B810]) [n:127.0.0.1:41619_    ] o.a.s.c.CorePropertiesLocator Found 1 core definitions
   [junit4]   2> 924156 INFO  (TEST-RecoveryZkTest.test-seed#[1007483C57D3B810]) [n:127.0.0.1:41619_    ] o.a.s.s.SolrDispatchFilter user.dir=/home/jenkins/workspace/Lucene-Solr-6.x-Linux/solr/build/solr-core/test/J2
   [junit4]   2> 924157 INFO  (TEST-RecoveryZkTest.test-seed#[1007483C57D3B810]) [n:127.0.0.1:41619_    ] o.a.s.s.SolrDispatchFilter SolrDispatchFilter.init() done
   [junit4]   2> 924157 INFO  (coreLoadExecutor-4139-thread-1-processing-n:127.0.0.1:41619_) [n:127.0.0.1:41619_ c:control_collection   x:collection1] o.a.s.c.ZkController publishing state=down
   [junit4]   2> 924157 INFO  (coreLoadExecutor-4139-thread-1-processing-n:127.0.0.1:41619_) [n:127.0.0.1:41619_ c:control_collection   x:collection1] o.a.s.c.ZkController numShards not found on descriptor - reading it from system property
   [junit4]   2> 924158 INFO  (coreLoadExecutor-4139-thread-1-processing-n:127.0.0.1:41619_) [n:127.0.0.1:41619_ c:control_collection   x:collection1] o.a.s.c.ZkController Collection control_collection not visible yet, but flagging it so a watch is registered when it becomes visible
   [junit4]   2> 924158 INFO  (coreLoadExecutor-4139-thread-1-processing-n:127.0.0.1:41619_) [n:127.0.0.1:41619_ c:control_collection   x:collection1] o.a.s.c.c.ZkStateReader addZkWatch [control_collection]
   [junit4]   2> 924158 INFO  (OverseerStateUpdate-95876436540194820-127.0.0.1:41619_-n_0000000000) [n:127.0.0.1:41619_    ] o.a.s.c.Overseer processMessage: queueSize: 1, message = {
   [junit4]   2>   "core":"collection1",
   [junit4]   2>   "roles":null,
   [junit4]   2>   "base_url":"http://127.0.0.1:41619",
   [junit4]   2>   "node_name":"127.0.0.1:41619_",
   [junit4]   2>   "numShards":"1",
   [junit4]   2>   "state":"down",
   [junit4]   2>   "shard":null,
   [junit4]   2>   "collection":"control_collection",
   [junit4]   2>   "operation":"state"} current state version: 0
   [junit4]   2> 924158 INFO  (coreLoadExecutor-4139-thread-1-processing-n:127.0.0.1:41619_) [n:127.0.0.1:41619_ c:control_collection   x:collection1] o.a.s.c.c.ZkStateReader Deleting data for [control_collection]
   [junit4]   2> 924158 INFO  (OverseerStateUpdate-95876436540194820-127.0.0.1:41619_-n_0000000000) [n:127.0.0.1:41619_    ] o.a.s.c.o.ReplicaMutator Update state numShards=1 message={
   [junit4]   2>   "core":"collection1",
   [junit4]   2>   "roles":null,
   [junit4]   2>   "base_url":"http://127.0.0.1:41619",
   [junit4]   2>   "node_name":"127.0.0.1:41619_",
   [junit4]   2>   "numShards":"1",
   [junit4]   2>   "state":"down",
   [junit4]   2>   "shard":null,
   [junit4]   2>   "collection":"control_collection",
   [junit4]   2>   "operation":"state"}
   [junit4]   2> 924158 INFO  (OverseerStateUpdate-95876436540194820-127.0.0.1:41619_-n_0000000000) [n:127.0.0.1:41619_    ] o.a.s.c.o.ClusterStateMutator building a new cName: control_collection
   [junit4]   2> 924158 INFO  (coreLoadExecutor-4139-thread-1-processing-n:127.0.0.1:41619_) [n:127.0.0.1:41619_ c:control_collection   x:collection1] o.a.s.c.ZkController look for our core node name
   [junit4]   2> 924159 INFO  (OverseerStateUpdate-95876436540194820-127.0.0.1:41619_-n_0000000000) [n:127.0.0.1:41619_    ] o.a.s.c.o.ReplicaMutator Assigning new node to shard shard=shard1
   [junit4]   2> 924159 INFO  (zkCallback-1575-thread-1-processing-n:127.0.0.1:41619_) [n:127.0.0.1:41619_    ] o.a.s.c.c.ZkStateReader A cluster state change: [WatchedEvent state:SyncConnected type:NodeDataChanged path:/clusterstate.json], has occurred - updating... (live nodes size: [1])
   [junit4]   2> 925159 INFO  (coreLoadExecutor-4139-thread-1-processing-n:127.0.0.1:41619_) [n:127.0.0.1:41619_ c:control_collection   x:collection1] o.a.s.c.ZkController waiting to find shard id in clusterstate for collection1
   [junit4]   2> 925159 INFO  (coreLoadExecutor-4139-thread-1-processing-n:127.0.0.1:41619_) [n:127.0.0.1:41619_ c:control_collection   x:collection1] o.a.s.c.ZkController Check for collection zkNode:control_collection
   [junit4]   2> 925159 INFO  (coreLoadExecutor-4139-thread-1-processing-n:127.0.0.1:41619_) [n:127.0.0.1:41619_ c:control_collection   x:collection1] o.a.s.c.ZkController Collection zkNode exists
   [junit4]   2> 925159 INFO  (coreLoadExecutor-4139-thread-1-processing-n:127.0.0.1:41619_) [n:127.0.0.1:41619_ c:control_collection   x:collection1] o.a.s.c.c.ZkStateReader Load collection config from: [/collections/control_collection]
   [junit4]   2> 925159 INFO  (coreLoadExecutor-4139-thread-1-processing-n:127.0.0.1:41619_) [n:127.0.0.1:41619_ c:control_collection   x:collection1] o.a.s.c.c.ZkStateReader path=[/collections/control_collection] [configName]=[conf1] specified config exists in ZooKeeper
   [junit4]   2> 925159 INFO  (coreLoadExecutor-4139-thread-1-processing-n:127.0.0.1:41619_) [n:127.0.0.1:41619_ c:control_collection   x:collection1] o.a.s.c.SolrResourceLoader new SolrResourceLoader for directory: '/home/jenkins/workspace/Lucene-Solr-6.x-Linux/solr/build/solr-core/test/J2/temp/solr.cloud.RecoveryZkTest_1007483C57D3B810-001/control-001/cores/collection1'
   [junit4]   2> 925159 INFO  (coreLoadExecutor-4139-thread-1-processing-n:127.0.0.1:41619_) [n:127.0.0.1:41619_ c:control_collection   x:collection1] o.a.s.c.SolrResourceLoader JNDI not configured for solr (NoInitialContextEx)
   [junit4]   2> 925159 INFO  (coreLoadExecutor-4139-thread-1-processing-n:127.0.0.1:41619_) [n:127.0.0.1:41619_ c:control_collection   x:collection1] o.a.s.c.SolrResourceLoader solr home defaulted to 'solr/' (could not find system property or JNDI)
   [junit4]   2> 925160 INFO  (coreLoadExecutor-4139-thread-1-processing-n:127.0.0.1:41619_) [n:127.0.0.1:41619_ c:control_collection   x:collection1] o.a.s.c.Config loaded config solrconfig.xml with version 0 
   [junit4]   2> 925163 INFO  (coreLoadExecutor-4139-thread-1-processing-n:127.0.0.1:41619_) [n:127.0.0.1:41619_ c:control_collection   x:collection1] o.a.s.c.SolrConfig current version of requestparams : -1
   [junit4]   2> 925167 INFO  (coreLoadExecutor-4139-thread-1-processing-n:127.0.0.1:41619_) [n:127.0.0.1:41619_ c:control_collection   x:collection1] o.a.s.c.SolrConfig Using Lucene MatchVersion: 6.1.0
   [junit4]   2> 925175 INFO  (coreLoadExecutor-4139-thread-1-processing-n:127.0.0.1:41619_) [n:127.0.0.1:41619_ c:control_collection   x:collection1] o.a.s.c.SolrConfig Loaded SolrConfig: solrconfig.xml
   [junit4]   2> 925180 INFO  (coreLoadExecutor-4139-thread-1-processing-n:127.0.0.1:41619_) [n:127.0.0.1:41619_ c:control_collection   x:collection1] o.a.s.s.IndexSchema [collection1] Schema name=test
   [junit4]   2> 925243 INFO  (coreLoadExecutor-4139-thread-1-processing-n:127.0.0.1:41619_) [n:127.0.0.1:41619_ c:control_collection   x:collection1] o.a.s.s.IndexSchema default search field in schema is text
   [junit4]   2> 925243 INFO  (coreLoadExecutor-4139-thread-1-processing-n:127.0.0.1:41619_) [n:127.0.0.1:41619_ c:control_collection   x:collection1] o.a.s.s.IndexSchema unique key field: id
   [junit4]   2> 925244 INFO  (coreLoadExecutor-4139-thread-1-processing-n:127.0.0.1:41619_) [n:127.0.0.1:41619_ c:control_collection   x:collection1] o.a.s.s.FileExchangeRateProvider Reloading exchange rates from file currency.xml
   [junit4]   2> 925246 INFO  (coreLoadExecutor-4139-thread-1-processing-n:127.0.0.1:41619_) [n:127.0.0.1:41619_ c:control_collection   x:collection1] o.a.s.s.FileExchangeRateProvider Reloading exchange rates from file currency.xml
   [junit4]   2> 925252 INFO  (coreLoadExecutor-4139-thread-1-processing-n:127.0.0.1:41619_) [n:127.0.0.1:41619_ c:control_collection   x:collection1] o.a.s.c.ConfigSetProperties Did not find ConfigSet properties, assuming default properties: Can't find resource 'configsetprops.json' in classpath or '/configs/conf1', cwd=/home/jenkins/workspace/Lucene-Solr-6.x-Linux/solr/build/solr-core/test/J2
   [junit4]   2> 925252 INFO  (coreLoadExecutor-4139-thread-1-processing-n:127.0.0.1:41619_) [n:127.0.0.1:41619_ c:control_collection   x:collection1] o.a.s.c.CoreContainer Creating SolrCore 'collection1' using configuration from collection control_collection
   [junit4]   2> 925252 INFO  (coreLoadExecutor-4139-thread-1-processing-n:127.0.0.1:41619_) [n:127.0.0.1:41619_ c:control_collection s:shard1 r:core_node1 x:collection1] o.a.s.c.SolrCore org.apache.solr.core.MockDirectoryFactory
   [junit4]   2> 925252 INFO  (coreLoadExecutor-4139-thread-1-processing-n:127.0.0.1:41619_) [n:127.0.0.1:41619_ c:control_collection s:shard1 r:core_node1 x:collection1] o.a.s.c.SolrCore [[collection1] ] Opening new SolrCore at [/home/jenkins/workspace/Lucene-Solr-6.x-Linux/solr/build/solr-core/test/J2/temp/solr.cloud.RecoveryZkTest_1007483C57D3B810-001/control-001/cores/collection1], dataDir=[/home/jenkins/workspace/Lucene-Solr-6.x-Linux/solr/build/solr-core/test/J2/temp/solr.cloud.RecoveryZkTest_1007483C57D3B810-001/control-001/cores/collection1/data/]
   [junit4]   2> 925252 INFO  (coreLoadExecutor-4139-thread-1-processing-n:127.0.0.1:41619_) [n:127.0.0.1:41619_ c:control_collection s:shard1 r:core_node1 x:collection1] o.a.s.c.JmxMonitoredMap JMX monitoring is enabled. Adding Solr mbeans to JMX Server: com.sun.jmx.mbeanserver.JmxMBeanServer@68634fa2
   [junit4]   2> 925253 INFO  (coreLoadExecutor-4139-thread-1-processing-n:127.0.0.1:41619_) [n:127.0.0.1:41619_ c:control_collection s:shard1 r:core_node1 x:collection1] o.a.s.c.CachingDirectoryFactory return new directory for /home/jenkins/workspace/Lucene-Solr-6.x-Linux/solr/build/solr-core/test/J2/temp/solr.cloud.RecoveryZkTest_1007483C57D3B810-001/control-001/cores/collection1/data
   [junit4]   2> 925253 INFO  (coreLoadExecutor-4139-thread-1-processing-n:127.0.0.1:41619_) [n:127.0.0.1:41619_ c:control_collection s:shard1 r:core_node1 x:collection1] o.a.s.c.SolrCore New index directory detected: old=null new=/home/jenkins/workspace/Lucene-Solr-6.x-Linux/solr/build/solr-core/test/J2/temp/solr.cloud.RecoveryZkTest_1007483C57D3B810-001/control-001/cores/collection1/data/index/
   [junit4]   2> 925253 WARN  (coreLoadExecutor-4139-thread-1-processing-n:127.0.0.1:41619_) [n:127.0.0.1:41619_ c:control_collection s:shard1 r:core_node1 x:collection1] o.a.s.c.SolrCore [collection1] Solr index directory '/home/jenkins/workspace/Lucene-Solr-6.x-Linux/solr/build/solr-core/test/J2/temp/solr.cloud.RecoveryZkTest_1007483C57D3B810-001/control-001/cores/collection1/data/index' doesn't exist. Creating new index...
   [junit4]   2> 925253 INFO  (coreLoadExecutor-4139-thread-1-processing-n:127.0.0.1:41619_) [n:127.0.0.1:41619_ c:control_collection s:shard1 r:core_node1 x:collection1] o.a.s.c.CachingDirectoryFactory return new directory for /home/jenkins/workspace/Lucene-Solr-6.x-Linux/solr/build/solr-core/test/J2/temp/solr.cloud.RecoveryZkTest_1007483C57D3B810-001/control-001/cores/collection1/data/index
   [junit4]   2> 925253 INFO  (coreLoadExecutor-4139-thread-1-processing-n:127.0.0.1:41619_) [n:127.0.0.1:41619_ c:control_collection s:shard1 r:core_node1 x:collection1] o.a.s.u.RandomMergePolicy RandomMergePolicy wrapping class org.apache.lucene.index.LogByteSizeMergePolicy: [LogByteSizeMergePolicy: minMergeSize=1677721, mergeFactor=49, maxMergeSize=2147483648, maxMergeSizeForForcedMerge=9223372036854775807, calibrateSizeByDeletes=true, maxMergeDocs=2147483647, maxCFSSegmentSizeMB=8.796093022207999E12, noCFSRatio=0.4493667442127596]
   [junit4]   2> 925254 INFO  (coreLoadExecutor-4139-thread-1-processing-n:127.0.0.1:41619_) [n:127.0.0.1:41619_ c:control_collection s:shard1 r:core_node1 x:collection1] o.a.s.c.SolrDeletionPolicy SolrDeletionPolicy.onCommit: commits: num=1
   [junit4]   2> 	commit{dir=MockDirectoryWrapper(RAMDirectory@7e45efd6 lockFactory=org.apache.lucene.store.SingleInstanceLockFactory@7e732ad9),segFN=segments_1,generation=1}
   [junit4]   2> 925254 INFO  (coreLoadExecutor-4139-thread-1-processing-n:127.0.0.1:41619_) [n:127.0.0.1:41619_ c:control_collection s:shard1 r:core_node1 x:collection1] o.a.s.c.SolrDeletionPolicy newest commit generation = 1
   [junit4]   2> 925254 INFO  (OldIndexDirectoryCleanupThreadForCore-collection1) [n:127.0.0.1:41619_ c:control_collection s:shard1 r:core_node1 x:collection1] o.a.s.c.SolrCore Looking for old index directories to cleanup for core collection1 in /home/jenkins/workspace/Lucene-Solr-6.x-Linux/solr/build/solr-core/test/J2/temp/solr.cloud.RecoveryZkTest_1007483C57D3B810-001/control-001/cores/collection1/data/
   [junit4]   2> 925254 WARN  (OldIndexDirectoryCleanupThreadForCore-collection1) [n:127.0.0.1:41619_ c:control_collection s:shard1 r:core_node1 x:collection1] o.a.s.c.DirectoryFactory /home/jenkins/workspace/Lucene-Solr-6.x-Linux/solr/build/solr-core/test/J2/temp/solr.cloud.RecoveryZkTest_1007483C57D3B810-001/control-001/cores/collection1/data/ does not point to a valid data directory; skipping clean-up of old index directories.
   [junit4]   2> 925255 INFO  (coreLoadExecutor-4139-thread-1-processing-n:127.0.0.1:41619_) [n:127.0.0.1:41619_ c:control_collection s:shard1 r:core_node1 x:collection1] o.a.s.u.p.UpdateRequestProcessorChain creating updateRequestProcessorChain "nodistrib"
   [junit4]   2> 925255 INFO  (coreLoadExecutor-4139-thread-1-processing-n:127.0.0.1:41619_) [n:127.0.0.1:41619_ c:control_collection s:shard1 r:core_node1 x:collection1] o.a.s.u.p.UpdateRequestProcessorChain creating updateRequestProcessorChain "dedupe"
   [junit4]   2> 925255 INFO  (coreLoadExecutor-4139-thread-1-processing-n:127.0.0.1:41619_) [n:127.0.0.1:41619_ c:control_collection s:shard1 r:core_node1 x:collection1] o.a.s.u.p.UpdateRequestProcessorChain inserting DistributedUpdateProcessorFactory into updateRequestProcessorChain "dedupe"
   [junit4]   2> 925255 INFO  (coreLoadExecutor-4139-thread-1-processing-n:127.0.0.1:41619_) [n:127.0.0.1:41619_ c:control_collection s:shard1 r:core_node1 x:collection1] o.a.s.u.p.UpdateRequestProcessorChain creating updateRequestProcessorChain "stored_sig"
   [junit4]   2> 925255 INFO  (coreLoadExecutor-4139-thread-1-processing-n:127.0.0.1:41619_) [n:127.0.0.1:41619_ c:control_collection s:shard1 r:core_node1 x:collection1] o.a.s.u.p.UpdateRequestProcessorChain inserting DistributedUpdateProcessorFactory into updateRequestProcessorChain "stored_sig"
   [junit4]   2> 925255 INFO  (coreLoadExecutor-4139-thread-1-processing-n:127.0.0.1:41619_) [n:127.0.0.1:41619_ c:control_collection s:shard1 r:core_node1 x:collection1] o.a.s.u.p.UpdateRequestProcessorChain creating updateRequestProcessorChain "distrib-dup-test-chain-explicit"
   [junit4]   2> 925256 INFO  (coreLoadExecutor-4139-thread-1-processing-n:127.0.0.1:41619_) [n:127.0.0.1:41619_ c:control_collection s:shard1 r:core_node1 x:collection1] o.a.s.u.p.UpdateRequestProcessorChain creating updateRequestProcessorChain "distrib-dup-test-chain-implicit"
   [junit4]   2> 925256 INFO  (coreLoadExecutor-4139-thread-1-processing-n:127.0.0.1:41619_) [n:127.0.0.1:41619_ c:control_collection s:shard1 r:core_node1 x:collection1] o.a.s.u.p.UpdateRequestProcessorChain inserting DistributedUpdateProcessorFactory into updateRequestProcessorChain "distrib-dup-test-chain-implicit"
   [junit4]   2> 925256 INFO  (coreLoadExecutor-4139-thread-1-processing-n:127.0.0.1:41619_) [n:127.0.0.1:41619_ c:control_collection s:shard1 r:core_node1 x:collection1] o.a.s.c.SolrCore no updateRequestProcessorChain defined as default, creating implicit default
   [junit4]   2> 925256 WARN  (coreLoadExecutor-4139-thread-1-processing-n:127.0.0.1:41619_) [n:127.0.0.1:41619_ c:control_collection s:shard1 r:core_node1 x:collection1] o.a.s.c.RequestHandlers INVALID paramSet a in requestHandler {type = requestHandler,name = /dump,class = DumpRequestHandler,args = {defaults={a=A,b=B}}}
   [junit4]   2> 925257 INFO  (coreLoadExecutor-4139-thread-1-processing-n:127.0.0.1:41619_) [n:127.0.0.1:41619_ c:control_collection s:shard1 r:core_node1 x:collection1] o.a.s.h.l.XMLLoader xsltCacheLifetimeSeconds=60
   [junit4]   2> 925257 INFO  (coreLoadExecutor-4139-thread-1-processing-n:127.0.0.1:41619_) [n:127.0.0.1:41619_ c:control_collection s:shard1 r:core_node1 x:collection1] o.a.s.h.l.XMLLoader xsltCacheLifetimeSeconds=60
   [junit4]   2> 925258 INFO  (coreLoadExecutor-4139-thread-1-processing-n:127.0.0.1:41619_) [n:127.0.0.1:41619_ c:control_collection s:shard1 r:core_node1 x:collection1] o.a.s.h.l.XMLLoader xsltCacheLifetimeSeconds=60
   [junit4]   2> 925258 INFO  (coreLoadExecutor-4139-thread-1-processing-n:127.0.0.1:41619_) [n:127.0.0.1:41619_ c:control_collection s:shard1 r:core_node1 x:collection1] o.a.s.h.l.XMLLoader xsltCacheLifetimeSeconds=60
   [junit4]   2> 925260 INFO  (coreLoadExecutor-4139-thread-1-processing-n:127.0.0.1:41619_) [n:127.0.0.1:41619_ c:control_collection s:shard1 r:core_node1 x:collection1] o.a.s.c.RequestHandlers Registered paths: /admin/mbeans,standard,/update/json/docs,/admin/luke,/export,/get,/admin/properties,/update/json,/admin/threads,/dump,/update/csv,/sql,/graph,/admin/segments,/admin/system,/replication,/config,/stream,/schema,/admin/plugins,/admin/logging,/admin/ping,/update,/admin/file
   [junit4]   2> 925260 INFO  (coreLoadExecutor-4139-thread-1-processing-n:127.0.0.1:41619_) [n:127.0.0.1:41619_ c:control_collection s:shard1 r:core_node1 x:collection1] o.a.s.c.SolrCore Using default statsCache cache: org.apache.solr.search.stats.LocalStatsCache
   [junit4]   2> 925261 INFO  (coreLoadExecutor-4139-thread-1-processing-n:127.0.0.1:41619_) [n:127.0.0.1:41619_ c:control_collection s:shard1 r:core_node1 x:collection1] o.a.s.u.UpdateHandler Using UpdateLog implementation: org.apache.solr.update.UpdateLog
   [junit4]   2> 925261 INFO  (coreLoadExecutor-4139-thread-1-processing-n:127.0.0.1:41619_) [n:127.0.0.1:41619_ c:control_collection s:shard1 r:core_node1 x:collection1] o.a.s.u.UpdateLog Initializing UpdateLog: dataDir= defaultSyncLevel=FLUSH numRecordsToKeep=100 maxNumLogsToKeep=10 numVersionBuckets=65536
   [junit4]   2> 925263 INFO  (coreLoadExecutor-4139-thread-1-processing-n:127.0.0.1:41619_) [n:127.0.0.1:41619_ c:control_collection s:shard1 r:core_node1 x:collection1] o.a.s.u.CommitTracker Hard AutoCommit: disabled
   [junit4]   2> 925263 INFO  (coreLoadExecutor-4139-thread-1-processing-n:127.0.0.1:41619_) [n:127.0.0.1:41619_ c:control_collection s:shard1 r:core_node1 x:collection1] o.a.s.u.CommitTracker Soft AutoCommit: disabled
   [junit4]   2> 925263 INFO  (coreLoadExecutor-4139-thread-1-processing-n:127.0.0.1:41619_) [n:127.0.0.1:41619_ c:control_collection s:shard1 r:core_node1 x:collection1] o.a.s.u.RandomMergePolicy RandomMergePolicy wrapping class org.apache.lucene.index.AlcoholicMergePolicy: [AlcoholicMergePolicy: minMergeSize=0, mergeFactor=10, maxMergeSize=1558570096, maxMergeSizeForForcedMerge=9223372036854775807, calibrateSizeByDeletes=true, maxMergeDocs=2147483647, maxCFSSegmentSizeMB=8.796093022207999E12, noCFSRatio=0.1]
   [junit4]   2> 925263 INFO  (coreLoadExecutor-4139-thread-1-processing-n:127.0.0.1:41619_) [n:127.0.0.1:41619_ c:control_collection s:shard1 r:core_node1 x:collection1] o.a.s.c.SolrDeletionPolicy SolrDeletionPolicy.onInit: commits: num=1
   [junit4]   2> 	commit{dir=MockDirectoryWrapper(RAMDirectory@7e45efd6 lockFactory=org.apache.lucene.store.SingleInstanceLockFactory@7e732ad9),segFN=segments_1,generation=1}
   [junit4]   2> 925263 INFO  (coreLoadExecutor-4139-thread-1-processing-n:127.0.0.1:41619_) [n:127.0.0.1:41619_ c:control_collection s:shard1 r:core_node1 x:collection1] o.a.s.c.SolrDeletionPolicy newest commit generation = 1
   [junit4]   2> 925263 INFO  (coreLoadExecutor-4139-thread-1-processing-n:127.0.0.1:41619_) [n:127.0.0.1:41619_ c:control_collection s:shard1 r:core_node1 x:collection1] o.a.s.s.SolrIndexSearcher Opening [Searcher@6a5d6dc[collection1] main]
   [junit4]   2> 925263 INFO  (coreLoadExecutor-4139-thread-1-processing-n:127.0.0.1:41619_) [n:127.0.0.1:41619_ c:control_collection s:shard1 r:core_node1 x:collection1] o.a.s.c.c.ZkStateReader Load collection config from: [/collections/control_collection]
   [junit4]   2> 925264 INFO  (coreLoadExecutor-4139-thread-1-processing-n:127.0.0.1:41619_) [n:127.0.0.1:41619_ c:control_collection s:shard1 r:core_node1 x:collection1] o.a.s.c.c.ZkStateReader path=[/collections/control_collection] [configName]=[conf1] specified config exists in ZooKeeper
   [junit4]   2> 925264 INFO  (coreLoadExecutor-4139-thread-1-processing-n:127.0.0.1:41619_) [n:127.0.0.1:41619_ c:control_collection s:shard1 r:core_node1 x:collection1] o.a.s.r.ManagedResourceStorage Setting up ZooKeeper-based storage for the RestManager with znodeBase: /configs/conf1
   [junit4]   2> 925264 INFO  (coreLoadExecutor-4139-thread-1-processing-n:127.0.0.1:41619_) [n:127.0.0.1:41619_ c:control_collection s:shard1 r:core_node1 x:collection1] o.a.s.r.ManagedResourceStorage Configured ZooKeeperStorageIO with znodeBase: /configs/conf1
   [junit4]   2> 925264 INFO  (coreLoadExecutor-4139-thread-1-processing-n:127.0.0.1:41619_) [n:127.0.0.1:41619_ c:control_collection s:shard1 r:core_node1 x:collection1] o.a.s.r.RestManager Initializing RestManager with initArgs: {}
   [junit4]   2> 925264 INFO  (coreLoadExecutor-4139-thread-1-processing-n:127.0.0.1:41619_) [n:127.0.0.1:41619_ c:control_collection s:shard1 r:core_node1 x:collection1] o.a.s.r.ManagedResourceStorage Reading _rest_managed.json using ZooKeeperStorageIO:path=/configs/conf1
   [junit4]   2> 925264 INFO  (coreLoadExecutor-4139-thread-1-processing-n:127.0.0.1:41619_) [n:127.0.0.1:41619_ c:control_collection s:shard1 r:core_node1 x:collection1] o.a.s.r.ManagedResourceStorage No data found for znode /configs/conf1/_rest_managed.json
   [junit4]   2> 925264 INFO  (coreLoadExecutor-4139-thread-1-processing-n:127.0.0.1:41619_) [n:127.0.0.1:41619_ c:control_collection s:shard1 r:core_node1 x:collection1] o.a.s.r.ManagedResourceStorage Loaded null at path _rest_managed.json using ZooKeeperStorageIO:path=/configs/conf1
   [junit4]   2> 925264 INFO  (coreLoadExecutor-4139-thread-1-processing-n:127.0.0.1:41619_) [n:127.0.0.1:41619_ c:control_collection s:shard1 r:core_node1 x:collection1] o.a.s.r.RestManager Initializing 0 registered ManagedResources
   [junit4]   2> 925264 INFO  (coreLoadExecutor-4139-thread-1-processing-n:127.0.0.1:41619_) [n:127.0.0.1:41619_ c:control_collection s:shard1 r:core_node1 x:collection1] o.a.s.h.ReplicationHandler Commits will be reserved for  10000
   [junit4]   2> 925265 INFO  (searcherExecutor-4140-thread-1-processing-n:127.0.0.1:41619_ x:collection1 s:shard1 c:control_collection r:core_node1) [n:127.0.0.1:41619_ c:control_collection s:shard1 r:core_node1 x:collection1] o.a.s.c.SolrCore [collection1] Registered new searcher Searcher@6a5d6dc[collection1] main{ExitableDirectoryReader(UninvertingDirectoryReader())}
   [junit4]   2> 925265 INFO  (coreLoadExecutor-4139-thread-1-processing-n:127.0.0.1:41619_) [n:127.0.0.1:41619_ c:control_collection s:shard1 r:core_node1 x:collection1] o.a.s.u.UpdateLog Looking up max value of version field to seed version buckets
   [junit4]   2> 925265 INFO  (coreLoadExecutor-4139-thread-1-processing-n:127.0.0.1:41619_) [n:127.0.0.1:41619_ c:control_collection s:shard1 r:core_node1 x:collection1] o.a.s.u.VersionInfo Refreshing highest value of _version_ for 65536 version buckets from index
   [junit4]   2> 925265 INFO  (coreLoadExecutor-4139-thread-1-processing-n:127.0.0.1:41619_) [n:127.0.0.1:41619_ c:control_collection s:shard1 r:core_node1 x:collection1] o.a.s.u.VersionInfo No terms found for _version_, cannot seed version bucket highest value from index
   [junit4]   2> 925265 INFO  (coreLoadExecutor-4139-thread-1-processing-n:127.0.0.1:41619_) [n:127.0.0.1:41619_ c:control_collection s:shard1 r:core_node1 x:collection1] o.a.s.u.UpdateLog Could not find max version in index or recent updates, using new clock 1534022986052403200
   [junit4]   2> 925267 INFO  (coreLoadExecutor-4139-thread-1-processing-n:127.0.0.1:41619_) [n:127.0.0.1:41619_ c:control_collection s:shard1 r:core_node1 x:collection1] o.a.s.u.UpdateLog Took 1.0ms to seed version buckets with highest version 1534022986052403200
   [junit4]   2> 925267 INFO  (coreLoadExecutor-4139-thread-1-processing-n:127.0.0.1:41619_) [n:127.0.0.1:41619_ c:control_collection s:shard1 r:core_node1 x:collection1] o.a.s.c.ZkController watch zkdir /configs/conf1
   [junit4]   2> 925267 INFO  (coreLoadExecutor-4139-thread-1-processing-n:127.0.0.1:41619_) [n:127.0.0.1:41619_ c:control_collection s:shard1 r:core_node1 x:collection1] o.a.s.c.CoreContainer registering core: collection1
   [junit4]   2> 925267 INFO  (coreZkRegister-4133-thread-1-processing-n:127.0.0.1:41619_ x:collection1 s:shard1 c:control_collection r:core_node1) [n:127.0.0.1:41619_ c:control_collection s:shard1 r:core_node1 x:collection1] o.a.s.c.ZkController Register replica - core:collection1 address:http://127.0.0.1:41619 collection:control_collection shard:shard1
   [junit4]   2> 925267 INFO  (coreZkRegister-4133-thread-1-processing-n:127.0.0.1:41619_ x:collection1 s:shard1 c:control_collection r:core_node1) [n:127.0.0.1:41619_ c:control_collection s:shard1 r:core_node1 x:collection1] o.a.s.c.c.SolrZkClient makePath: /collections/control_collection/leader_elect/shard1/election
   [junit4]   2> 925268 INFO  (coreZkRegister-4133-thread-1-processing-n:127.0.0.1:41619_ x:collection1 s:shard1 c:control_collection r:core_node1) [n:127.0.0.1:41619_ c:control_collection s:shard1 r:core_node1 x:collection1] o.a.s.c.LeaderElector Joined leadership election with path: /collections/control_collection/leader_elect/shard1/election/95876436540194820-core_node1-n_0000000000
   [junit4]   2> 925268 INFO  (coreZkRegister-4133-thread-1-processing-n:127.0.0.1:41619_ x:collection1 s:shard1 c:control_collection r:core_node1) [n:127.0.0.1:41619_ c:control_collection s:shard1 r:core_node1 x:collection1] o.a.s.c.ShardLeaderElectionContext Running the leader process for shard=shard1 and weAreReplacement=false and leaderVoteWait=10000
   [junit4]   2> 925269 INFO  (coreZkRegister-4133-thread-1-processing-n:127.0.0.1:41619_ x:collection1 s:shard1 c:control_collection r:core_node1) [n:127.0.0.1:41619_ c:control_collection s:shard1 r:core_node1 x:collection1] o.a.s.c.ShardLeaderElectionContext Enough replicas found to continue.
   [junit4]   2> 925269 INFO  (coreZkRegister-4133-thread-1-processing-n:127.0.0.1:41619_ x:collection1 s:shard1 c:control_collection r:core_node1) [n:127.0.0.1:41619_ c:control_collection s:shard1 r:core_node1 x:collection1] o.a.s.c.ShardLeaderElectionContext I may be the new leader - try and sync
   [junit4]   2> 925269 INFO  (OverseerStateUpdate-95876436540194820-127.0.0.1:41619_-n_0000000000) [n:127.0.0.1:41619_    ] o.a.s.c.Overseer processMessage: queueSize: 1, message = {
   [junit4]   2>   "operation":"leader",
   [junit4]   2>   "shard":"shard1",
   [junit4]   2>   "collection":"control_collection"} current state version: 1
   [junit4]   2> 925269 INFO  (coreZkRegister-4133-thread-1-processing-n:127.0.0.1:41619_ x:collection1 s:shard1 c:control_collection r:core_node1) [n:127.0.0.1:41619_ c:control_collection s:shard1 r:core_node1 x:collection1] o.a.s.c.SyncStrategy Sync replicas to http://127.0.0.1:41619/collection1/
   [junit4]   2> 925270 INFO  (coreZkRegister-4133-thread-1-processing-n:127.0.0.1:41619_ x:collection1 s:shard1 c:control_collection r:core_node1) [n:127.0.0.1:41619_ c:control_collection s:shard1 r:core_node1 x:collection1] o.a.s.c.SyncStrategy Sync Success - now sync replicas to me
   [junit4]   2> 925270 INFO  (coreZkRegister-4133-thread-1-processing-n:127.0.0.1:41619_ x:collection1 s:shard1 c:control_collection r:core_node1) [n:127.0.0.1:41619_ c:control_collection s:shard1 r:core_node1 x:collection1] o.a.s.c.SyncStrategy http://127.0.0.1:41619/collection1/ has no replicas
   [junit4]   2> 925270 INFO  (coreZkRegister-4133-thread-1-processing-n:127.0.0.1:41619_ x:collection1 s:shard1 c:control_collection r:core_node1) [n:127.0.0.1:41619_ c:control_collection s:shard1 r:core_node1 x:collection1] o.a.s.c.c.SolrZkClient makePath: /collections/control_collection/leaders/shard1
   [junit4]   2> 925271 INFO  (coreZkRegister-4133-thread-1-processing-n:127.0.0.1:41619_ x:collection1 s:shard1 c:control_collection r:core_node1) [n:127.0.0.1:41619_ c:control_collection s:shard1 r:core_node1 x:collection1] o.a.s.c.ShardLeaderElectionContextBase Creating leader registration node /collections/control_collection/leaders/shard1/leader after winning as /collections/control_collection/leader_elect/shard1/election/95876436540194820-core_node1-n_0000000000
   [junit4]   2> 925271 INFO  (coreZkRegister-4133-thread-1-processing-n:127.0.0.1:41619_ x:collection1 s:shard1 c:control_collection r:core_node1) [n:127.0.0.1:41619_ c:control_collection s:shard1 r:core_node1 x:collection1] o.a.s.c.ShardLeaderElectionContext I am the new leader: http://127.0.0.1:41619/collection1/ shard1
   [junit4]   2> 925272 INFO  (OverseerStateUpdate-95876436540194820-127.0.0.1:41619_-n_0000000000) [n:127.0.0.1:41619_    ] o.a.s.c.Overseer processMessage: queueSize: 1, message = {
   [junit4]   2>   "operation":"leader",
   [junit4]   2>   "shard":"shard1",
   [junit4]   2>   "collection":"control_collection",
   [junit4]   2>   "base_url":"http://127.0.0.1:41619",
   [junit4]   2>   "core":"collection1",
   [junit4]   2>   "state":"active"} current state version: 1
   [junit4]   2> 925373 INFO  (zkCallback-1575-thread-1-processing-n:127.0.0.1:41619_) [n:127.0.0.1:41619_    ] o.a.s.c.c.ZkStateReader A cluster state change: [WatchedEvent state:SyncConnected type:NodeDataChanged path:/clusterstate.json], has occurred - updating... (live nodes size: [1])
   [junit4]   2> 925422 INFO  (coreZkRegister-4133-thread-1-processing-n:127.0.0.1:41619_ x:collection1 s:shard1 c:control_collection r:core_node1) [n:127.0.0.1:41619_ c:control_collection s:shard1 r:core_node1 x:collection1] o.a.s.c.ZkController We are http://127.0.0.1:41619/collection1/ and leader is http://127.0.0.1:41619/collection1/
   [junit4]   2> 925422 INFO  (coreZkRegister-4133-thread-1-processing-n:127.0.0.1:41619_ x:collection1 s:shard1 c:control_collection r:core_node1) [n:127.0.0.1:41619_ c:control_collection s:shard1 r:core_node1 x:collection1] o.a.s.c.ZkController No LogReplay needed for core=collection1 baseURL=http://127.0.0.1:41619
   [junit4]   2> 925422 INFO  (coreZkRegister-4133-thread-1-processing-n:127.0.0.1:41619_ x:collection1 s:shard1 c:control_collection r:core_node1) [n:127.0.0.1:41619_ c:control_collection s:shard1 r:core_node1 x:collection1] o.a.s.c.ZkController I am the leader, no recovery necessary
   [junit4]   2> 925422 INFO  (coreZkRegister-4133-thread-1-processing-n:127.0.0.1:41619_ x:collection1 s:shard1 c:control_collection r:core_node1) [n:127.0.0.1:41619_ c:control_collection s:shard1 r:core_node1 x:collection1] o.a.s.c.ZkController publishing state=active
   [junit4]   2> 925422 INFO  (coreZkRegister-4133-thread-1-processing-n:127.0.0.1:41619_ x:collection1 s:shard1 c:control_collection r:core_node1) [n:127.0.0.1:41619_ c:control_collection s:shard1 r:core_node1 x:collection1] o.a.s.c.ZkController numShards not found on descriptor - reading it from system property
   [junit4]   2> 925423 INFO  (OverseerStateUpdate-95876436540194820-127.0.0.1:41619_-n_0000000000) [n:127.0.0.1:41619_    ] o.a.s.c.Overseer processMessage: queueSize: 1, message = {
   [junit4]   2>   "core":"collection1",
   [junit4]   2>   "core_node_name":"core_node1",
   [junit4]   2>   "roles":null,
   [junit4]   2>   "base_url":"http://127.0.0.1:41619",
   [junit4]   2>   "node_name":"127.0.0.1:41619_",
   [junit4]   2>   "numShards":"1",
   [junit4]   2>   "state":"active",
   [junit4]   2>   "shard":"shard1",
   [junit4]   2>   "collection":"control_collection",
   [junit4]   2>   "operation":"state"} current state version: 2
   [junit4]   2> 925423 INFO  (OverseerStateUpdate-95876436540194820-127.0.0.1:41619_-n_0000000000) [n:127.0.0.1:41619_    ] o.a.s.c.o.ReplicaMutator Update state numShards=1 message={
   [junit4]   2>   "core":"collection1",
   [junit4]   2>   "core_node_name":"core_node1",
   [junit4]   2>   "roles":null,
   [junit4]   2>   "base_url":"http://127.0.0.1:41619",
   [junit4]   2>   "node_name":"127.0.0.1:41619_",
   [junit4]   2>   "numShards":"1",
   [junit4]   2>   "state":"active",
   [junit4]   2>   "shard":"shard1",
   [junit4]   2>   "collection":"control_collection",
   [junit4]   2>   "operation":"state"}
   [junit4]   2> 925524 INFO  (zkCallback-1575-thread-1-processing-n:127.0.0.1:41619_) [n:127.0.0.1:41619_    ] o.a.s.c.c.ZkStateReader A cluster state change: [WatchedEvent state:SyncConnected type:NodeDataChanged path:/clusterstate.json], has occurred - updating... (live nodes size: [1])
   [junit4]   2> 925658 INFO  (TEST-RecoveryZkTest.test-seed#[1007483C57D3B810]) [    ] o.a.s.c.s.i.CloudSolrClient Final constructed zkHost string: 127.0.0.1:39180/solr
   [junit4]   2> 925658 INFO  (TEST-RecoveryZkTest.test-seed#[1007483C57D3B810]) [    ] o.a.s.c.c.SolrZkClient Using default ZkCredentialsProvider
   [junit4]   2> 925659 INFO  (TEST-RecoveryZkTest.test-seed#[1007483C57D3B810]) [    ] o.a.s.c.c.ConnectionManager Waiting for client to connect to ZooKeeper
   [junit4]   2> 925662 INFO  (zkCallback-1577-thread-1) [    ] o.a.s.c.c.ConnectionManager Watcher org.apache.solr.common.cloud.ConnectionManager@341dc933 name:ZooKeeperConnection Watcher:127.0.0.1:39180/solr got event WatchedEvent state:SyncConnected type:None path:null path:null type:None
   [junit4]   2> 925662 INFO  (TEST-RecoveryZkTest.test-seed#[1007483C57D3B810]) [    ] o.a.s.c.c.ConnectionManager Client is connected to ZooKeeper
   [junit4]   2> 925662 INFO  (TEST-RecoveryZkTest.test-seed#[1007483C57D3B810]) [    ] o.a.s.c.c.SolrZkClient Using default ZkACLProvider
   [junit4]   2> 925662 INFO  (TEST-RecoveryZkTest.test-seed#[1007483C57D3B810]) [    ] o.a.s.c.c.ZkStateReader Updating cluster state from ZooKeeper... 
   [junit4]   2> 925685 INFO  (TEST-RecoveryZkTest.test-seed#[1007483C57D3B810]) [    ] o.a.s.c.c.ZkStateReader Updated live nodes from ZooKeeper... (0) -> (1)
   [junit4]   2> 925686 INFO  (TEST-RecoveryZkTest.test-seed#[1007483C57D3B810]) [    ] o.a.s.c.ChaosMonkey monkey: init - expire sessions:false cause connection loss:false
   [junit4]   2> 925746 INFO  (TEST-RecoveryZkTest.test-seed#[1007483C57D3B810]) [    ] o.a.s.SolrTestCaseJ4 Writing core.properties file to /home/jenkins/workspace/Lucene-Solr-6.x-Linux/solr/build/solr-core/test/J2/temp/solr.cloud.RecoveryZkTest_1007483C57D3B810-001/shard-1-001/cores/collection1
   [junit4]   2> 925746 INFO  (TEST-RecoveryZkTest.test-seed#[1007483C57D3B810]) [    ] o.a.s.c.AbstractFullDistribZkTestBase create jetty 1 in directory /home/jenkins/workspace/Lucene-Solr-6.x-Linux/solr/build/solr-core/test/J2/temp/solr.cloud.RecoveryZkTest_1007483C57D3B810-001/shard-1-001
   [junit4]   2> 925747 INFO  (TEST-RecoveryZkTest.test-seed#[1007483C57D3B810]) [    ] o.e.j.s.Server jetty-9.3.8.v20160314
   [junit4]   2> 925748 INFO  (TEST-RecoveryZkTest.test-seed#[1007483C57D3B810]) [    ] o.e.j.s.h.ContextHandler Started o.e.j.s.ServletContextHandler@12a02099{/,null,AVAILABLE}
   [junit4]   2> 925748 INFO  (TEST-RecoveryZkTest.test-seed#[1007483C57D3B810]) [    ] o.e.j.s.ServerConnector Started ServerConnector@4e4ea10a{HTTP/1.1,[http/1.1]}{127.0.0.1:38656}
   [junit4]   2> 925749 INFO  (TEST-RecoveryZkTest.test-seed#[1007483C57D3B810]) [    ] o.e.j.s.Server Started @927659ms
   [junit4]   2> 925749 INFO  (TEST-RecoveryZkTest.test-seed#[1007483C57D3B810]) [    ] o.a.s.c.s.e.JettySolrRunner Jetty properties: {solr.data.dir=/home/jenkins/workspace/Lucene-Solr-6.x-Linux/solr/build/solr-core/test/J2/temp/solr.cloud.RecoveryZkTest_1007483C57D3B810-001/tempDir-001/jetty1, solrconfig=solrconfig.xml, hostContext=/, hostPort=38656, coreRootDirectory=/home/jenkins/workspace/Lucene-Solr-6.x-Linux/solr/build/solr-core/test/J2/temp/solr.cloud.RecoveryZkTest_1007483C57D3B810-001/shard-1-001/cores}
   [junit4]   2> 925749 INFO  (TEST-RecoveryZkTest.test-seed#[1007483C57D3B810]) [    ] o.a.s.s.SolrDispatchFilter SolrDispatchFilter.init(): sun.misc.Launcher$AppClassLoader@73d16e93
   [junit4]   2> 925749 INFO  (TEST-RecoveryZkTest.test-seed#[1007483C57D3B810]) [    ] o.a.s.c.SolrResourceLoader new SolrResourceLoader for directory: '/home/jenkins/workspace/Lucene-Solr-6.x-Linux/solr/build/solr-core/test/J2/temp/solr.cloud.RecoveryZkTest_1007483C57D3B810-001/shard-1-001'
   [junit4]   2> 925749 INFO  (TEST-RecoveryZkTest.test-seed#[1007483C57D3B810]) [    ] o.a.s.c.SolrResourceLoader JNDI not configured for solr (NoInitialContextEx)
   [junit4]   2> 925749 INFO  (TEST-RecoveryZkTest.test-seed#[1007483C57D3B810]) [    ] o.a.s.c.SolrResourceLoader solr home defaulted to 'solr/' (could not find system property or JNDI)
   [junit4]   2> 925749 INFO  (TEST-RecoveryZkTest.test-seed#[1007483C57D3B810]) [    ] o.a.s.c.c.SolrZkClient Using default ZkCredentialsProvider
   [junit4]   2> 925749 INFO  (TEST-RecoveryZkTest.test-seed#[1007483C57D3B810]) [    ] o.a.s.c.c.ConnectionManager Waiting for client to connect to ZooKeeper
   [junit4]   2> 925750 INFO  (zkCallback-1578-thread-1) [    ] o.a.s.c.c.ConnectionManager Watcher org.apache.solr.common.cloud.ConnectionManager@3a838249 name:ZooKeeperConnection Watcher:127.0.0.1:39180/solr got event WatchedEvent state:SyncConnected type:None path:null path:null type:None
   [junit4]   2> 925750 INFO  (TEST-RecoveryZkTest.test-seed#[1007483C57D3B810]) [    ] o.a.s.c.c.ConnectionManager Client is connected to ZooKeeper
   [junit4]   2> 925751 INFO  (TEST-RecoveryZkTest.test-seed#[1007483C57D3B810]) [    ] o.a.s.c.c.SolrZkClient Using default ZkACLProvider
   [junit4]   2> 925751 INFO  (TEST-RecoveryZkTest.test-seed#[1007483C57D3B810]) [    ] o.a.s.s.SolrDispatchFilter Loading solr.xml from SolrHome (not found in ZooKeeper)
   [junit4]   2> 925751 INFO  (TEST-RecoveryZkTest.test-seed#[1007483C57D3B810]) [    ] o.a.s.c.SolrXmlConfig Loading container configuration from /home/jenkins/workspace/Lucene-Solr-6.x-Linux/solr/build/solr-core/test/J2/temp/solr.cloud.RecoveryZkTest_1007483C57D3B810-001/shard-1-001/solr.xml
   [junit4]   2> 925755 INFO  (TEST-RecoveryZkTest.test-seed#[1007483C57D3B810]) [    ] o.a.s.c.CorePropertiesLocator Config-defined core root directory: /home/jenkins/workspace/Lucene-Solr-6.x-Linux/solr/build/solr-core/test/J2/temp/solr.cloud.RecoveryZkTest_1007483C57D3B810-001/shard-1-001/cores
   [junit4]   2> 925755 INFO  (TEST-RecoveryZkTest.test-seed#[1007483C57D3B810]) [    ] o.a.s.c.CoreContainer New CoreContainer 1305060680
   [junit4]   2> 925755 INFO  (TEST-RecoveryZkTest.test-seed#[1007483C57D3B810]) [    ] o.a.s.c.CoreContainer Loading cores into CoreContainer [instanceDir=/home/jenkins/workspace/Lucene-Solr-6.x-Linux/solr/build/solr-core/test/J2/temp/solr.cloud.RecoveryZkTest_1007483C57D3B810-001/shard-1-001]
   [junit4]   2> 925756 WARN  (TEST-RecoveryZkTest.test-seed#[1007483C57D3B810]) [    ] o.a.s.c.CoreContainer Couldn't add files from /home/jenkins/workspace/Lucene-Solr-6.x-Linux/solr/build/solr-core/test/J2/temp/solr.cloud.RecoveryZkTest_1007483C57D3B810-001/shard-1-001/lib to classpath: /home/jenkins/workspace/Lucene-Solr-6.x-Linux/solr/build/solr-core/test/J2/temp/solr.cloud.RecoveryZkTest_1007483C57D3B810-001/shard-1-001/lib
   [junit4]   2> 925756 INFO  (TEST-RecoveryZkTest.test-seed#[1007483C57D3B810]) [    ] o.a.s.h.c.HttpShardHandlerFactory created with socketTimeout : 90000,urlScheme : ,connTimeout : 15000,maxConnectionsPerHost : 20,maxConnections : 10000,corePoolSize : 0,maximumPoolSize : 2147483647,maxThreadIdleTime : 5,sizeOfQueue : -1,fairnessPolicy : false,useRetries : false,
   [junit4]   2> 925756 INFO  (TEST-RecoveryZkTest.test-seed#[1007483C57D3B810]) [    ] o.a.s.u.UpdateShardHandler Creating UpdateShardHandler HTTP client with params: socketTimeout=340000&connTimeout=45000&retry=true
   [junit4]   2> 925757 INFO  (TEST-RecoveryZkTest.test-seed#[1007483C57D3B810]) [    ] o.a.s.l.LogWatcher SLF4J impl is org.slf4j.impl.Log4jLoggerFactory
   [junit4]   2> 925757 INFO  (TEST-RecoveryZkTest.test-seed#[1007483C57D3B810]) [    ] o.a.s.l.LogWatcher Registering Log Listener [Log4j (org.slf4j.impl.Log4jLoggerFactory)]
   [junit4]   2> 925757 INFO  (TEST-RecoveryZkTest.test-seed#[1007483C57D3B810]) [    ] o.a.s.c.ZkContainer Zookeeper client=127.0.0.1:39180/solr
   [junit4]   2> 925757 INFO  (TEST-RecoveryZkTest.test-seed#[1007483C57D3B810]) [    ] o.a.s.c.ZkController zkHost includes chroot
   [junit4]   2> 925757 INFO  (TEST-RecoveryZkTest.test-seed#[1007483C57D3B810]) [    ] o.a.s.c.c.SolrZkClient Using default ZkCredentialsProvider
   [junit4]   2> 925757 INFO  (TEST-RecoveryZkTest.test-seed#[1007483C57D3B810]) [    ] o.a.s.c.c.ConnectionManager Waiting for client to connect to ZooKeeper
   [junit4]   2> 925758 INFO  (zkCallback-1581-thread-1) [    ] o.a.s.c.c.ConnectionManager Watcher org.apache.solr.common.cloud.ConnectionManager@72d4ed58 name:ZooKeeperConnection Watcher:127.0.0.1:39180 got event WatchedEvent state:SyncConnected type:None path:null path:null type:None
   [junit4]   2> 925758 INFO  (TEST-RecoveryZkTest.test-seed#[1007483C57D3B810]) [    ] o.a.s.c.c.ConnectionManager Client is connected to ZooKeeper
   [junit4]   2> 925758 INFO  (TEST-RecoveryZkTest.test-seed#[1007483C57D3B810]) [    ] o.a.s.c.c.SolrZkClient Using default ZkACLProvider
   [junit4]   2> 925758 INFO  (TEST-RecoveryZkTest.test-seed#[1007483C57D3B810]) [n:127.0.0.1:38656_    ] o.a.s.c.ZkController Added new OnReconnect listener org.apache.solr.cloud.ZkController$$Lambda$38/887253371@c6d06d8
   [junit4]   2> 925759 INFO  (TEST-RecoveryZkTest.test-seed#[1007483C57D3B810]) [n:127.0.0.1:38656_    ] o.a.s.c.c.ConnectionManager Waiting for client to connect to ZooKeeper
   [junit4]   2> 925759 INFO  (zkCallback-1582-thread-1-processing-n:127.0.0.1:38656_) [n:127.0.0.1:38656_    ] o.a.s.c.c.ConnectionManager Watcher org.apache.solr.common.cloud.ConnectionManager@5f3c1d55 name:ZooKeeperConnection Watcher:127.0.0.1:39180/solr got event WatchedEvent state:SyncConnected type:None path:null path:null type:None
   [junit4]   2> 925759 INFO  (TEST-RecoveryZkTest.test-seed#[1007483C57D3B810]) [n:127.0.0.1:38656_    ] o.a.s.c.c.ConnectionManager Client is connected to ZooKeeper
   [junit4]   2> 925761 INFO  (TEST-RecoveryZkTest.test-seed#[1007483C57D3B810]) [n:127.0.0.1:38656_    ] o.a.s.c.c.ZkStateReader Updating cluster state from ZooKeeper... 
   [junit4]   2> 925761 INFO  (TEST-RecoveryZkTest.test-seed#[1007483C57D3B810]) [n:127.0.0.1:38656_    ] o.a.s.c.c.ZkStateReader Updated live nodes from ZooKeeper... (0) -> (1)
   [junit4]   2> 925762 INFO  (TEST-RecoveryZkTest.test-seed#[1007483C57D3B810]) [n:127.0.0.1:38656_    ] o.a.s.c.Overseer Overseer (id=null) closing
   [junit4]   2> 925770 INFO  (TEST-RecoveryZkTest.test-seed#[1007483C57D3B810]) [n:127.0.0.1:38656_    ] o.a.s.c.LeaderElector Joined leadership election with path: /overseer_elect/election/95876436540194824-127.0.0.1:38656_-n_0000000001
   [junit4]   2> 925770 INFO  (TEST-RecoveryZkTest.test-seed#[1007483C57D3B810]) [n:127.0.0.1:38656_    ] o.a.s.c.LeaderElector Watching path /overseer_elect/election/95876436540194820-127.0.0.1:41619_-n_0000000000 to know if I could be the leader
   [junit4]   2> 925770 INFO  (TEST-RecoveryZkTest.test-seed#[1007483C57D3B810]) [n:127.0.0.1:38656_    ] o.a.s.c.ZkController Publish node=127.0.0.1:38656_ as DOWN
   [junit4]   2> 925771 INFO  (OverseerStateUpdate-95876436540194820-127.0.0.1:41619_-n_0000000000) [n:127.0.0.1:41619_    ] o.a.s.c.Overseer processMessage: queueSize: 1, message = {
   [junit4]   2>   "operation":"downnode",
   [junit4]   2>   "node_name":"127.0.0.1:38656_"} current state version: 3
   [junit4]   2> 925771 INFO  (OverseerStateUpdate-95876436540194820-127.0.0.1:41619_-n_0000000000) [n:127.0.0.1:41619_    ] o.a.s.c.o.NodeMutator DownNode state invoked for node: 127.0.0.1:38656_
   [junit4]   2> 925872 INFO  (zkCallback-1577-thread-1) [    ] o.a.s.c.c.ZkStateReader A cluster state change: [WatchedEvent state:SyncConnected type:NodeDataChanged path:/clusterstate.json], has occurred - updating... (live nodes size: [1])
   [junit4]   2> 925872 INFO  (zkCallback-1582-thread-1-processing-n:127.0.0.1:38656_) [n:127.0.0.1:38656_    ] o.a.s.c.c.ZkStateReader A cluster state change: [WatchedEvent state:SyncConnected type:NodeDataChanged path:/clusterstate.json], has occurred - updating... (live nodes size: [1])
   [junit4]   2> 925872 INFO  (zkCallback-1575-thread-1-processing-n:127.0.0.1:41619_) [n:127.0.0.1:41619_    ] o.a.s.c.c.ZkStateReader A cluster state change: [WatchedEvent state:SyncConnected type:NodeDataChanged path:/clusterstate.json], has occurred - updating... (live nodes size: [1])
   [junit4]   2> 926771 INFO  (TEST-RecoveryZkTest.test-seed#[1007483C57D3B810]) [n:127.0.0.1:38656_    ] o.a.s.c.ZkController Register node as live in ZooKeeper:/live_nodes/127.0.0.1:38656_
   [junit4]   2> 926771 INFO  (TEST-RecoveryZkTest.test-seed#[1007483C57D3B810]) [n:127.0.0.1:38656_    ] o.a.s.c.c.SolrZkClient makePath: /live_nodes/127.0.0.1:38656_
   [junit4]   2> 926772 INFO  (zkCallback-1577-thread-1) [    ] o.a.s.c.c.ZkStateReader A live node change: [WatchedEvent state:SyncConnected type:NodeChildrenChanged path:/live_nodes], has occurred - updating... (live nodes size: [1])
   [junit4]   2> 926772 INFO  (zkCallback-1575-thread-1-processing-n:127.0.0.1:41619_) [n:127.0.0.1:41619_    ] o.a.s.c.c.ZkStateReader A live node change: [WatchedEvent state:SyncConnected type:NodeChildrenChanged path:/live_nodes], has occurred - updating... (live nodes size: [1])
   [junit4]   2> 926772 INFO  (zkCallback-1582-thread-1-processing-n:127.0.0.1:38656_) [n:127.0.0.1:38656_    ] o.a.s.c.c.ZkStateReader A live node change: [WatchedEvent state:SyncConnected type:NodeChildrenChanged path:/live_nodes], has occurred - updating... (live nodes size: [1])
   [junit4]   2> 926772 INFO  (zkCallback-1577-thread-1) [    ] o.a.s.c.c.ZkStateReader Updated live nodes from ZooKeeper... (1) -> (2)
   [junit4]   2> 926772 INFO  (zkCallback-1575-thread-1-processing-n:127.0.0.1:41619_) [n:127.0.0.1:41619_    ] o.a.s.c.c.ZkStateReader Updated live nodes from ZooKeeper... (1) -> (2)
   [junit4]   2> 926772 INFO  (zkCallback-1582-thread-1-processing-n:127.0.0.1:38656_) [n:127.0.0.1:38656_    ] o.a.s.c.c.ZkStateReader Updated live nodes from ZooKeeper... (1) -> (2)
   [junit4]   2> 926794 INFO  (TEST-RecoveryZkTest.test-seed#[1007483C57D3B810]) [n:127.0.0.1:38656_    ] o.a.s.c.CoreContainer Security conf doesn't exist. Skipping setup for authorization module.
   [junit4]   2> 926794 INFO  (TEST-RecoveryZkTest.test-seed#[1007483C57D3B810]) [n:127.0.0.1:38656_    ] o.a.s.c.CoreContainer No authentication plugin used.
   [junit4]   2> 926794 INFO  (TEST-RecoveryZkTest.test-seed#[1007483C57D3B810]) [n:127.0.0.1:38656_    ] o.a.s.c.CorePropertiesLocator Looking for core definitions underneath /home/jenkins/workspace/Lucene-Solr-6.x-Linux/solr/build/solr-core/test/J2/temp/solr.cloud.RecoveryZkTest_1007483C57D3B810-001/shard-1-001/cores
   [junit4]   2> 926795 INFO  (TEST-RecoveryZkTest.test-seed#[1007483C57D3B810]) [n:127.0.0.1:38656_    ] o.a.s.c.CoreDescriptor Created CoreDescriptor: {name=collection1, config=solrconfig.xml, transient=false, schema=schema.xml, loadOnStartup=true, configSetProperties=configsetprops.json, collection=collection1, coreNodeName=, dataDir=data/, shard=}
   [junit4]   2> 926795 INFO  (TEST-RecoveryZkTest.test-seed#[1007483C57D3B810]) [n:127.0.0.1:38656_    ] o.a.s.c.CorePropertiesLocator Found core collection1 in /home/jenkins/workspace/Lucene-Solr-6.x-Linux/solr/build/solr-core/test/J2/temp/solr.cloud.RecoveryZkTest_1007483C57D3B810-001/shard-1-001/cores/collection1
   [junit4]   2> 926795 INFO  (TEST-RecoveryZkTest.test-seed#[1007483C57D3B810]) [n:127.0.0.1:38656_    ] o.a.s.c.CorePropertiesLocator Found 1 core definitions
   [junit4]   2> 926797 INFO  (coreLoadExecutor-4150-thread-1-processing-n:127.0.0.1:38656_) [n:127.0.0.1:38656_ c:collection1   x:collection1] o.a.s.c.ZkController publishing state=down
   [junit4]   2> 926797 INFO  (coreLoadExecutor-4150-thread-1-processing-n:127.0.0.1:38656_) [n:127.0.0.1:38656_ c:collection1   x:collection1] o.a.s.c.ZkController numShards not found on descriptor - reading it from system property
   [junit4]   2> 926811 INFO  (coreLoadExecutor-4150-thread-1-processing-n:127.0.0.1:38656_) [n:127.0.0.1:38656_ c:collection1   x:collection1] o.a.s.c.ZkController Collection collection1 not visible yet, but flagging it so a watch is registered when it becomes visible
   [junit4]   2> 926811 INFO  (coreLoadExecutor-4150-thread-1-processing-n:127.0.0.1:38656_) [n:127.0.0.1:38656_ c:collection1   x:collection1] o.a.s.c.c.ZkStateReader addZkWatch [collection1]
   [junit4]   2> 926811 INFO  (OverseerStateUpdate-95876436540194820-127.0.0.1:41619_-n_0000000000) [n:127.0.0.1:41619_    ] o.a.s.c.Overseer processMessage: queueSize: 1, message = {
   [junit4]   2>   "core":"collection1",
   [junit4]   2>   "roles":null,
   [junit4]   2>   "base_url":"http://127.0.0.1:38656",
   [junit4]   2>   "node_name":"127.0.0.1:38656_",
   [junit4]   2>   "numShards":"1",
   [junit4]   2>   "state":"down",
   [junit4]   2>   "shard":null,
   [junit4]   2>   "collection":"collection1",
   [junit4]   2>   "operation":"state"} current state version: 4
   [junit4]   2> 926812 INFO  (coreLoadExecutor-4150-thread-1-processing-n:127.0.0.1:38656_) [n:127.0.0.1:38656_ c:collection1   x:collection1] o.a.s.c.c.ZkStateReader Deleting data for [collection1]
   [junit4]   2> 926812 INFO  (OverseerStateUpdate-95876436540194820-127.0.0.1:41619_-n_0000000000) [n:127.0.0.1:41619_    ] o.a.s.c.o.ReplicaMutator Update state numShards=1 message={
   [junit4]   2>   "core":"collection1",
   [junit4]   2>   "roles":null,
   [junit4]   2>   "base_url":"http://127.0.0.1:38656",
   [junit4]   2>   "node_name":"127.0.0.1:38656_",
   [junit4]   2>   "numShards":"1",
   [junit4]   2>   "state":"down",
   [junit4]   2>   "shard":null,
   [junit4]   2>   "collection":"collection1",
   [junit4]   2>   "operation":"state"}
   [junit4]   2> 926812 INFO  (coreLoadExecutor-4150-thread-1-processing-n:127.0.0.1:38656_) [n:127.0.0.1:38656_ c:collection1   x:collection1] o.a.s.c.ZkController look for our core node name
   [junit4]   2> 926812 INFO  (OverseerStateUpdate-95876436540194820-127.0.0.1:41619_-n_0000000000) [n:127.0.0.1:41619_    ] o.a.s.c.o.ClusterStateMutator building a new cName: collection1
   [junit4]   2> 926812 INFO  (OverseerStateUpdate-95876436540194820-127.0.0.1:41619_-n_0000000000) [n:127.0.0.1:41619_    ] o.a.s.c.o.ReplicaMutator Assigning new node to shard shard=shard1
   [junit4]   2> 926812 INFO  (TEST-RecoveryZkTest.test-seed#[1007483C57D3B810]) [n:127.0.0.1:38656_    ] o.a.s.s.SolrDispatchFilter user.dir=/home/jenkins/workspace/Lucene-Solr-6.x-Linux/solr/build/solr-core/test/J2
   [junit4]   2> 926812 INFO  (TEST-RecoveryZkTest.test-seed#[1007483C57D3B810]) [n:127.0.0.1:38656_    ] o.a.s.s.SolrDispatchFilter SolrDispatchFilter.init() done
   [junit4]   2> 926913 INFO  (zkCallback-1577-thread-1) [    ] o.a.s.c.c.ZkStateReader A cluster state change: [WatchedEvent state:SyncConnected type:NodeDataChanged path:/clusterstate.json], has occurred - updating... (live nodes size: [2])
   [junit4]   2> 926913 INFO  (zkCallback-1582-thread-1-processing-n:127.0.0.1:38656_) [n:127.0.0.1:38656_    ] o.a.s.c.c.ZkStateReader A cluster state change: [WatchedEvent state:SyncConnected type:NodeDataChanged path:/clusterstate.json], has occurred - updating... (live nodes size: [2])
   [junit4]   2> 926914 INFO  (zkCallback-1575-thread-1-processing-n:127.0.0.1:41619_) [n:127.0.0.1:41619_    ] o.a.s.c.c.ZkStateReader A cluster state change: [WatchedEvent state:SyncConnected type:NodeDataChanged path:/clusterstate.json], has occurred - updating... (live nodes size: [2])
   [junit4]   2> 927812 INFO  (coreLoadExecutor-4150-thread-1-processing-n:127.0.0.1:38656_) [n:127.0.0.1:38656_ c:collection1   x:collection1] o.a.s.c.ZkController waiting to find shard id in clusterstate for collection1
   [junit4]   2> 927812 INFO  (coreLoadExecutor-4150-thread-1-processing-n:127.0.0.1:38656_) [n:127.0.0.1:38656_ c:collection1   x:collection1] o.a.s.c.ZkController Check for collection zkNode:collection1
   [junit4]   2> 927813 INFO  (coreLoadExecutor-4150-thread-1-processing-n:127.0.0.1:38656_) [n:127.0.0.1:38656_ c:collection1   x:collection1] o.a.s.c.ZkController Collection zkNode exists
   [junit4]   2> 927813 INFO  (coreLoadExecutor-4150-thread-1-processing-n:127.0.0.1:38656_) [n:127.0.0.1:38656_ c:collection1   x:collection1] o.a.s.c.c.ZkStateReader Load collection config from: [/collections/collection1]
   [junit4]   2> 927813 INFO  (coreLoadExecutor-4150-thread-1-processing-n:127.0.0.1:38656_) [n:127.0.0.1:38656_ c:collection1   x:collection1] o.a.s.c.c.ZkStateReader path=[/collections/collection1] [configName]=[conf1] specified config exists in ZooKeeper
   [junit4]   2> 927813 INFO  (coreLoadExecutor-4150-thread-1-processing-n:127.0.0.1:38656_) [n:127.0.0.1:38656_ c:collection1   x:collection1] o.a.s.c.SolrResourceLoader new SolrResourceLoader for directory: '/home/jenkins/workspace/Lucene-Solr-6.x-Linux/solr/build/solr-core/test/J2/temp/solr.cloud.RecoveryZkTest_1007483C57D3B810-001/shard-1-001/cores/collection1'
   [junit4]   2> 927814 INFO  (coreLoadExecutor-4150-thread-1-processing-n:127.0.0.1:38656_) [n:127.0.0.1:38656_ c:collection1   x:collection1] o.a.s.c.SolrResourceLoader JNDI not configured for solr (NoInitialContextEx)
   [junit4]   2> 927814 INFO  (coreLoadExecutor-4150-thread-1-processing-n:127.0.0.1:38656_) [n:127.0.0.1:38656_ c:collection1   x:collection1] o.a.s.c.SolrResourceLoader solr home defaulted to 'solr/' (could not find system property or JNDI)
   [junit4]   2> 927814 INFO  (coreLoadExecutor-4150-thread-1-processing-n:127.0.0.1:38656_) [n:127.0.0.1:38656_ c:collection1   x:collection1] o.a.s.c.Config loaded config solrconfig.xml with version 0 
   [junit4]   2> 927818 INFO  (coreLoadExecutor-4150-thread-1-processing-n:127.0.0.1:38656_) [n:127.0.0.1:38656_ c:collection1   x:collection1] o.a.s.c.SolrConfig current version of requestparams : -1
   [junit4]   2> 927821 INFO  (coreLoadExecutor-4150-thread-1-processing-n:127.0.0.1:38656_) [n:127.0.0.1:38656_ c:collection1   x:collection1] o.a.s.c.SolrConfig Using Lucene MatchVersion: 6.1.0
   [junit4]   2> 927828 INFO  (coreLoadExecutor-4150-thread-1-processing-n:127.0.0.1:38656_) [n:127.0.0.1:38656_ c:collection1   x:collection1] o.a.s.c.SolrConfig Loaded SolrConfig: solrconfig.xml
   [junit4]   2> 927832 INFO  (coreLoadExecutor-4150-thread-1-processing-n:127.0.0.1:38656_) [n:127.0.0.1:38656_ c:collection1   x:collection1] o.a.s.s.IndexSchema [collection1] Schema name=test
   [junit4]   2> 927915 INFO  (coreLoadExecutor-4150-thread-1-processing-n:127.0.0.1:38656_) [n:127.0.0.1:38656_ c:collection1   x:collection1] o.a.s.s.IndexSchema default search field in schema is text
   [junit4]   2> 927916 INFO  (coreLoadExecutor-4150-thread-1-processing-n:127.0.0.1:38656_) [n:127.0.0.1:38656_ c:collection1   x:collection1] o.a.s.s.IndexSchema unique key field: id
   [junit4]   2> 927916 INFO  (coreLoadExecutor-4150-thread-1-processing-n:127.0.0.1:38656_) [n:127.0.0.1:38656_ c:collection1   x:collection1] o.a.s.s.FileExchangeRateProvider Reloading exchange rates from file currency.xml
   [junit4]   2> 927918 INFO  (coreLoadExecutor-4150-thread-1-processing-n:127.0.0.1:38656_) [n:127.0.0.1:38656_ c:collection1   x:collection1] o.a.s.s.FileExchangeRateProvider Reloading exchange rates from file currency.xml
   [junit4]   2> 927924 INFO  (coreLoadExecutor-4150-thread-1-processing-n:127.0.0.1:38656_) [n:127.0.0.1:38656_ c:collection1   x:collection1] o.a.s.c.ConfigSetProperties Did not find ConfigSet properties, assuming default properties: Can't find resource 'configsetprops.json' in classpath or '/configs/conf1', cwd=/home/jenkins/workspace/Lucene-Solr-6.x-Linux/solr/build/solr-core/test/J2
   [junit4]   2> 927924 INFO  (coreLoadExecutor-4150-thread-1-processing-n:127.0.0.1:38656_) [n:127.0.0.1:38656_ c:collection1   x:collection1] o.a.s.c.CoreContainer Creating SolrCore 'collection1' using configuration from collection collection1
   [junit4]   2> 927924 INFO  (coreLoadExecutor-4150-thread-1-processing-n:127.0.0.1:38656_) [n:127.0.0.1:38656_ c:collection1 s:shard1 r:core_node1 x:collection1] o.a.s.c.SolrCore org.apache.solr.core.MockDirectoryFactory
   [junit4]   2> 927924 INFO  (coreLoadExecutor-4150-thread-1-processing-n:127.0.0.1:38656_) [n:127.0.0.1:38656_ c:collection1 s:shard1 r:core_node1 x:collection1] o.a.s.c.SolrCore [[collection1] ] Opening new SolrCore at [/home/jenkins/workspace/Lucene-Solr-6.x-Linux/solr/build/solr-core/test/J2/temp/solr.cloud.RecoveryZkTest_1007483C57D3B810-001/shard-1-001/cores/collection1], dataDir=[/home/jenkins/workspace/Lucene-Solr-6.x-Linux/solr/build/solr-core/test/J2/temp/solr.cloud.RecoveryZkTest_1007483C57D3B810-001/shard-1-001/cores/collection1/data/]
   [junit4]   2> 927924 INFO  (coreLoadExecutor-4150-thread-1-processing-n:127.0.0.1:38656_) [n:127.0.0.1:38656_ c:collection1 s:shard1 r:core_node1 x:collection1] o.a.s.c.JmxMonitoredMap JMX monitoring is enabled. Adding Solr mbeans to JMX Server: com.sun.jmx.mbeanserver.JmxMBeanServer@68634fa2
   [junit4]   2> 927925 INFO  (coreLoadExecutor-4150-thread-1-processing-n:127.0.0.1:38656_) [n:127.0.0.1:38656_ c:collection1 s:shard1 r:core_node1 x:collection1] o.a.s.c.CachingDirectoryFactory return new directory for /home/jenkins/workspace/Lucene-Solr-6.x-Linux/solr/build/solr-core/test/J2/temp/solr.cloud.RecoveryZkTest_1007483C57D3B810-001/shard-1-001/cores/collection1/data
   [junit4]   2> 927925 INFO  (coreLoadExecutor-4150-thread-1-processing-n:127.0.0.1:38656_) [n:127.0.0.1:38656_ c:collection1 s:shard1 r:core_node1 x:collection1] o.a.s.c.SolrCore New index directory detected: old=null new=/home/jenkins/workspace/Lucene-Solr-6.x-Linux/solr/build/solr-core/test/J2/temp/solr.cloud.RecoveryZkTest_1007483C57D3B810-001/shard-1-001/cores/collection1/data/index/
   [junit4]   2> 927925 WARN  (coreLoadExecutor-4150-thread-1-processing-n:127.0.0.1:38656_) [n:127.0.0.1:38656_ c:collection1 s:shard1 r:core_node1 x:collection1] o.a.s.c.SolrCore [collection1] Solr index directory '/home/jenkins/workspace/Lucene-Solr-6.x-Linux/solr/build/solr-core/test/J2/temp/solr.cloud.RecoveryZkTest_1007483C57D3B810-001/shard-1-001/cores/collection1/data/index' doesn't exist. Creating new index...
   [junit4]   2> 927925 INFO  (coreLoadExecutor-4150-thread-1-processing-n:127.0.0.1:38656_) [n:127.0.0.1:38656_ c:collection1 s:shard1 r:core_node1 x:collection1] o.a.s.c.CachingDirectoryFactory return new directory for /home/jenkins/workspace/Lucene-Solr-6.x-Linux/solr/build/solr-core/test/J2/temp/solr.cloud.RecoveryZkTest_1007483C57D3B810-001/shard-1-001/cores/collection1/data/index
   [junit4]   2> 927926 INFO  (coreLoadExecutor-4150-thread-1-processing-n:127.0.0.1:38656_) [n:127.0.0.1:38656_ c:collection1 s:shard1 r:core_node1 x:collection1] o.a.s.u.RandomMergePolicy RandomMergePolicy wrapping class org.apache.lucene.index.LogByteSizeMergePolicy: [LogByteSizeMergePolicy: minMergeSize=1677721, mergeFactor=49, maxMergeSize=2147483648, maxMergeSizeForForcedMerge=9223372036854775807, calibrateSizeByDeletes=true, maxMergeDocs=2147483647, maxCFSSegmentSizeMB=8.796093022207999E12, noCFSRatio=0.4493667442127596]
   [junit4]   2> 927926 INFO  (coreLoadExecutor-4150-thread-1-processing-n:127.0.0.1:38656_) [n:127.0.0.1:38656_ c:collection1 s:shard1 r:core_node1 x:collection1] o.a.s.c.SolrDeletionPolicy SolrDeletionPolicy.onCommit: commits: num=1
   [junit4]   2> 	commit{dir=MockDirectoryWrapper(RAMDirectory@3d036001 lockFactory=org.apache.lucene.store.SingleInstanceLockFactory@4b088184),segFN=segments_1,generation=1}
   [junit4]   2> 927927 INFO  (coreLoadExecutor-4150-thread-1-processing-n:127.0.0.1:38656_) [n:127.0.0.1:38656_ c:collection1 s:shard1 r:core_node1 x:collection1] o.a.s.c.SolrDeletionPolicy newest commit generation = 1
   [junit4]   2> 927927 INFO  (OldIndexDirectoryCleanupThreadForCore-collection1) [n:127.0.0.1:38656_ c:collection1 s:shard1 r:core_node1 x:collection1] o.a.s.c.SolrCore Looking for old index directories to cleanup for core collection1 in /home/jenkins/workspace/Lucene-Solr-6.x-Linux/solr/build/solr-core/test/J2/temp/solr.cloud.RecoveryZkTest_1007483C57D3B810-001/shard-1-001/cores/collection1/data/
   [junit4]   2> 927927 WARN  (OldIndexDirectoryCleanupThreadForCore-collection1) [n:127.0.0.1:38656_ c:collection1 s:shard1 r:core_node1 x:collection1] o.a.s.c.DirectoryFactory /home/jenkins/workspace/Lucene-Solr-6.x-Linux/solr/build/solr-core/test/J2/temp/solr.cloud.RecoveryZkTest_1007483C57D3B810-001/shard-1-001/cores/collection1/data/ does not point to a valid data directory; skipping clean-up of old index directories.
   [junit4]   2> 927928 INFO  (coreLoadExecutor-4150-thread-1-processing-n:127.0.0.1:38656_) [n:127.0.0.1:38656_ c:collection1 s:shard1 r:core_node1 x:collection1] o.a.s.u.p.UpdateRequestProcessorChain creating updateRequestProcessorChain "nodistrib"
   [junit4]   2> 927928 INFO  (coreLoadExecutor-4150-thread-1-processing-n:127.0.0.1:38656_) [n:127.0.0.1:38656_ c:collection1 s:shard1 r:core_node1 x:collection1] o.a.s.u.p.UpdateRequestProcessorChain creating updateRequestProcessorChain "dedupe"
   [junit4]   2> 927929 INFO  (coreLoadExecutor-4150-thread-1-processing-n:127.0.0.1:38656_) [n:127.0.0.1:38656_ c:collection1 s:shard1 r:core_node1 x:collection1] o.a.s.u.p.UpdateRequestProcessorChain inserting DistributedUpdateProcessorFactory into updateRequestProcessorChain "dedupe"
   [junit4]   2> 927929 INFO  (coreLoadExecutor-4150-thread-1-processing-n:127.0.0.1:38656_) [n:127.0.0.1:38656_ c:collection1 s:shard1 r:core_node1 x:collection1] o.a.s.u.p.UpdateRequestProcessorChain creating updateRequestProcessorChain "stored_sig"
   [junit4]   2> 927929 INFO  (coreLoadExecutor-4150-thread-1-processing-n:127.0.0.1:38656_) [n:127.0.0.1:38656_ c:collection1 s:shard1 r:core_node1 x:collection1] o.a.s.u.p.UpdateRequestProcessorChain inserting DistributedUpdateProcessorFactory into updateRequestProcessorChain "stored_sig"
   [junit4]   2> 927929 INFO  (coreLoadExecutor-4150-thread-1-processing-n:127.0.0.1:38656_) [n:127.0.0.1:38656_ c:collection1 s:shard1 r:core_node1 x:collection1] o.a.s.u.p.UpdateRequestProcessorChain creating updateRequestProcessorChain "distrib-dup-test-chain-explicit"
   [junit4]   2> 927929 INFO  (coreLoadExecutor-4150-thread-1-processing-n:127.0.0.1:38656_) [n:127.0.0.1:38656_ c:collection1 s:shard1 r:core_node1 x:collection1] o.a.s.u.p.UpdateRequestProcessorChain creating updateRequestProcessorChain "distrib-dup-test-chain-implicit"
   [junit4]   2> 927929 INFO  (coreLoadExecutor-4150-thread-1-processing-n:127.0.0.1:38656_) [n:127.0.0.1:38656_ c:collection1 s:shard1 r:core_node1 x:collection1] o.a.s.u.p.UpdateRequestProcessorChain inserting DistributedUpdateProcessorFactory into updateRequestProcessorChain "distrib-dup-test-chain-implicit"
   [junit4]   2> 927929 INFO  (coreLoadExecutor-4150-thread-1-processing-n:127.0.0.1:38656_) [n:127.0.0.1:38656_ c:collection1 s:shard1 r:core_node1 x:collection1] o.a.s.c.SolrCore no updateRequestProcessorChain defined as default, creating implicit default
   [junit4]   2> 927929 WARN  (coreLoadExecutor-4150-thread-1-processing-n:127.0.0.1:38656_) [n:127.0.0.1:38656_ c:collection1 s:shard1 r:core_node1 x:collection1] o.a.s.c.RequestHandlers INVALID paramSet a in requestHandler {type = requestHandler,name = /dump,class = DumpRequestHandler,args = {defaults={a=A,b=B}}}
   [junit4]   2> 927930 INFO  (coreLoadExecutor-4150-thread-1-processing-n:127.0.0.1:38656_) [n:127.0.0.1:38656_ c:collection1 s:shard1 r:core_node1 x:collection1] o.a.s.h.l.XMLLoader xsltCacheLifetimeSeconds=60
   [junit4]   2> 927931 INFO  (coreLoadExecutor-4150-thread-1-processing-n:127.0.0.1:38656_) [n:127.0.0.1:38656_ c:collection1 s:shard1 r:core_node1 x:collection1] o.a.s.h.l.XMLLoader xsltCacheLifetimeSeconds=60
   [junit4]   2> 927931 INFO  (coreLoadExecutor-4150-thread-1-processing-n:127.0.0.1:38656_) [n:127.0.0.1:38656_ c:collection1 s:shard1 r:core_node1 x:collection1] o.a.s.h.l.XMLLoader xsltCacheLifetimeSeconds=60
   [junit4]   2> 927932 INFO  (coreLoadExecutor-4150-thread-1-processing-n:127.0.0.1:38656_) [n:127.0.0.1:38656_ c:collection1 s:shard1 r:core_node1 x:collection1] o.a.s.h.l.XMLLoader xsltCacheLifetimeSeconds=60
   [junit4]   2> 927935 INFO  (coreLoadExecutor-4150-thread-1-processing-n:127.0.0.1:38656_) [n:127.0.0.1:38656_ c:collection1 s:shard1 r:core_node1 x:collection1] o.a.s.c.RequestHandlers Registered paths: /admin/mbeans,standard,/update/json/docs,/admin/luke,/export,/get,/admin/properties,/update/json,/admin/threads,/dump,/update/csv,/sql,/graph,/admin/segments,/admin/system,/replication,/config,/stream,/schema,/admin/plugins,/admin/logging,/admin/ping,/update,/admin/file
   [junit4]   2> 927935 INFO  (coreLoadExecutor-4150-thread-1-processing-n:127.0.0.1:38656_) [n:127.0.0.1:38656_ c:collection1 s:shard1 r:core_node1 x:collection1] o.a.s.c.SolrCore Using default statsCache cache: org.apache.solr.search.stats.LocalStatsCache
   [junit4]   2> 927935 INFO  (coreLoadExecutor-4150-thread-1-processing-n:127.0.0.1:38656_) [n:127.0.0.1:38656_ c:collection1 s:shard1 r:core_node1 x:collection1] o.a.s.u.UpdateHandler Using UpdateLog implementation: org.apache.solr.update.UpdateLog
   [junit4]   2> 927936 INFO  (coreLoadExecutor-4150-thread-1-processing-n:127.0.0.1:38656_) [n:127.0.0.1:38656_ c:collection1 s:shard1 r:core_node1 x:collection1] o.a.s.u.UpdateLog Initializing UpdateLog: dataDir= defaultSyncLevel=FLUSH numRecordsToKeep=100 maxNumLogsToKeep=10 numVersionBuckets=65536
   [junit4]   2> 927938 INFO  (coreLoadExecutor-4150-thread-1-processing-n:127.0.0.1:38656_) [n:127.0.0.1:38656_ c:collection1 s:shard1 r:core_node1 x:collection1] o.a.s.u.CommitTracker Hard AutoCommit: disabled
   [junit4]   2> 927938 INFO  (coreLoadExecutor-4150-thread-1-processing-n:127.0.0.1:38656_) [n:127.0.0.1:38656_ c:collection1 s:shard1 r:core_node1 x:collecti

[...truncated too long message...]

002
   [junit4]   2> 	at org.apache.zookeeper.KeeperException.create(KeeperException.java:127)
   [junit4]   2> 	at org.apache.zookeeper.KeeperException.create(KeeperException.java:51)
   [junit4]   2> 	at org.apache.zookeeper.ZooKeeper.delete(ZooKeeper.java:873)
   [junit4]   2> 	at org.apache.solr.common.cloud.SolrZkClient$2.execute(SolrZkClient.java:244)
   [junit4]   2> 	at org.apache.solr.common.cloud.SolrZkClient$2.execute(SolrZkClient.java:241)
   [junit4]   2> 	at org.apache.solr.common.cloud.ZkCmdExecutor.retryOperation(ZkCmdExecutor.java:60)
   [junit4]   2> 	at org.apache.solr.common.cloud.SolrZkClient.delete(SolrZkClient.java:241)
   [junit4]   2> 	at org.apache.solr.cloud.ElectionContext.cancelElection(ElectionContext.java:86)
   [junit4]   2> 	at org.apache.solr.cloud.ShardLeaderElectionContextBase.cancelElection(ElectionContext.java:143)
   [junit4]   2> 	at org.apache.solr.cloud.ShardLeaderElectionContext.cancelElection(ElectionContext.java:279)
   [junit4]   2> 	at org.apache.solr.cloud.ShardLeaderElectionContext.runLeaderProcess(ElectionContext.java:455)
   [junit4]   2> 	at org.apache.solr.cloud.LeaderElector.runIamLeaderProcess(LeaderElector.java:170)
   [junit4]   2> 	at org.apache.solr.cloud.LeaderElector.checkIfIamLeader(LeaderElector.java:135)
   [junit4]   2> 	at org.apache.solr.cloud.LeaderElector.access$200(LeaderElector.java:56)
   [junit4]   2> 	at org.apache.solr.cloud.LeaderElector$ElectionWatcher.process(LeaderElector.java:348)
   [junit4]   2> 	at org.apache.solr.common.cloud.SolrZkClient$3.lambda$process$0(SolrZkClient.java:266)
   [junit4]   2> 	at java.util.concurrent.Executors$RunnableAdapter.call(Executors.java:511)
   [junit4]   2> 	at java.util.concurrent.FutureTask.run(FutureTask.java:266)
   [junit4]   2> 	at org.apache.solr.common.util.ExecutorUtil$MDCAwareThreadPoolExecutor.lambda$execute$0(ExecutorUtil.java:229)
   [junit4]   2> 	at java.util.concurrent.ThreadPoolExecutor.runWorker(ThreadPoolExecutor.java:1142)
   [junit4]   2> 	at java.util.concurrent.ThreadPoolExecutor$Worker.run(ThreadPoolExecutor.java:617)
   [junit4]   2> 	at java.lang.Thread.run(Thread.java:745)
   [junit4]   2> 962062 INFO  (TEST-RecoveryZkTest.test-seed#[1007483C57D3B810]) [    ] o.e.j.s.ServerConnector Stopped ServerConnector@5c228cb7{HTTP/1.1,[http/1.1]}{127.0.0.1:41530}
   [junit4]   2> 962062 INFO  (TEST-RecoveryZkTest.test-seed#[1007483C57D3B810]) [    ] o.e.j.s.h.ContextHandler Stopped o.e.j.s.ServletContextHandler@4e670ad0{/,null,UNAVAILABLE}
   [junit4]   2> 962067 INFO  (TEST-RecoveryZkTest.test-seed#[1007483C57D3B810]) [    ] o.a.s.c.ChaosMonkey monkey: stop shard! 41619
   [junit4]   2> 962067 INFO  (TEST-RecoveryZkTest.test-seed#[1007483C57D3B810]) [    ] o.a.s.c.ZkTestServer connecting to 127.0.0.1:39180 39180
   [junit4]   2> 962082 INFO  (Thread-2535) [    ] o.a.s.c.ZkTestServer connecting to 127.0.0.1:39180 39180
   [junit4]   2> 962084 WARN  (Thread-2535) [    ] o.a.s.c.ZkTestServer Watch limit violations: 
   [junit4]   2> Maximum concurrent create/delete watches above limit:
   [junit4]   2> 
   [junit4]   2> 	5	/solr/aliases.json
   [junit4]   2> 	4	/solr/security.json
   [junit4]   2> 	4	/solr/configs/conf1
   [junit4]   2> 	3	/solr/collections/collection1/state.json
   [junit4]   2> 
   [junit4]   2> Maximum concurrent data watches above limit:
   [junit4]   2> 
   [junit4]   2> 	5	/solr/clusterstate.json
   [junit4]   2> 	2	/solr/overseer_elect/election/95876436540194824-127.0.0.1:38656_-n_0000000001
   [junit4]   2> 	2	/solr/collections/collection1/leader_elect/shard1/election/95876436540194824-core_node1-n_0000000000
   [junit4]   2> 
   [junit4]   2> Maximum concurrent children watches above limit:
   [junit4]   2> 
   [junit4]   2> 	5	/solr/collections
   [junit4]   2> 	4	/solr/live_nodes
   [junit4]   2> 	2	/solr/overseer/queue
   [junit4]   2> 	2	/solr/overseer/collection-queue-work
   [junit4]   2> 
   [junit4]   2> NOTE: reproduce with: ant test  -Dtestcase=RecoveryZkTest -Dtests.method=test -Dtests.seed=1007483C57D3B810 -Dtests.multiplier=3 -Dtests.slow=true -Dtests.locale=sr-RS -Dtests.timezone=America/Araguaina -Dtests.asserts=true -Dtests.file.encoding=UTF-8
   [junit4] ERROR   38.2s J2 | RecoveryZkTest.test <<<
   [junit4]    > Throwable #1: com.carrotsearch.randomizedtesting.UncaughtExceptionError: Captured an uncaught exception in thread: Thread[id=8483, name=updateExecutor-1579-thread-2, state=RUNNABLE, group=TGRP-RecoveryZkTest]
   [junit4]    > 	at __randomizedtesting.SeedInfo.seed([1007483C57D3B810:985377E6F92FD5E8]:0)
   [junit4]    > Caused by: org.apache.solr.common.SolrException: Replica: http://127.0.0.1:41530/collection1/ should have been marked under leader initiated recovery in ZkController but wasn't.
   [junit4]    > 	at __randomizedtesting.SeedInfo.seed([1007483C57D3B810]:0)
   [junit4]    > 	at org.apache.solr.cloud.LeaderInitiatedRecoveryThread.run(LeaderInitiatedRecoveryThread.java:88)
   [junit4]    > 	at org.apache.solr.common.util.ExecutorUtil$MDCAwareThreadPoolExecutor.lambda$execute$0(ExecutorUtil.java:229)
   [junit4]    > 	at java.util.concurrent.ThreadPoolExecutor.runWorker(ThreadPoolExecutor.java:1142)
   [junit4]    > 	at java.util.concurrent.ThreadPoolExecutor$Worker.run(ThreadPoolExecutor.java:617)
   [junit4]    > 	at java.lang.Thread.run(Thread.java:745)
   [junit4]   2> 962087 INFO  (SUITE-RecoveryZkTest-seed#[1007483C57D3B810]-worker) [    ] o.a.s.SolrTestCaseJ4 ###deleteCore
   [junit4]   2> May 11, 2016 9:19:19 AM com.carrotsearch.randomizedtesting.ThreadLeakControl checkThreadLeaks
   [junit4]   2> WARNING: Will linger awaiting termination of 2 leaked thread(s).
   [junit4]   2> NOTE: test params are: codec=Asserting(Lucene60): {rnd_b=PostingsFormat(name=LuceneVarGapFixedInterval), _version_=BlockTreeOrds(blocksize=128), a_t=FST50, a_i=PostingsFormat(name=LuceneVarGapFixedInterval), id=PostingsFormat(name=LuceneVarGapFixedInterval)}, docValues:{}, maxPointsInLeafNode=1956, maxMBSortInHeap=7.469028415381338, sim=RandomSimilarity(queryNorm=true,coord=yes): {}, locale=sr-RS, timezone=America/Araguaina
   [junit4]   2> NOTE: Linux 4.4.0-21-generic amd64/Oracle Corporation 1.8.0_92 (64-bit)/cpus=12,threads=1,free=227418832,total=536870912
   [junit4]   2> NOTE: All tests run in this JVM: [TestCloudInspectUtil, CoreAdminHandlerTest, DirectUpdateHandlerOptimizeTest, CdcrRequestHandlerTest, TestWriterPerf, TestSolrIndexConfig, TestBlendedInfixSuggestions, UpdateParamsTest, TestRTimerTree, UnloadDistributedZkTest, TestCSVResponseWriter, TestExactSharedStatsCache, TestFieldTypeResource, TestNoOpRegenerator, TestTolerantUpdateProcessorCloud, TestJmxIntegration, QueryParsingTest, TestFilteredDocIdSet, ExitableDirectoryReaderTest, TestTolerantSearch, SimpleFacetsTest, TestHdfsUpdateLog, RuleEngineTest, ShowFileRequestHandlerTest, ConnectionManagerTest, TestDistributedMissingSort, TestSolrDeletionPolicy1, TestCollationField, DistributedFacetPivotSmallAdvancedTest, BadIndexSchemaTest, TestRecovery, DirectUpdateHandlerTest, CleanupOldIndexTest, TestCryptoKeys, HdfsRecoveryZkTest, BJQParserTest, DeleteShardTest, TestSolrQueryResponse, TestDefaultSearchFieldResource, ExplicitHLLTest, StatelessScriptUpdateProcessorFactoryTest, TestManagedStopFilterFactory, RollingRestartTest, HLLUtilTest, TestSolrQueryParserDefaultOperatorResource, SuggesterTest, MigrateRouteKeyTest, DataDrivenBlockJoinTest, CoreAdminRequestStatusTest, AddBlockUpdateTest, PrimitiveFieldTypeTest, TestMacros, TermVectorComponentDistributedTest, TestInitQParser, ChangedSchemaMergeTest, CollectionsAPISolrJTest, RegexBoostProcessorTest, TestSuggestSpellingConverter, ZkStateReaderTest, TestGroupingSearch, DebugComponentTest, TestCharFilters, DistributedVersionInfoTest, DocValuesMultiTest, TestJmxMonitoredMap, BigEndianAscendingWordDeserializerTest, SuggesterWFSTTest, SimpleMLTQParserTest, SolrTestCaseJ4Test, TestSolrJ, TestUtils, TestPostingsSolrHighlighter, AtomicUpdatesTest, TestSearchPerf, OverriddenZkACLAndCredentialsProvidersTest, TestIndexSearcher, TestReload, TestRebalanceLeaders, TestSolrConfigHandlerCloud, TestHighFrequencyDictionaryFactory, HdfsThreadLeakTest, TestStressReorder, XmlUpdateRequestHandlerTest, AnalyticsMergeStrategyTest, BadComponentTest, CurrencyFieldXmlFileTest, TestCollationFieldDocValues, TestSweetSpotSimilarityFactory, TestSchemaManager, DateMathParserTest, TestInfoStreamLogging, TestRandomCollapseQParserPlugin, BasicDistributedZk2Test, PreAnalyzedUpdateProcessorTest, TestReversedWildcardFilterFactory, TestSolrQueryParser, SimpleCollectionCreateDeleteTest, ChaosMonkeySafeLeaderTest, OverseerTest, ShardRoutingTest, BasicZkTest, RecoveryZkTest]
   [junit4] Completed [283/598 (1!)] on J2 in 38.99s, 1 test, 1 error <<< FAILURES!

[...truncated 1012 lines...]
BUILD FAILED
/home/jenkins/workspace/Lucene-Solr-6.x-Linux/build.xml:740: The following error occurred while executing this line:
/home/jenkins/workspace/Lucene-Solr-6.x-Linux/build.xml:684: The following error occurred while executing this line:
/home/jenkins/workspace/Lucene-Solr-6.x-Linux/build.xml:59: The following error occurred while executing this line:
/home/jenkins/workspace/Lucene-Solr-6.x-Linux/solr/build.xml:233: The following error occurred while executing this line:
/home/jenkins/workspace/Lucene-Solr-6.x-Linux/solr/common-build.xml:529: The following error occurred while executing this line:
/home/jenkins/workspace/Lucene-Solr-6.x-Linux/lucene/common-build.xml:1457: The following error occurred while executing this line:
/home/jenkins/workspace/Lucene-Solr-6.x-Linux/lucene/common-build.xml:1014: There were test failures: 598 suites (10 ignored), 2419 tests, 1 error, 115 ignored (71 assumptions) [seed: 1007483C57D3B810]

Total time: 61 minutes 33 seconds
Build step 'Invoke Ant' marked build as failure
Archiving artifacts
[WARNINGS] Skipping publisher since build result is FAILURE
Recording test results
Email was triggered for: Failure - Any
Sending email for trigger: Failure - Any