You are viewing a plain text version of this content. The canonical link for it is here.
Posted to dev@tamaya.apache.org by Apache Jenkins Server <je...@builds.apache.org> on 2017/11/07 02:04:01 UTC
Jenkins build is still unstable: Tamaya-Extensions-Master #1130
See <https://builds.apache.org/job/Tamaya-Extensions-Master/1130/display/redirect>
Jenkins build is back to stable : Tamaya-Extensions-Master #1140
Posted by Apache Jenkins Server <je...@builds.apache.org>.
See <https://builds.apache.org/job/Tamaya-Extensions-Master/1140/display/redirect>
Jenkins build is still unstable: Tamaya-Extensions-Master #1139
Posted by Apache Jenkins Server <je...@builds.apache.org>.
See <https://builds.apache.org/job/Tamaya-Extensions-Master/1139/display/redirect>
Jenkins build is still unstable: Tamaya-Extensions-Master #1138
Posted by Apache Jenkins Server <je...@builds.apache.org>.
See <https://builds.apache.org/job/Tamaya-Extensions-Master/1138/display/redirect?page=changes>
Jenkins build is still unstable: Tamaya-Extensions-Master #1137
Posted by Apache Jenkins Server <je...@builds.apache.org>.
See <https://builds.apache.org/job/Tamaya-Extensions-Master/1137/display/redirect?page=changes>
Jenkins build is still unstable: Tamaya-Extensions-Master #1136
Posted by Apache Jenkins Server <je...@builds.apache.org>.
See <https://builds.apache.org/job/Tamaya-Extensions-Master/1136/display/redirect>
Jenkins build is still unstable: Tamaya-Extensions-Master #1135
Posted by Apache Jenkins Server <je...@builds.apache.org>.
See <https://builds.apache.org/job/Tamaya-Extensions-Master/1135/display/redirect>
Jenkins build is still unstable: Tamaya-Extensions-Master #1134
Posted by Apache Jenkins Server <je...@builds.apache.org>.
See <https://builds.apache.org/job/Tamaya-Extensions-Master/1134/display/redirect>
Jenkins build is unstable: Tamaya-Extensions-Master #1133
Posted by Apache Jenkins Server <je...@builds.apache.org>.
See <https://builds.apache.org/job/Tamaya-Extensions-Master/1133/display/redirect>
Build failed in Jenkins: Tamaya-Extensions-Master #1132
Posted by Apache Jenkins Server <je...@builds.apache.org>.
See <https://builds.apache.org/job/Tamaya-Extensions-Master/1132/display/redirect>
------------------------------------------
Started by upstream project "Tamaya-Master-branch" build number 1261
originally caused by:
Started by timer
Started by upstream project "Tamaya-Master-branch" build number 1261
originally caused by:
Started by timer
[EnvInject] - Loading node environment variables.
[EnvInject] - Preparing an environment for the build.
[EnvInject] - Keeping Jenkins system variables.
[EnvInject] - Keeping Jenkins build variables.
[EnvInject] - Injecting contributions.
Building remotely on ubuntu-6 (ubuntu trusty) in workspace <https://builds.apache.org/job/Tamaya-Extensions-Master/ws/>
> git rev-parse --is-inside-work-tree # timeout=10
Fetching changes from the remote Git repository
> git config remote.origin.url https://git-wip-us.apache.org/repos/asf/incubator-tamaya-extensions.git # timeout=10
Fetching upstream changes from https://git-wip-us.apache.org/repos/asf/incubator-tamaya-extensions.git
> git --version # timeout=10
> git fetch --tags --progress https://git-wip-us.apache.org/repos/asf/incubator-tamaya-extensions.git +refs/heads/*:refs/remotes/origin/*
> git rev-parse refs/remotes/origin/master^{commit} # timeout=10
> git rev-parse refs/remotes/origin/origin/master^{commit} # timeout=10
Checking out Revision 25d326ccaf65ac547b63de991079fd2fae06b1cb (refs/remotes/origin/master)
> git config core.sparsecheckout # timeout=10
> git checkout -f 25d326ccaf65ac547b63de991079fd2fae06b1cb
Commit message: "[TAMAYA-291] The coverage is actual only 34%."
> git rev-list 25d326ccaf65ac547b63de991079fd2fae06b1cb # timeout=10
Parsing POMs
ERROR: Failed to parse POMs
java.io.IOException: remote file operation failed: <https://builds.apache.org/job/Tamaya-Extensions-Master/ws/> at hudson.remoting.Channel@21b86a1a:ubuntu-6: hudson.remoting.ProxyException: hudson.maven.MavenModuleSetBuild$MavenExecutionException: org.apache.maven.project.ProjectBuildingException: Some problems were encountered while processing the POMs:
[FATAL] Non-resolvable parent POM: Could not find artifact org.apache.tamaya.ext:tamaya-extensions:pom:0.4-incubating-SNAPSHOT and 'parent.relativePath' points at no local POM @ line 24, column 13
at hudson.FilePath.act(FilePath.java:994)
at hudson.FilePath.act(FilePath.java:976)
at hudson.maven.MavenModuleSetBuild$MavenModuleSetBuildExecution.parsePoms(MavenModuleSetBuild.java:986)
at hudson.maven.MavenModuleSetBuild$MavenModuleSetBuildExecution.doRun(MavenModuleSetBuild.java:691)
at hudson.model.AbstractBuild$AbstractBuildExecution.run(AbstractBuild.java:496)
at hudson.model.Run.execute(Run.java:1737)
at hudson.maven.MavenModuleSetBuild.run(MavenModuleSetBuild.java:543)
at hudson.model.ResourceController.execute(ResourceController.java:97)
at hudson.model.Executor.run(Executor.java:419)
Caused by: hudson.remoting.ProxyException: hudson.maven.MavenModuleSetBuild$MavenExecutionException: org.apache.maven.project.ProjectBuildingException: Some problems were encountered while processing the POMs:
[FATAL] Non-resolvable parent POM: Could not find artifact org.apache.tamaya.ext:tamaya-extensions:pom:0.4-incubating-SNAPSHOT and 'parent.relativePath' points at no local POM @ line 24, column 13
at hudson.maven.MavenModuleSetBuild$PomParser.invoke(MavenModuleSetBuild.java:1391)
at hudson.maven.MavenModuleSetBuild$PomParser.invoke(MavenModuleSetBuild.java:1125)
at hudson.FilePath$FileCallableWrapper.call(FilePath.java:2750)
at hudson.remoting.UserRequest.perform(UserRequest.java:181)
at hudson.remoting.UserRequest.perform(UserRequest.java:52)
at hudson.remoting.Request$2.run(Request.java:336)
at hudson.remoting.InterceptingExecutorService$1.call(InterceptingExecutorService.java:68)
at java.util.concurrent.FutureTask.run(FutureTask.java:266)
at java.util.concurrent.ThreadPoolExecutor.runWorker(ThreadPoolExecutor.java:1142)
at java.util.concurrent.ThreadPoolExecutor$Worker.run(ThreadPoolExecutor.java:617)
at java.lang.Thread.run(Thread.java:748)
at ......remote call to ubuntu-6(Native Method)
at hudson.remoting.Channel.attachCallSiteStackTrace(Channel.java:1554)
at hudson.remoting.UserResponse.retrieve(UserRequest.java:281)
at hudson.remoting.Channel.call(Channel.java:839)
at hudson.FilePath.act(FilePath.java:987)
... 8 more
Caused by: hudson.remoting.ProxyException: org.apache.maven.project.ProjectBuildingException: Some problems were encountered while processing the POMs:
[FATAL] Non-resolvable parent POM: Could not find artifact org.apache.tamaya.ext:tamaya-extensions:pom:0.4-incubating-SNAPSHOT and 'parent.relativePath' points at no local POM @ line 24, column 13
at org.apache.maven.project.DefaultProjectBuilder.build(DefaultProjectBuilder.java:364)
at hudson.maven.MavenEmbedder.buildProjects(MavenEmbedder.java:361)
at hudson.maven.MavenEmbedder.readProjects(MavenEmbedder.java:331)
at hudson.maven.MavenModuleSetBuild$PomParser.invoke(MavenModuleSetBuild.java:1328)
at hudson.maven.MavenModuleSetBuild$PomParser.invoke(MavenModuleSetBuild.java:1125)
at hudson.FilePath$FileCallableWrapper.call(FilePath.java:2750)
at hudson.remoting.UserRequest.perform(UserRequest.java:181)
at hudson.remoting.UserRequest.perform(UserRequest.java:52)
at hudson.remoting.Request$2.run(Request.java:336)
at hudson.remoting.InterceptingExecutorService$1.call(InterceptingExecutorService.java:68)
at java.util.concurrent.FutureTask.run(FutureTask.java:266)
at java.util.concurrent.ThreadPoolExecutor.runWorker(ThreadPoolExecutor.java:1142)
at java.util.concurrent.ThreadPoolExecutor$Worker.run(ThreadPoolExecutor.java:617)
at java.lang.Thread.run(Thread.java:748)
Jenkins build is still unstable: Tamaya-Extensions-Master #1131
Posted by Apache Jenkins Server <je...@builds.apache.org>.
See <https://builds.apache.org/job/Tamaya-Extensions-Master/1131/display/redirect?page=changes>