You are viewing a plain text version of this content. The canonical link for it is here.
Posted to commits@sling.apache.org by Apache Jenkins Server <je...@builds.apache.org> on 2016/06/24 02:02:47 UTC
Jenkins build is still unstable: sling-trunk-1.8 #3413
See <https://builds.apache.org/job/sling-trunk-1.8/changes>
Build failed in Jenkins: sling-trunk-1.8 #3436
Posted by Apache Jenkins Server <je...@builds.apache.org>.
See <https://builds.apache.org/job/sling-trunk-1.8/3436/changes>
Changes:
[olli] SLING-3027 Improve Launchpad Karaf Features
use latest releases
[bdelacretaz] Use released modules
[bdelacretaz] Rename o.a.s.repoinit.oak-jcr to o.a.s.jcr.repoinit
------------------------------------------
[...truncated 13938 lines...]
A testing/org.apache.sling.testing.paxexam/src/main/java/org/apache/sling/testing/paxexam/SlingOptions.java
A testing/org.apache.sling.testing.paxexam/pom.xml
A testing/org.apache.sling.testing.paxexam/README.md
A testing/tools
A testing/tools/src
A testing/tools/src/test
A testing/tools/src/test/java
A testing/tools/src/test/java/org
A testing/tools/src/test/java/org/apache
A testing/tools/src/test/java/org/apache/sling
A testing/tools/src/test/java/org/apache/sling/testing
A testing/tools/src/test/java/org/apache/sling/testing/tools
A testing/tools/src/test/java/org/apache/sling/testing/tools/test
AU testing/tools/src/test/java/org/apache/sling/testing/tools/test/TestServerSetup.java
AU testing/tools/src/test/java/org/apache/sling/testing/tools/test/ServerSetupSingletonTest.java
AU testing/tools/src/test/java/org/apache/sling/testing/tools/test/TestSetupPhase.java
A testing/tools/src/test/java/org/apache/sling/testing/tools/sling
AU testing/tools/src/test/java/org/apache/sling/testing/tools/sling/SlingClientTest.java
A testing/tools/src/test/java/org/apache/sling/testing/tools/sling/SlingInstancesRuleTest.java
A testing/tools/src/main
A testing/tools/src/main/java
A testing/tools/src/main/java/org
A testing/tools/src/main/java/org/apache
A testing/tools/src/main/java/org/apache/sling
A testing/tools/src/main/java/org/apache/sling/testing
A testing/tools/src/main/java/org/apache/sling/testing/tools
A testing/tools/src/main/java/org/apache/sling/testing/tools/http
AU testing/tools/src/main/java/org/apache/sling/testing/tools/http/Request.java
AU testing/tools/src/main/java/org/apache/sling/testing/tools/http/RequestDocumentor.java
AU testing/tools/src/main/java/org/apache/sling/testing/tools/http/RequestCustomizer.java
AU testing/tools/src/main/java/org/apache/sling/testing/tools/http/RequestBuilder.java
AU testing/tools/src/main/java/org/apache/sling/testing/tools/http/RetryingContentChecker.java
AU testing/tools/src/main/java/org/apache/sling/testing/tools/http/package-info.java
AU testing/tools/src/main/java/org/apache/sling/testing/tools/http/RequestExecutor.java
A testing/tools/src/main/java/org/apache/sling/testing/tools/jarexec
AU testing/tools/src/main/java/org/apache/sling/testing/tools/jarexec/JarExecutor.java
AU testing/tools/src/main/java/org/apache/sling/testing/tools/jarexec/ShutdownHookSingleProcessDestroyer.java
AU testing/tools/src/main/java/org/apache/sling/testing/tools/jarexec/package-info.java
A testing/tools/src/main/java/org/apache/sling/testing/tools/osgi
AU testing/tools/src/main/java/org/apache/sling/testing/tools/osgi/package-info.java
AU testing/tools/src/main/java/org/apache/sling/testing/tools/osgi/WebconsoleClient.java
A testing/tools/src/main/java/org/apache/sling/testing/tools/retry
AU testing/tools/src/main/java/org/apache/sling/testing/tools/retry/package-info.java
AU testing/tools/src/main/java/org/apache/sling/testing/tools/retry/RetryLoop.java
A testing/tools/src/main/java/org/apache/sling/testing/tools/serversetup
AU testing/tools/src/main/java/org/apache/sling/testing/tools/serversetup/ServerSetup.java
AU testing/tools/src/main/java/org/apache/sling/testing/tools/serversetup/ServerSetupSingleton.java
AU testing/tools/src/main/java/org/apache/sling/testing/tools/serversetup/SetupPhase.java
AU testing/tools/src/main/java/org/apache/sling/testing/tools/serversetup/StartRunnableJarPhase.java
AU testing/tools/src/main/java/org/apache/sling/testing/tools/serversetup/package-info.java
A testing/tools/src/main/java/org/apache/sling/testing/tools/junit
AU testing/tools/src/main/java/org/apache/sling/testing/tools/junit/package-info.java
AU testing/tools/src/main/java/org/apache/sling/testing/tools/junit/RemoteLogDumper.java
A testing/tools/src/main/java/org/apache/sling/testing/tools/junit/TestDescriptionRule.java
A testing/tools/src/main/java/org/apache/sling/testing/tools/junit/TestNameLoggingFilter.java
A testing/tools/src/main/java/org/apache/sling/testing/tools/junit/TestDescriptionInterceptor.java
A testing/tools/src/main/java/org/apache/sling/testing/tools/sling
AU testing/tools/src/main/java/org/apache/sling/testing/tools/sling/SlingClient.java
A testing/tools/src/main/java/org/apache/sling/testing/tools/sling/SlingInstanceManager.java
A testing/tools/src/main/java/org/apache/sling/testing/tools/sling/SlingInstancesRule.java
A testing/tools/src/main/java/org/apache/sling/testing/tools/sling/SlingInstance.java
A testing/tools/src/main/java/org/apache/sling/testing/tools/sling/SlingInstanceState.java
AU testing/tools/src/main/java/org/apache/sling/testing/tools/sling/TimeoutsProvider.java
AU testing/tools/src/main/java/org/apache/sling/testing/tools/sling/package-info.java
AU testing/tools/src/main/java/org/apache/sling/testing/tools/sling/SlingTestBase.java
AU testing/tools/src/main/java/org/apache/sling/testing/tools/sling/BundlesInstaller.java
AU testing/tools/pom.xml
A testing/samples
A testing/samples/module-with-it
A testing/samples/module-with-it/src
A testing/samples/module-with-it/src/test
A testing/samples/module-with-it/src/test/java
A testing/samples/module-with-it/src/test/java/org
A testing/samples/module-with-it/src/test/java/org/apache
A testing/samples/module-with-it/src/test/java/org/apache/sling
A testing/samples/module-with-it/src/test/java/org/apache/sling/testing
A testing/samples/module-with-it/src/test/java/org/apache/sling/testing/samples
A testing/samples/module-with-it/src/test/java/org/apache/sling/testing/samples/modulewit
AU testing/samples/module-with-it/src/test/java/org/apache/sling/testing/samples/modulewit/BasicTeleportedIT.java
A testing/samples/module-with-it/src/main
A testing/samples/module-with-it/src/main/provisioning
AU testing/samples/module-with-it/src/main/provisioning/model.txt
AU testing/samples/module-with-it/pom.xml
A testing/samples/module-with-it/.gitignore
A testing/samples/bundle-with-it
A testing/samples/bundle-with-it/pom.xml
A testing/samples/bundle-with-it/src
A testing/samples/bundle-with-it/src/test
A testing/samples/bundle-with-it/src/test/java
A testing/samples/bundle-with-it/src/test/java/org
A testing/samples/bundle-with-it/src/test/java/org/apache
A testing/samples/bundle-with-it/src/test/java/org/apache/sling
A testing/samples/bundle-with-it/src/test/java/org/apache/sling/junit
A testing/samples/bundle-with-it/src/test/java/org/apache/sling/junit/teleporter
A testing/samples/bundle-with-it/src/test/java/org/apache/sling/junit/teleporter/customizers
A testing/samples/bundle-with-it/src/test/java/org/apache/sling/junit/teleporter/customizers/BWIT_TeleporterCustomizer.java
A testing/samples/bundle-with-it/src/test/java/org/apache/sling/testing
A testing/samples/bundle-with-it/src/test/java/org/apache/sling/testing/samples
A testing/samples/bundle-with-it/src/test/java/org/apache/sling/testing/samples/bundlewit
A testing/samples/bundle-with-it/src/test/java/org/apache/sling/testing/samples/bundlewit/ResourceMimeTypeDetectorIT.java
A testing/samples/bundle-with-it/src/test/java/org/apache/sling/testing/samples/bundlewit/MimeTypeServletHttpIT.java
A testing/samples/bundle-with-it/src/test/java/org/apache/sling/testing/samples/bundlewit/MockResource.java
A testing/samples/bundle-with-it/src/test/java/org/apache/sling/testing/samples/bundlewit/OsgiConsoleHttpIT.java
A testing/samples/bundle-with-it/src/test/java/org/apache/sling/testing/samples/bundlewit/SampleUnitTest.java
A testing/samples/bundle-with-it/src/test/java/org/apache/sling/testing/samples/bundlewit/FilterIT.java
A testing/samples/bundle-with-it/src/test/java/org/apache/sling/testing/samples/bundlewit/BasicTeleportedIT.java
A testing/samples/bundle-with-it/src/main
A testing/samples/bundle-with-it/src/main/java
A testing/samples/bundle-with-it/src/main/java/org
A testing/samples/bundle-with-it/src/main/java/org/apache
A testing/samples/bundle-with-it/src/main/java/org/apache/sling
A testing/samples/bundle-with-it/src/main/java/org/apache/sling/testing
A testing/samples/bundle-with-it/src/main/java/org/apache/sling/testing/samples
A testing/samples/bundle-with-it/src/main/java/org/apache/sling/testing/samples/bundlewit
A testing/samples/bundle-with-it/src/main/java/org/apache/sling/testing/samples/bundlewit/impl
A testing/samples/bundle-with-it/src/main/java/org/apache/sling/testing/samples/bundlewit/impl/ResourceMimeTypeDetectorImpl.java
A testing/samples/bundle-with-it/src/main/java/org/apache/sling/testing/samples/bundlewit/impl/MimeTypeServlet.java
A testing/samples/bundle-with-it/src/main/java/org/apache/sling/testing/samples/bundlewit/api
A testing/samples/bundle-with-it/src/main/java/org/apache/sling/testing/samples/bundlewit/api/ResourceMimeTypeDetector.java
A testing/samples/bundle-with-it/src/main/java/org/apache/sling/testing/samples/bundlewit/api/package-info.java
A testing/hamcrest
A testing/hamcrest/src
A testing/hamcrest/src/test
A testing/hamcrest/src/test/java
A testing/hamcrest/src/test/java/org
A testing/hamcrest/src/test/java/org/apache
A testing/hamcrest/src/test/java/org/apache/sling
A testing/hamcrest/src/test/java/org/apache/sling/testing
A testing/hamcrest/src/test/java/org/apache/sling/testing/hamcrest
AU testing/hamcrest/src/test/java/org/apache/sling/testing/hamcrest/ResourceMatchersTest.java
A testing/hamcrest/src/main
A testing/hamcrest/src/main/java
A testing/hamcrest/src/main/java/org
A testing/hamcrest/src/main/java/org/apache
A testing/hamcrest/src/main/java/org/apache/sling
A testing/hamcrest/src/main/java/org/apache/sling/hamcrest
A testing/hamcrest/src/main/java/org/apache/sling/hamcrest/matchers
AU testing/hamcrest/src/main/java/org/apache/sling/hamcrest/matchers/ResourceNameMatcher.java
A testing/hamcrest/src/main/java/org/apache/sling/hamcrest/matchers/ResourceChildrenMatcher.java
A testing/hamcrest/src/main/java/org/apache/sling/hamcrest/matchers/ResourcePropertiesMatcher.java
A testing/hamcrest/src/main/java/org/apache/sling/hamcrest/ResourceMatchers.java
A testing/hamcrest/pom.xml
A testing/serversetup
A testing/serversetup/pom.xml
A testing/serversetup/src
A testing/serversetup/src/test
A testing/serversetup/src/test/java
A testing/serversetup/src/test/java/org
A testing/serversetup/src/test/java/org/apache
A testing/serversetup/src/test/java/org/apache/sling
A testing/serversetup/src/test/java/org/apache/sling/testing
A testing/serversetup/src/test/java/org/apache/sling/testing/serversetup
A testing/serversetup/src/test/java/org/apache/sling/testing/serversetup/test
A testing/serversetup/src/test/java/org/apache/sling/testing/serversetup/test/ServerSetupSingletonTest.java
A testing/serversetup/src/test/java/org/apache/sling/testing/serversetup/test/TestSetupPhase.java
A testing/serversetup/src/test/java/org/apache/sling/testing/serversetup/test/TestServerSetup.java
A testing/serversetup/src/main
A testing/serversetup/src/main/java
A testing/serversetup/src/main/java/org
A testing/serversetup/src/main/java/org/apache
A testing/serversetup/src/main/java/org/apache/sling
A testing/serversetup/src/main/java/org/apache/sling/testing
A testing/serversetup/src/main/java/org/apache/sling/testing/serversetup
A testing/serversetup/src/main/java/org/apache/sling/testing/serversetup/ServerSetup.java
A testing/serversetup/src/main/java/org/apache/sling/testing/serversetup/ServerSetupSingleton.java
A testing/serversetup/src/main/java/org/apache/sling/testing/serversetup/SetupPhase.java
A testing/serversetup/src/main/java/org/apache/sling/testing/serversetup/jarexec
A testing/serversetup/src/main/java/org/apache/sling/testing/serversetup/jarexec/JarExecutor.java
A testing/serversetup/src/main/java/org/apache/sling/testing/serversetup/jarexec/ShutdownHookSingleProcessDestroyer.java
A testing/serversetup/src/main/java/org/apache/sling/testing/serversetup/jarexec/package-info.java
A testing/serversetup/src/main/java/org/apache/sling/testing/serversetup/StartRunnableJarPhase.java
A testing/serversetup/src/main/java/org/apache/sling/testing/serversetup/instance
A testing/serversetup/src/main/java/org/apache/sling/testing/serversetup/instance/package-info.java
A testing/serversetup/src/main/java/org/apache/sling/testing/serversetup/instance/SlingTestBase.java
A testing/serversetup/src/main/java/org/apache/sling/testing/serversetup/instance/SlingInstanceManager.java
A testing/serversetup/src/main/java/org/apache/sling/testing/serversetup/instance/SlingInstancesRule.java
A testing/serversetup/src/main/java/org/apache/sling/testing/serversetup/instance/SlingInstance.java
A testing/serversetup/src/main/java/org/apache/sling/testing/serversetup/instance/SlingInstanceState.java
A testing/serversetup/src/main/java/org/apache/sling/testing/serversetup/package-info.java
A .mvn
A .mvn/jvm.config
AU NOTICE
AU LICENSE
AU check_release_matches_tag.sh
A .travis.yml
A src
A src/misc
A src/misc/sling-6-source-release.javadoc.patch
AU src/misc/README.txt
A src/main
A src/main/javadoc
AU src/main/javadoc/overview.html
U .
At revision 1750404
Parsing POMs
Downloaded artifact http://repo.maven.apache.org/maven2/org/apache/apache/17/apache-17.pom
Downloaded artifact http://repo.maven.apache.org/maven2/org/apache/sling/sling/26/sling-26.pom
Downloaded artifact http://repo.maven.apache.org/maven2/org/apache/sling/sling/25/sling-25.pom
ERROR: Failed to parse POMs
java.io.IOException: remote file operation failed: <https://builds.apache.org/job/sling-trunk-1.8/ws/trunk> at hudson.remoting.Channel@24ee8056:jenkins-test-593: hudson.remoting.ProxyException: hudson.maven.MavenModuleSetBuild$MavenExecutionException: org.apache.maven.project.ProjectBuildingException: Some problems were encountered while processing the POMs:
[FATAL] Non-resolvable parent POM: Could not find artifact org.apache.sling:sling:pom:27-SNAPSHOT and 'parent.relativePath' points at no local POM @ line 24, column 11
at hudson.FilePath.act(FilePath.java:986)
at hudson.FilePath.act(FilePath.java:968)
at hudson.maven.MavenModuleSetBuild$MavenModuleSetBuildExecution.parsePoms(MavenModuleSetBuild.java:960)
at hudson.maven.MavenModuleSetBuild$MavenModuleSetBuildExecution.doRun(MavenModuleSetBuild.java:679)
at hudson.model.AbstractBuild$AbstractBuildExecution.run(AbstractBuild.java:534)
at hudson.model.Run.execute(Run.java:1738)
at hudson.maven.MavenModuleSetBuild.run(MavenModuleSetBuild.java:531)
at hudson.model.ResourceController.execute(ResourceController.java:98)
at hudson.model.Executor.run(Executor.java:410)
Caused by: hudson.remoting.ProxyException: hudson.maven.MavenModuleSetBuild$MavenExecutionException: org.apache.maven.project.ProjectBuildingException: Some problems were encountered while processing the POMs:
[FATAL] Non-resolvable parent POM: Could not find artifact org.apache.sling:sling:pom:27-SNAPSHOT and 'parent.relativePath' points at no local POM @ line 24, column 11
at hudson.maven.MavenModuleSetBuild$PomParser.invoke(MavenModuleSetBuild.java:1364)
at hudson.maven.MavenModuleSetBuild$PomParser.invoke(MavenModuleSetBuild.java:1098)
at hudson.FilePath$FileCallableWrapper.call(FilePath.java:2719)
at hudson.remoting.UserRequest.perform(UserRequest.java:120)
at hudson.remoting.UserRequest.perform(UserRequest.java:48)
at hudson.remoting.Request$2.run(Request.java:326)
at hudson.remoting.InterceptingExecutorService$1.call(InterceptingExecutorService.java:68)
at java.util.concurrent.FutureTask.run(FutureTask.java:262)
at java.util.concurrent.ThreadPoolExecutor.runWorker(ThreadPoolExecutor.java:1145)
at java.util.concurrent.ThreadPoolExecutor$Worker.run(ThreadPoolExecutor.java:615)
at java.lang.Thread.run(Thread.java:745)
at ......remote call to jenkins-test-593(Native Method)
at hudson.remoting.Channel.attachCallSiteStackTrace(Channel.java:1416)
at hudson.remoting.UserResponse.retrieve(UserRequest.java:220)
at hudson.remoting.Channel.call(Channel.java:781)
at hudson.FilePath.act(FilePath.java:979)
... 8 more
Caused by: hudson.remoting.ProxyException: org.apache.maven.project.ProjectBuildingException: Some problems were encountered while processing the POMs:
[FATAL] Non-resolvable parent POM: Could not find artifact org.apache.sling:sling:pom:27-SNAPSHOT and 'parent.relativePath' points at no local POM @ line 24, column 11
at org.apache.maven.project.DefaultProjectBuilder.build(DefaultProjectBuilder.java:364)
at hudson.maven.MavenEmbedder.buildProjects(MavenEmbedder.java:361)
at hudson.maven.MavenEmbedder.readProjects(MavenEmbedder.java:331)
at hudson.maven.MavenModuleSetBuild$PomParser.invoke(MavenModuleSetBuild.java:1301)
at hudson.maven.MavenModuleSetBuild$PomParser.invoke(MavenModuleSetBuild.java:1098)
at hudson.FilePath$FileCallableWrapper.call(FilePath.java:2719)
at hudson.remoting.UserRequest.perform(UserRequest.java:120)
at hudson.remoting.UserRequest.perform(UserRequest.java:48)
at hudson.remoting.Request$2.run(Request.java:326)
at hudson.remoting.InterceptingExecutorService$1.call(InterceptingExecutorService.java:68)
at java.util.concurrent.FutureTask.run(FutureTask.java:262)
at java.util.concurrent.ThreadPoolExecutor.runWorker(ThreadPoolExecutor.java:1145)
at java.util.concurrent.ThreadPoolExecutor$Worker.run(ThreadPoolExecutor.java:615)
at java.lang.Thread.run(Thread.java:745)
Jenkins build is still unstable: sling-trunk-1.8 #3435
Posted by Apache Jenkins Server <je...@builds.apache.org>.
See <https://builds.apache.org/job/sling-trunk-1.8/changes>
Jenkins build is still unstable: sling-trunk-1.8 #3434
Posted by Apache Jenkins Server <je...@builds.apache.org>.
See <https://builds.apache.org/job/sling-trunk-1.8/3434/>
Jenkins build is still unstable: sling-trunk-1.8 #3433
Posted by Apache Jenkins Server <je...@builds.apache.org>.
See <https://builds.apache.org/job/sling-trunk-1.8/changes>
Jenkins build is still unstable: sling-trunk-1.8 #3432
Posted by Apache Jenkins Server <je...@builds.apache.org>.
See <https://builds.apache.org/job/sling-trunk-1.8/changes>
Jenkins build is still unstable: sling-trunk-1.8 #3431
Posted by Apache Jenkins Server <je...@builds.apache.org>.
See <https://builds.apache.org/job/sling-trunk-1.8/3431/>
Jenkins build is still unstable: sling-trunk-1.8 #3430
Posted by Apache Jenkins Server <je...@builds.apache.org>.
See <https://builds.apache.org/job/sling-trunk-1.8/3430/>
Jenkins build is still unstable: sling-trunk-1.8 #3429
Posted by Apache Jenkins Server <je...@builds.apache.org>.
See <https://builds.apache.org/job/sling-trunk-1.8/changes>
Jenkins build is still unstable: sling-trunk-1.8 #3428
Posted by Apache Jenkins Server <je...@builds.apache.org>.
See <https://builds.apache.org/job/sling-trunk-1.8/changes>
Jenkins build is still unstable: sling-trunk-1.8 #3427
Posted by Apache Jenkins Server <je...@builds.apache.org>.
See <https://builds.apache.org/job/sling-trunk-1.8/3427/>
Jenkins build is still unstable: sling-trunk-1.8 #3426
Posted by Apache Jenkins Server <je...@builds.apache.org>.
See <https://builds.apache.org/job/sling-trunk-1.8/3426/>
Jenkins build is still unstable: sling-trunk-1.8 #3425
Posted by Apache Jenkins Server <je...@builds.apache.org>.
See <https://builds.apache.org/job/sling-trunk-1.8/3425/>
Jenkins build is still unstable: sling-trunk-1.8 #3424
Posted by Apache Jenkins Server <je...@builds.apache.org>.
See <https://builds.apache.org/job/sling-trunk-1.8/changes>
Jenkins build is unstable: sling-trunk-1.8 #3423
Posted by Apache Jenkins Server <je...@builds.apache.org>.
See <https://builds.apache.org/job/sling-trunk-1.8/3423/changes>
Build failed in Jenkins: sling-trunk-1.8 #3422
Posted by Apache Jenkins Server <je...@builds.apache.org>.
See <https://builds.apache.org/job/sling-trunk-1.8/3422/>
------------------------------------------
[...truncated 13938 lines...]
AU testing/mocks/resourceresolver-mock/src/main/java/org/apache/sling/testing/resourceresolver/DeepReadModifiableValueMapDecorator.java
AU testing/mocks/resourceresolver-mock/src/main/java/org/apache/sling/testing/resourceresolver/MockResourceResolver.java
AU testing/mocks/resourceresolver-mock/src/main/java/org/apache/sling/testing/resourceresolver/MockValueMap.java
AU testing/mocks/resourceresolver-mock/src/main/java/org/apache/sling/testing/resourceresolver/package-info.java
AU testing/mocks/resourceresolver-mock/src/main/java/org/apache/sling/testing/resourceresolver/MockPropertyResource.java
AU testing/mocks/resourceresolver-mock/src/main/java/org/apache/sling/testing/resourceresolver/MockResourceResolverFactoryOptions.java
AU testing/mocks/resourceresolver-mock/src/main/java/org/apache/sling/testing/resourceresolver/MockHelper.java
AU testing/mocks/resourceresolver-mock/src/main/java/org/apache/sling/testing/resourceresolver/MockResourceResolverFactory.java
AU testing/mocks/resourceresolver-mock/src/main/java/org/apache/sling/testing/resourceresolver/ReadonlyValueMapDecorator.java
AU testing/mocks/resourceresolver-mock/pom.xml
AU testing/mocks/resourceresolver-mock/README.txt
A testing/mocks/sling-mock
A testing/mocks/sling-mock/src
A testing/mocks/sling-mock/src/main
A testing/mocks/sling-mock/src/main/java
A testing/mocks/sling-mock/src/main/java/org
A testing/mocks/sling-mock/src/main/java/org/apache
A testing/mocks/sling-mock/src/main/java/org/apache/sling
A testing/mocks/sling-mock/src/main/java/org/apache/sling/testing
A testing/mocks/sling-mock/src/main/java/org/apache/sling/testing/mock
A testing/mocks/sling-mock/src/main/java/org/apache/sling/testing/mock/sling
AU testing/mocks/sling-mock/src/main/java/org/apache/sling/testing/mock/sling/package-info.java
AU testing/mocks/sling-mock/src/main/java/org/apache/sling/testing/mock/sling/MockJcrSlingRepository.java
AU testing/mocks/sling-mock/src/main/java/org/apache/sling/testing/mock/sling/MockSling.java
A testing/mocks/sling-mock/src/main/java/org/apache/sling/testing/mock/sling/loader
AU testing/mocks/sling-mock/src/main/java/org/apache/sling/testing/mock/sling/loader/package-info.java
AU testing/mocks/sling-mock/src/main/java/org/apache/sling/testing/mock/sling/loader/ContentLoader.java
AU testing/mocks/sling-mock/src/main/java/org/apache/sling/testing/mock/sling/NodeTypeMode.java
AU testing/mocks/sling-mock/src/main/java/org/apache/sling/testing/mock/sling/RRMockMockResourceResolverAdapter.java
A testing/mocks/sling-mock/src/main/java/org/apache/sling/testing/mock/sling/services
AU testing/mocks/sling-mock/src/main/java/org/apache/sling/testing/mock/sling/services/MockMimeTypeService.java
AU testing/mocks/sling-mock/src/main/java/org/apache/sling/testing/mock/sling/services/package-info.java
AU testing/mocks/sling-mock/src/main/java/org/apache/sling/testing/mock/sling/services/MockSlingSettingService.java
A testing/mocks/sling-mock/src/main/java/org/apache/sling/testing/mock/sling/servlet
AU testing/mocks/sling-mock/src/main/java/org/apache/sling/testing/mock/sling/servlet/MockHttpSession.java
AU testing/mocks/sling-mock/src/main/java/org/apache/sling/testing/mock/sling/servlet/MockRequestDispatcherFactory.java
AU testing/mocks/sling-mock/src/main/java/org/apache/sling/testing/mock/sling/servlet/MockServletContext.java
AU testing/mocks/sling-mock/src/main/java/org/apache/sling/testing/mock/sling/servlet/MockSlingHttpServletRequest.java
AU testing/mocks/sling-mock/src/main/java/org/apache/sling/testing/mock/sling/servlet/package-info.java
AU testing/mocks/sling-mock/src/main/java/org/apache/sling/testing/mock/sling/servlet/MockSlingHttpServletResponse.java
AU testing/mocks/sling-mock/src/main/java/org/apache/sling/testing/mock/sling/servlet/MockRequestPathInfo.java
AU testing/mocks/sling-mock/src/main/java/org/apache/sling/testing/mock/sling/MockNoneResourceResolverAdapter.java
A testing/mocks/sling-mock/src/main/java/org/apache/sling/testing/mock/sling/context
AU testing/mocks/sling-mock/src/main/java/org/apache/sling/testing/mock/sling/context/ModelAdapterFactoryUtil.java
AU testing/mocks/sling-mock/src/main/java/org/apache/sling/testing/mock/sling/context/UniqueRoot.java
AU testing/mocks/sling-mock/src/main/java/org/apache/sling/testing/mock/sling/context/SlingContextImpl.java
AU testing/mocks/sling-mock/src/main/java/org/apache/sling/testing/mock/sling/context/package-info.java
AU testing/mocks/sling-mock/src/main/java/org/apache/sling/testing/mock/sling/context/ContextResourceResolverFactory.java
AU testing/mocks/sling-mock/src/main/java/org/apache/sling/testing/mock/sling/ResourceResolverFactoryInitializer.java
AU testing/mocks/sling-mock/src/main/java/org/apache/sling/testing/mock/sling/MockDynamicClassLoaderManager.java
A testing/mocks/sling-mock/src/main/java/org/apache/sling/testing/mock/sling/builder
AU testing/mocks/sling-mock/src/main/java/org/apache/sling/testing/mock/sling/builder/package-info.java
AU testing/mocks/sling-mock/src/main/java/org/apache/sling/testing/mock/sling/builder/ContentBuilder.java
AU testing/mocks/sling-mock/src/main/java/org/apache/sling/testing/mock/sling/MockAdapterManagerImpl.java
A testing/mocks/sling-mock/src/main/java/org/apache/sling/testing/mock/sling/junit
AU testing/mocks/sling-mock/src/main/java/org/apache/sling/testing/mock/sling/junit/SlingContextCallback.java
AU testing/mocks/sling-mock/src/main/java/org/apache/sling/testing/mock/sling/junit/SlingContext.java
AU testing/mocks/sling-mock/src/main/java/org/apache/sling/testing/mock/sling/junit/package-info.java
AU testing/mocks/sling-mock/src/main/java/org/apache/sling/testing/mock/sling/NodeTypeDefinitionScanner.java
A testing/mocks/sling-mock/src/main/java/org/apache/sling/testing/mock/sling/spi
AU testing/mocks/sling-mock/src/main/java/org/apache/sling/testing/mock/sling/spi/package-info.java
AU testing/mocks/sling-mock/src/main/java/org/apache/sling/testing/mock/sling/spi/ResourceResolverTypeAdapter.java
AU testing/mocks/sling-mock/src/main/java/org/apache/sling/testing/mock/sling/MockSlingScriptHelper.java
AU testing/mocks/sling-mock/src/main/java/org/apache/sling/testing/mock/sling/ResourceResolverType.java
AU testing/mocks/sling-mock/src/main/java/org/apache/sling/testing/mock/sling/ThreadsafeMockAdapterManagerWrapper.java
AU testing/mocks/sling-mock/src/main/java/org/apache/sling/testing/mock/sling/MockJcrResourceResolverAdapter.java
A testing/mocks/sling-mock/src/test
A testing/mocks/sling-mock/src/test/resources
A testing/mocks/sling-mock/src/test/resources/json-import-samples
AU testing/mocks/sling-mock/src/test/resources/json-import-samples/dam.json
AU testing/mocks/sling-mock/src/test/resources/json-import-samples/SLING-4362.json
AU testing/mocks/sling-mock/src/test/resources/json-import-samples/content.json
AU testing/mocks/sling-mock/src/test/resources/sample-image.gif
A testing/mocks/sling-mock/src/test/resources/SLING-INF
A testing/mocks/sling-mock/src/test/resources/SLING-INF/nodetypes
AU testing/mocks/sling-mock/src/test/resources/SLING-INF/nodetypes/app.cnd
A testing/mocks/sling-mock/src/test/java
A testing/mocks/sling-mock/src/test/java/org
A testing/mocks/sling-mock/src/test/java/org/apache
A testing/mocks/sling-mock/src/test/java/org/apache/sling
A testing/mocks/sling-mock/src/test/java/org/apache/sling/testing
A testing/mocks/sling-mock/src/test/java/org/apache/sling/testing/mock
A testing/mocks/sling-mock/src/test/java/org/apache/sling/testing/mock/sling
A testing/mocks/sling-mock/src/test/java/org/apache/sling/testing/mock/sling/rrmock
A testing/mocks/sling-mock/src/test/java/org/apache/sling/testing/mock/sling/rrmock/context
AU testing/mocks/sling-mock/src/test/java/org/apache/sling/testing/mock/sling/rrmock/context/SlingContextImplTest.java
A testing/mocks/sling-mock/src/test/java/org/apache/sling/testing/mock/sling/rrmock/loader
AU testing/mocks/sling-mock/src/test/java/org/apache/sling/testing/mock/sling/rrmock/loader/ContentLoaderBinaryTest.java
AU testing/mocks/sling-mock/src/test/java/org/apache/sling/testing/mock/sling/rrmock/loader/ContentLoaderJsonTest.java
AU testing/mocks/sling-mock/src/test/java/org/apache/sling/testing/mock/sling/rrmock/loader/ContentLoaderJsonDamTest.java
A testing/mocks/sling-mock/src/test/java/org/apache/sling/testing/mock/sling/rrmock/resource
AU testing/mocks/sling-mock/src/test/java/org/apache/sling/testing/mock/sling/rrmock/resource/SlingCrudResourceResolverTest.java
AU testing/mocks/sling-mock/src/test/java/org/apache/sling/testing/mock/sling/rrmock/resource/MultipleResourceResolverTest.java
AU testing/mocks/sling-mock/src/test/java/org/apache/sling/testing/mock/sling/rrmock/resource/UniqueRootTest.java
A testing/mocks/sling-mock/src/test/java/org/apache/sling/testing/mock/sling/services
AU testing/mocks/sling-mock/src/test/java/org/apache/sling/testing/mock/sling/services/MockMimeTypeServiceTest.java
AU testing/mocks/sling-mock/src/test/java/org/apache/sling/testing/mock/sling/services/MockSlingSettingServiceTest.java
A testing/mocks/sling-mock/src/test/java/org/apache/sling/testing/mock/sling/context
AU testing/mocks/sling-mock/src/test/java/org/apache/sling/testing/mock/sling/context/AbstractSlingContextImplTest.java
AU testing/mocks/sling-mock/src/test/java/org/apache/sling/testing/mock/sling/context/ModelAdapterFactoryUtilTest.java
A testing/mocks/sling-mock/src/test/java/org/apache/sling/testing/mock/sling/servlet
AU testing/mocks/sling-mock/src/test/java/org/apache/sling/testing/mock/sling/servlet/MockSlingHttpServletResponseTest.java
AU testing/mocks/sling-mock/src/test/java/org/apache/sling/testing/mock/sling/servlet/MockHttpSessionTest.java
AU testing/mocks/sling-mock/src/test/java/org/apache/sling/testing/mock/sling/servlet/MockSlingHttpServletRequestTest.java
AU testing/mocks/sling-mock/src/test/java/org/apache/sling/testing/mock/sling/MockJcrSlingRepositoryTest.java
A testing/mocks/sling-mock/src/test/java/org/apache/sling/testing/mock/sling/builder
AU testing/mocks/sling-mock/src/test/java/org/apache/sling/testing/mock/sling/builder/ContentBuilderTest.java
A testing/mocks/sling-mock/src/test/java/org/apache/sling/testing/mock/sling/loader
AU testing/mocks/sling-mock/src/test/java/org/apache/sling/testing/mock/sling/loader/AbstractContentLoaderBinaryTest.java
AU testing/mocks/sling-mock/src/test/java/org/apache/sling/testing/mock/sling/loader/AbstractContentLoaderJsonTest.java
AU testing/mocks/sling-mock/src/test/java/org/apache/sling/testing/mock/sling/loader/AbstractContentLoaderJsonDamTest.java
A testing/mocks/sling-mock/src/test/java/org/apache/sling/testing/mock/sling/resource
AU testing/mocks/sling-mock/src/test/java/org/apache/sling/testing/mock/sling/resource/AbstractSlingCrudResourceResolverTest.java
AU testing/mocks/sling-mock/src/test/java/org/apache/sling/testing/mock/sling/resource/AbstractMultipleResourceResolverTest.java
AU testing/mocks/sling-mock/src/test/java/org/apache/sling/testing/mock/sling/resource/AbstractJcrResourceResolverTest.java
AU testing/mocks/sling-mock/src/test/java/org/apache/sling/testing/mock/sling/resource/AbstractUniqueRootTest.java
AU testing/mocks/sling-mock/src/test/java/org/apache/sling/testing/mock/sling/resource/AbstractJcrNamespaceTest.java
A testing/mocks/sling-mock/src/test/java/org/apache/sling/testing/mock/sling/jcrmock
A testing/mocks/sling-mock/src/test/java/org/apache/sling/testing/mock/sling/jcrmock/context
AU testing/mocks/sling-mock/src/test/java/org/apache/sling/testing/mock/sling/jcrmock/context/SlingContextImplTest.java
A testing/mocks/sling-mock/src/test/java/org/apache/sling/testing/mock/sling/jcrmock/loader
AU testing/mocks/sling-mock/src/test/java/org/apache/sling/testing/mock/sling/jcrmock/loader/ContentLoaderBinaryTest.java
AU testing/mocks/sling-mock/src/test/java/org/apache/sling/testing/mock/sling/jcrmock/loader/ContentLoaderJsonTest.java
AU testing/mocks/sling-mock/src/test/java/org/apache/sling/testing/mock/sling/jcrmock/loader/ContentLoaderJsonDamTest.java
A testing/mocks/sling-mock/src/test/java/org/apache/sling/testing/mock/sling/jcrmock/resource
AU testing/mocks/sling-mock/src/test/java/org/apache/sling/testing/mock/sling/jcrmock/resource/SlingCrudResourceResolverTest.java
AU testing/mocks/sling-mock/src/test/java/org/apache/sling/testing/mock/sling/jcrmock/resource/MultipleResourceResolverTest.java
AU testing/mocks/sling-mock/src/test/java/org/apache/sling/testing/mock/sling/jcrmock/resource/JcrResourceResolverTest.java
AU testing/mocks/sling-mock/src/test/java/org/apache/sling/testing/mock/sling/jcrmock/resource/UniqueRootTest.java
AU testing/mocks/sling-mock/src/test/java/org/apache/sling/testing/mock/sling/jcrmock/resource/FindResourcesTest.java
AU testing/mocks/sling-mock/src/test/java/org/apache/sling/testing/mock/sling/jcrmock/resource/JcrNamespaceTest.java
A testing/mocks/sling-mock/src/test/java/org/apache/sling/testing/mock/sling/junit
AU testing/mocks/sling-mock/src/test/java/org/apache/sling/testing/mock/sling/junit/SlingContextDefaultRRTypeTest.java
AU testing/mocks/sling-mock/src/test/java/org/apache/sling/testing/mock/sling/junit/SlingContextTest.java
AU testing/mocks/sling-mock/src/test/java/org/apache/sling/testing/mock/sling/NodeTypeDefinitionScannerTest.java
AU testing/mocks/sling-mock/src/test/java/org/apache/sling/testing/mock/sling/MockSlingScriptHelperTest.java
AU testing/mocks/sling-mock/pom.xml
AU testing/mocks/sling-mock/README.txt
A testing/mocks/jcr-mock
AU testing/mocks/jcr-mock/pom.xml
AU testing/mocks/jcr-mock/README.txt
A testing/mocks/jcr-mock/src
A testing/mocks/jcr-mock/src/test
A testing/mocks/jcr-mock/src/test/java
A testing/mocks/jcr-mock/src/test/java/org
A testing/mocks/jcr-mock/src/test/java/org/apache
A testing/mocks/jcr-mock/src/test/java/org/apache/sling
A testing/mocks/jcr-mock/src/test/java/org/apache/sling/testing
A testing/mocks/jcr-mock/src/test/java/org/apache/sling/testing/mock
A testing/mocks/jcr-mock/src/test/java/org/apache/sling/testing/mock/jcr
AU testing/mocks/jcr-mock/src/test/java/org/apache/sling/testing/mock/jcr/ResourceUtilTest.java
AU testing/mocks/jcr-mock/src/test/java/org/apache/sling/testing/mock/jcr/MockWorkspaceTest.java
AU testing/mocks/jcr-mock/src/test/java/org/apache/sling/testing/mock/jcr/MockRepositoryTest.java
AU testing/mocks/jcr-mock/src/test/java/org/apache/sling/testing/mock/jcr/MockQueryManagerTest.java
AU testing/mocks/jcr-mock/src/test/java/org/apache/sling/testing/mock/jcr/MockSessionTest.java
AU testing/mocks/jcr-mock/src/test/java/org/apache/sling/testing/mock/jcr/MockPropertyTest.java
AU testing/mocks/jcr-mock/src/test/java/org/apache/sling/testing/mock/jcr/MockNodeTest.java
AU testing/mocks/jcr-mock/src/test/java/org/apache/sling/testing/mock/jcr/AbstractItemTest.java
A testing/mocks/jcr-mock/src/main
A testing/mocks/jcr-mock/src/main/java
A testing/mocks/jcr-mock/src/main/java/org
A testing/mocks/jcr-mock/src/main/java/org/apache
A testing/mocks/jcr-mock/src/main/java/org/apache/sling
A testing/mocks/jcr-mock/src/main/java/org/apache/sling/testing
A testing/mocks/jcr-mock/src/main/java/org/apache/sling/testing/mock
A testing/mocks/jcr-mock/src/main/java/org/apache/sling/testing/mock/jcr
AU testing/mocks/jcr-mock/src/main/java/org/apache/sling/testing/mock/jcr/MockWorkspace.java
AU testing/mocks/jcr-mock/src/main/java/org/apache/sling/testing/mock/jcr/MockQueryManager.java
AU testing/mocks/jcr-mock/src/main/java/org/apache/sling/testing/mock/jcr/MockQueryResultHandler.java
AU testing/mocks/jcr-mock/src/main/java/org/apache/sling/testing/mock/jcr/MockQueryResult.java
AU testing/mocks/jcr-mock/src/main/java/org/apache/sling/testing/mock/jcr/MockQuery.java
AU testing/mocks/jcr-mock/src/main/java/org/apache/sling/testing/mock/jcr/MockRow.java
AU testing/mocks/jcr-mock/src/main/java/org/apache/sling/testing/mock/jcr/AbstractItem.java
AU testing/mocks/jcr-mock/src/main/java/org/apache/sling/testing/mock/jcr/package-info.java
AU testing/mocks/jcr-mock/src/main/java/org/apache/sling/testing/mock/jcr/MockNodeTypes.java
AU testing/mocks/jcr-mock/src/main/java/org/apache/sling/testing/mock/jcr/ResourceUtil.java
AU testing/mocks/jcr-mock/src/main/java/org/apache/sling/testing/mock/jcr/ItemData.java
AU testing/mocks/jcr-mock/src/main/java/org/apache/sling/testing/mock/jcr/MockJcr.java
AU testing/mocks/jcr-mock/src/main/java/org/apache/sling/testing/mock/jcr/MockRepository.java
AU testing/mocks/jcr-mock/src/main/java/org/apache/sling/testing/mock/jcr/MockNodeTypeManager.java
AU testing/mocks/jcr-mock/src/main/java/org/apache/sling/testing/mock/jcr/MockSession.java
AU testing/mocks/jcr-mock/src/main/java/org/apache/sling/testing/mock/jcr/MockProperty.java
AU testing/mocks/jcr-mock/src/main/java/org/apache/sling/testing/mock/jcr/MockNode.java
AU testing/mocks/jcr-mock/src/main/java/org/apache/sling/testing/mock/jcr/MockNamespaceRegistry.java
AU testing/mocks/jcr-mock/src/main/java/org/apache/sling/testing/mock/jcr/MockObservationManager.java
AU testing/mocks/jcr-mock/src/main/java/org/apache/sling/testing/mock/jcr/MockNodeType.java
AU testing/mocks/jcr-mock/src/main/java/org/apache/sling/testing/mock/jcr/ItemFilter.java
AU check_staged_release.sh
A .mvn
A .mvn/jvm.config
AU NOTICE
U .
At revision 1750185
No changes for http://svn.apache.org/repos/asf/sling/trunk since the previous build
Parsing POMs
Downloaded artifact http://repo.maven.apache.org/maven2/org/apache/apache/17/apache-17.pom
Downloaded artifact http://repo.maven.apache.org/maven2/org/apache/sling/sling/26/sling-26.pom
Downloaded artifact http://repo.maven.apache.org/maven2/org/apache/sling/sling/25/sling-25.pom
ERROR: Failed to parse POMs
java.io.IOException: remote file operation failed: <https://builds.apache.org/job/sling-trunk-1.8/ws/trunk> at hudson.remoting.Channel@7b5ae84b:jenkins-test-840: hudson.remoting.ProxyException: hudson.maven.MavenModuleSetBuild$MavenExecutionException: org.apache.maven.project.ProjectBuildingException: Some problems were encountered while processing the POMs:
[FATAL] Non-resolvable parent POM: Could not find artifact org.apache.sling:sling:pom:27-SNAPSHOT and 'parent.relativePath' points at no local POM @ line 24, column 11
at hudson.FilePath.act(FilePath.java:986)
at hudson.FilePath.act(FilePath.java:968)
at hudson.maven.MavenModuleSetBuild$MavenModuleSetBuildExecution.parsePoms(MavenModuleSetBuild.java:960)
at hudson.maven.MavenModuleSetBuild$MavenModuleSetBuildExecution.doRun(MavenModuleSetBuild.java:679)
at hudson.model.AbstractBuild$AbstractBuildExecution.run(AbstractBuild.java:534)
at hudson.model.Run.execute(Run.java:1738)
at hudson.maven.MavenModuleSetBuild.run(MavenModuleSetBuild.java:531)
at hudson.model.ResourceController.execute(ResourceController.java:98)
at hudson.model.Executor.run(Executor.java:410)
Caused by: hudson.remoting.ProxyException: hudson.maven.MavenModuleSetBuild$MavenExecutionException: org.apache.maven.project.ProjectBuildingException: Some problems were encountered while processing the POMs:
[FATAL] Non-resolvable parent POM: Could not find artifact org.apache.sling:sling:pom:27-SNAPSHOT and 'parent.relativePath' points at no local POM @ line 24, column 11
at hudson.maven.MavenModuleSetBuild$PomParser.invoke(MavenModuleSetBuild.java:1364)
at hudson.maven.MavenModuleSetBuild$PomParser.invoke(MavenModuleSetBuild.java:1098)
at hudson.FilePath$FileCallableWrapper.call(FilePath.java:2719)
at hudson.remoting.UserRequest.perform(UserRequest.java:120)
at hudson.remoting.UserRequest.perform(UserRequest.java:48)
at hudson.remoting.Request$2.run(Request.java:326)
at hudson.remoting.InterceptingExecutorService$1.call(InterceptingExecutorService.java:68)
at java.util.concurrent.FutureTask.run(FutureTask.java:262)
at java.util.concurrent.ThreadPoolExecutor.runWorker(ThreadPoolExecutor.java:1145)
at java.util.concurrent.ThreadPoolExecutor$Worker.run(ThreadPoolExecutor.java:615)
at java.lang.Thread.run(Thread.java:745)
at ......remote call to jenkins-test-840(Native Method)
at hudson.remoting.Channel.attachCallSiteStackTrace(Channel.java:1416)
at hudson.remoting.UserResponse.retrieve(UserRequest.java:220)
at hudson.remoting.Channel.call(Channel.java:781)
at hudson.FilePath.act(FilePath.java:979)
... 8 more
Caused by: hudson.remoting.ProxyException: org.apache.maven.project.ProjectBuildingException: Some problems were encountered while processing the POMs:
[FATAL] Non-resolvable parent POM: Could not find artifact org.apache.sling:sling:pom:27-SNAPSHOT and 'parent.relativePath' points at no local POM @ line 24, column 11
at org.apache.maven.project.DefaultProjectBuilder.build(DefaultProjectBuilder.java:364)
at hudson.maven.MavenEmbedder.buildProjects(MavenEmbedder.java:361)
at hudson.maven.MavenEmbedder.readProjects(MavenEmbedder.java:331)
at hudson.maven.MavenModuleSetBuild$PomParser.invoke(MavenModuleSetBuild.java:1301)
at hudson.maven.MavenModuleSetBuild$PomParser.invoke(MavenModuleSetBuild.java:1098)
at hudson.FilePath$FileCallableWrapper.call(FilePath.java:2719)
at hudson.remoting.UserRequest.perform(UserRequest.java:120)
at hudson.remoting.UserRequest.perform(UserRequest.java:48)
at hudson.remoting.Request$2.run(Request.java:326)
at hudson.remoting.InterceptingExecutorService$1.call(InterceptingExecutorService.java:68)
at java.util.concurrent.FutureTask.run(FutureTask.java:262)
at java.util.concurrent.ThreadPoolExecutor.runWorker(ThreadPoolExecutor.java:1145)
at java.util.concurrent.ThreadPoolExecutor$Worker.run(ThreadPoolExecutor.java:615)
at java.lang.Thread.run(Thread.java:745)
Jenkins build is still unstable: sling-trunk-1.8 #3421
Posted by Apache Jenkins Server <je...@builds.apache.org>.
See <https://builds.apache.org/job/sling-trunk-1.8/3421/>
Jenkins build is still unstable: sling-trunk-1.8 #3420
Posted by Apache Jenkins Server <je...@builds.apache.org>.
See <https://builds.apache.org/job/sling-trunk-1.8/changes>
Jenkins build is still unstable: sling-trunk-1.8 #3419
Posted by Apache Jenkins Server <je...@builds.apache.org>.
See <https://builds.apache.org/job/sling-trunk-1.8/changes>
Jenkins build is still unstable: sling-trunk-1.8 #3418
Posted by Apache Jenkins Server <je...@builds.apache.org>.
See <https://builds.apache.org/job/sling-trunk-1.8/changes>
Jenkins build is still unstable: sling-trunk-1.8 #3417
Posted by Apache Jenkins Server <je...@builds.apache.org>.
See <https://builds.apache.org/job/sling-trunk-1.8/changes>
Jenkins build is unstable: sling-trunk-1.8 #3416
Posted by Apache Jenkins Server <je...@builds.apache.org>.
See <https://builds.apache.org/job/sling-trunk-1.8/3416/changes>
Build failed in Jenkins: sling-trunk-1.8 #3415
Posted by Apache Jenkins Server <je...@builds.apache.org>.
See <https://builds.apache.org/job/sling-trunk-1.8/3415/>
------------------------------------------
[...truncated 13932 lines...]
A testing/http/clients/src/main/java/org/apache/sling/testing/clients/util/UniquePaths.java
A testing/http/clients/src/main/java/org/apache/sling/testing/clients/util/FormEntityBuilder.java
A testing/http/clients/src/main/java/org/apache/sling/testing/clients/util/InputStreamBodyWithLength.java
A testing/http/clients/src/main/java/org/apache/sling/testing/clients/util/JsonUtils.java
A testing/http/clients/src/main/java/org/apache/sling/testing/clients/util/URLParameterBuilder.java
A testing/http/clients/src/main/java/org/apache/sling/testing/clients/util/SlingParameter.java
A testing/http/clients/src/main/java/org/apache/sling/testing/clients/util/poller
A testing/http/clients/src/main/java/org/apache/sling/testing/clients/util/poller/PathPoller.java
A testing/http/clients/src/main/java/org/apache/sling/testing/clients/util/poller/Poller.java
A testing/http/clients/src/main/java/org/apache/sling/testing/clients/util/poller/AbstractPoller.java
A testing/http/clients/src/main/java/org/apache/sling/testing/clients/util/XSSUtils.java
A testing/http/clients/src/main/java/org/apache/sling/testing/clients/util/HttpUtils.java
A testing/http/clients/src/main/java/org/apache/sling/testing/clients/util/TimeoutsProvider.java
A testing/http/clients/src/main/java/org/apache/sling/testing/clients/util/package-info.java
A testing/http/clients/src/main/java/org/apache/sling/testing/clients/util/PortAllocator.java
A testing/http/clients/src/main/java/org/apache/sling/testing/clients/util/ResourceUtil.java
A testing/http/clients/src/main/java/org/apache/sling/testing/clients/util/config
A testing/http/clients/src/main/java/org/apache/sling/testing/clients/util/config/InstanceConfigException.java
A testing/http/clients/src/main/java/org/apache/sling/testing/clients/util/config/InstanceConfig.java
A testing/http/clients/src/main/java/org/apache/sling/testing/clients/util/config/InstanceConfigCache.java
A testing/http/clients/src/main/java/org/apache/sling/testing/clients/util/config/impl
A testing/http/clients/src/main/java/org/apache/sling/testing/clients/util/config/impl/EmptyInstanceConfig.java
A testing/http/clients/src/main/java/org/apache/sling/testing/clients/util/config/impl/InstanceConfigCacheImpl.java
A testing/http/clients/src/main/java/org/apache/sling/testing/clients/util/config/package-info.java
A testing/http/clients/src/main/java/org/apache/sling/testing/clients/AbstractSlingClient.java
A testing/http/clients/src/main/java/org/apache/sling/testing/clients/SlingClientConfig.java
A testing/http/clients/src/main/java/org/apache/sling/testing/clients/interceptors
A testing/http/clients/src/main/java/org/apache/sling/testing/clients/interceptors/StickyCookieSpec.java
A testing/http/clients/src/main/java/org/apache/sling/testing/clients/interceptors/StickyCookieHolder.java
A testing/http/clients/src/main/java/org/apache/sling/testing/clients/interceptors/StickyCookieInterceptor.java
A testing/http/clients/src/main/java/org/apache/sling/testing/clients/interceptors/TestDescriptionHolder.java
A testing/http/clients/src/main/java/org/apache/sling/testing/clients/interceptors/TestDescriptionInterceptor.java
A testing/http/clients/src/main/java/org/apache/sling/testing/clients/interceptors/package-info.java
A testing/http/clients/src/main/java/org/apache/sling/testing/clients/interceptors/DelayRequestInterceptor.java
A testing/http/clients/src/main/java/org/apache/sling/testing/clients/osgi
A testing/http/clients/src/main/java/org/apache/sling/testing/clients/osgi/ComponentInfo.java
A testing/http/clients/src/main/java/org/apache/sling/testing/clients/osgi/ComponentsInfo.java
A testing/http/clients/src/main/java/org/apache/sling/testing/clients/osgi/Component.java
A testing/http/clients/src/main/java/org/apache/sling/testing/clients/osgi/OsgiConsoleClient.java
A testing/http/clients/src/main/java/org/apache/sling/testing/clients/osgi/package-info.java
A testing/http/clients/src/main/java/org/apache/sling/testing/clients/osgi/BundleInfo.java
A testing/http/clients/src/main/java/org/apache/sling/testing/clients/osgi/BundlesInfo.java
A testing/http/clients/src/main/java/org/apache/sling/testing/clients/osgi/Bundle.java
A testing/http/clients/src/main/java/org/apache/sling/testing/clients/osgi/BundlesInstaller.java
A testing/http/clients/src/main/java/org/apache/sling/testing/clients/osgi/OsgiInstanceConfig.java
A testing/http/clients/src/main/java/org/apache/sling/testing/clients/html
A testing/http/clients/src/main/java/org/apache/sling/testing/clients/html/MicrodataClient.java
A testing/http/clients/src/main/java/org/apache/sling/testing/clients/html/package-info.java
A testing/http/clients/src/main/java/org/apache/sling/testing/clients/instance
A testing/http/clients/src/main/java/org/apache/sling/testing/clients/instance/InstanceConfiguration.java
A testing/http/clients/src/main/java/org/apache/sling/testing/clients/instance/InstanceSetup.java
A testing/http/clients/src/main/java/org/apache/sling/testing/clients/package-info.java
A testing/http/clients/pom.xml
A testing/http/clients/README.md
A testing/org.apache.sling.testing.paxexam
A testing/org.apache.sling.testing.paxexam/src
A testing/org.apache.sling.testing.paxexam/src/main
A testing/org.apache.sling.testing.paxexam/src/main/resources
A testing/org.apache.sling.testing.paxexam/src/main/resources/templates
A testing/org.apache.sling.testing.paxexam/src/main/resources/templates/SlingVersionResolver.txt
A testing/org.apache.sling.testing.paxexam/src/main/resources/templates/SlingOptions.txt
A testing/org.apache.sling.testing.paxexam/src/main/java
A testing/org.apache.sling.testing.paxexam/src/main/java/org
A testing/org.apache.sling.testing.paxexam/src/main/java/org/apache
A testing/org.apache.sling.testing.paxexam/src/main/java/org/apache/sling
A testing/org.apache.sling.testing.paxexam/src/main/java/org/apache/sling/testing
A testing/org.apache.sling.testing.paxexam/src/main/java/org/apache/sling/testing/paxexam
A testing/org.apache.sling.testing.paxexam/src/main/java/org/apache/sling/testing/paxexam/SlingOptions.java
A testing/org.apache.sling.testing.paxexam/src/main/java/org/apache/sling/testing/paxexam/SlingVersionResolver.java
A testing/org.apache.sling.testing.paxexam/pom.xml
A testing/org.apache.sling.testing.paxexam/README.md
A testing/tools
A testing/tools/src
A testing/tools/src/main
A testing/tools/src/main/java
A testing/tools/src/main/java/org
A testing/tools/src/main/java/org/apache
A testing/tools/src/main/java/org/apache/sling
A testing/tools/src/main/java/org/apache/sling/testing
A testing/tools/src/main/java/org/apache/sling/testing/tools
A testing/tools/src/main/java/org/apache/sling/testing/tools/jarexec
AU testing/tools/src/main/java/org/apache/sling/testing/tools/jarexec/ShutdownHookSingleProcessDestroyer.java
AU testing/tools/src/main/java/org/apache/sling/testing/tools/jarexec/package-info.java
AU testing/tools/src/main/java/org/apache/sling/testing/tools/jarexec/JarExecutor.java
A testing/tools/src/main/java/org/apache/sling/testing/tools/osgi
AU testing/tools/src/main/java/org/apache/sling/testing/tools/osgi/package-info.java
AU testing/tools/src/main/java/org/apache/sling/testing/tools/osgi/WebconsoleClient.java
A testing/tools/src/main/java/org/apache/sling/testing/tools/retry
AU testing/tools/src/main/java/org/apache/sling/testing/tools/retry/RetryLoop.java
AU testing/tools/src/main/java/org/apache/sling/testing/tools/retry/package-info.java
A testing/tools/src/main/java/org/apache/sling/testing/tools/serversetup
AU testing/tools/src/main/java/org/apache/sling/testing/tools/serversetup/SetupPhase.java
AU testing/tools/src/main/java/org/apache/sling/testing/tools/serversetup/StartRunnableJarPhase.java
AU testing/tools/src/main/java/org/apache/sling/testing/tools/serversetup/package-info.java
AU testing/tools/src/main/java/org/apache/sling/testing/tools/serversetup/ServerSetup.java
AU testing/tools/src/main/java/org/apache/sling/testing/tools/serversetup/ServerSetupSingleton.java
A testing/tools/src/main/java/org/apache/sling/testing/tools/junit
AU testing/tools/src/main/java/org/apache/sling/testing/tools/junit/RemoteLogDumper.java
A testing/tools/src/main/java/org/apache/sling/testing/tools/junit/TestDescriptionRule.java
A testing/tools/src/main/java/org/apache/sling/testing/tools/junit/TestNameLoggingFilter.java
A testing/tools/src/main/java/org/apache/sling/testing/tools/junit/TestDescriptionInterceptor.java
AU testing/tools/src/main/java/org/apache/sling/testing/tools/junit/package-info.java
A testing/tools/src/main/java/org/apache/sling/testing/tools/sling
AU testing/tools/src/main/java/org/apache/sling/testing/tools/sling/TimeoutsProvider.java
AU testing/tools/src/main/java/org/apache/sling/testing/tools/sling/package-info.java
AU testing/tools/src/main/java/org/apache/sling/testing/tools/sling/SlingTestBase.java
AU testing/tools/src/main/java/org/apache/sling/testing/tools/sling/BundlesInstaller.java
AU testing/tools/src/main/java/org/apache/sling/testing/tools/sling/SlingClient.java
A testing/tools/src/main/java/org/apache/sling/testing/tools/sling/SlingInstanceManager.java
A testing/tools/src/main/java/org/apache/sling/testing/tools/sling/SlingInstancesRule.java
A testing/tools/src/main/java/org/apache/sling/testing/tools/sling/SlingInstance.java
A testing/tools/src/main/java/org/apache/sling/testing/tools/sling/SlingInstanceState.java
A testing/tools/src/main/java/org/apache/sling/testing/tools/http
AU testing/tools/src/main/java/org/apache/sling/testing/tools/http/RequestBuilder.java
AU testing/tools/src/main/java/org/apache/sling/testing/tools/http/RetryingContentChecker.java
AU testing/tools/src/main/java/org/apache/sling/testing/tools/http/package-info.java
AU testing/tools/src/main/java/org/apache/sling/testing/tools/http/RequestExecutor.java
AU testing/tools/src/main/java/org/apache/sling/testing/tools/http/Request.java
AU testing/tools/src/main/java/org/apache/sling/testing/tools/http/RequestDocumentor.java
AU testing/tools/src/main/java/org/apache/sling/testing/tools/http/RequestCustomizer.java
A testing/tools/src/test
A testing/tools/src/test/java
A testing/tools/src/test/java/org
A testing/tools/src/test/java/org/apache
A testing/tools/src/test/java/org/apache/sling
A testing/tools/src/test/java/org/apache/sling/testing
A testing/tools/src/test/java/org/apache/sling/testing/tools
A testing/tools/src/test/java/org/apache/sling/testing/tools/sling
AU testing/tools/src/test/java/org/apache/sling/testing/tools/sling/SlingClientTest.java
A testing/tools/src/test/java/org/apache/sling/testing/tools/sling/SlingInstancesRuleTest.java
A testing/tools/src/test/java/org/apache/sling/testing/tools/test
AU testing/tools/src/test/java/org/apache/sling/testing/tools/test/ServerSetupSingletonTest.java
AU testing/tools/src/test/java/org/apache/sling/testing/tools/test/TestSetupPhase.java
AU testing/tools/src/test/java/org/apache/sling/testing/tools/test/TestServerSetup.java
AU testing/tools/pom.xml
A testing/samples
A testing/samples/module-with-it
A testing/samples/module-with-it/src
A testing/samples/module-with-it/src/main
A testing/samples/module-with-it/src/main/provisioning
AU testing/samples/module-with-it/src/main/provisioning/model.txt
A testing/samples/module-with-it/src/test
A testing/samples/module-with-it/src/test/java
A testing/samples/module-with-it/src/test/java/org
A testing/samples/module-with-it/src/test/java/org/apache
A testing/samples/module-with-it/src/test/java/org/apache/sling
A testing/samples/module-with-it/src/test/java/org/apache/sling/testing
A testing/samples/module-with-it/src/test/java/org/apache/sling/testing/samples
A testing/samples/module-with-it/src/test/java/org/apache/sling/testing/samples/modulewit
AU testing/samples/module-with-it/src/test/java/org/apache/sling/testing/samples/modulewit/BasicTeleportedIT.java
AU testing/samples/module-with-it/pom.xml
A testing/samples/module-with-it/.gitignore
A testing/samples/bundle-with-it
A testing/samples/bundle-with-it/src
A testing/samples/bundle-with-it/src/test
A testing/samples/bundle-with-it/src/test/java
A testing/samples/bundle-with-it/src/test/java/org
A testing/samples/bundle-with-it/src/test/java/org/apache
A testing/samples/bundle-with-it/src/test/java/org/apache/sling
A testing/samples/bundle-with-it/src/test/java/org/apache/sling/junit
A testing/samples/bundle-with-it/src/test/java/org/apache/sling/junit/teleporter
A testing/samples/bundle-with-it/src/test/java/org/apache/sling/junit/teleporter/customizers
A testing/samples/bundle-with-it/src/test/java/org/apache/sling/junit/teleporter/customizers/BWIT_TeleporterCustomizer.java
A testing/samples/bundle-with-it/src/test/java/org/apache/sling/testing
A testing/samples/bundle-with-it/src/test/java/org/apache/sling/testing/samples
A testing/samples/bundle-with-it/src/test/java/org/apache/sling/testing/samples/bundlewit
A testing/samples/bundle-with-it/src/test/java/org/apache/sling/testing/samples/bundlewit/MockResource.java
A testing/samples/bundle-with-it/src/test/java/org/apache/sling/testing/samples/bundlewit/OsgiConsoleHttpIT.java
A testing/samples/bundle-with-it/src/test/java/org/apache/sling/testing/samples/bundlewit/SampleUnitTest.java
A testing/samples/bundle-with-it/src/test/java/org/apache/sling/testing/samples/bundlewit/FilterIT.java
A testing/samples/bundle-with-it/src/test/java/org/apache/sling/testing/samples/bundlewit/BasicTeleportedIT.java
A testing/samples/bundle-with-it/src/test/java/org/apache/sling/testing/samples/bundlewit/ResourceMimeTypeDetectorIT.java
A testing/samples/bundle-with-it/src/test/java/org/apache/sling/testing/samples/bundlewit/MimeTypeServletHttpIT.java
A testing/samples/bundle-with-it/src/main
A testing/samples/bundle-with-it/src/main/java
A testing/samples/bundle-with-it/src/main/java/org
A testing/samples/bundle-with-it/src/main/java/org/apache
A testing/samples/bundle-with-it/src/main/java/org/apache/sling
A testing/samples/bundle-with-it/src/main/java/org/apache/sling/testing
A testing/samples/bundle-with-it/src/main/java/org/apache/sling/testing/samples
A testing/samples/bundle-with-it/src/main/java/org/apache/sling/testing/samples/bundlewit
A testing/samples/bundle-with-it/src/main/java/org/apache/sling/testing/samples/bundlewit/impl
A testing/samples/bundle-with-it/src/main/java/org/apache/sling/testing/samples/bundlewit/impl/ResourceMimeTypeDetectorImpl.java
A testing/samples/bundle-with-it/src/main/java/org/apache/sling/testing/samples/bundlewit/impl/MimeTypeServlet.java
A testing/samples/bundle-with-it/src/main/java/org/apache/sling/testing/samples/bundlewit/api
A testing/samples/bundle-with-it/src/main/java/org/apache/sling/testing/samples/bundlewit/api/ResourceMimeTypeDetector.java
A testing/samples/bundle-with-it/src/main/java/org/apache/sling/testing/samples/bundlewit/api/package-info.java
A testing/samples/bundle-with-it/pom.xml
A .mvn
A .mvn/jvm.config
AU NOTICE
AU LICENSE
U .
At revision 1750048
No changes for http://svn.apache.org/repos/asf/sling/trunk since the previous build
Parsing POMs
Downloaded artifact http://repo.maven.apache.org/maven2/org/apache/sling/sling/26/sling-26.pom
Downloaded artifact http://repo.maven.apache.org/maven2/org/apache/sling/sling/25/sling-25.pom
ERROR: Failed to parse POMs
java.io.IOException: remote file operation failed: <https://builds.apache.org/job/sling-trunk-1.8/ws/trunk> at hudson.remoting.Channel@1c07cf95:jenkins-test-87d: hudson.remoting.ProxyException: hudson.maven.MavenModuleSetBuild$MavenExecutionException: org.apache.maven.project.ProjectBuildingException: Some problems were encountered while processing the POMs:
[FATAL] Non-resolvable parent POM: Could not find artifact org.apache.sling:sling:pom:27-SNAPSHOT and 'parent.relativePath' points at no local POM @ line 24, column 11
at hudson.FilePath.act(FilePath.java:986)
at hudson.FilePath.act(FilePath.java:968)
at hudson.maven.MavenModuleSetBuild$MavenModuleSetBuildExecution.parsePoms(MavenModuleSetBuild.java:960)
at hudson.maven.MavenModuleSetBuild$MavenModuleSetBuildExecution.doRun(MavenModuleSetBuild.java:679)
at hudson.model.AbstractBuild$AbstractBuildExecution.run(AbstractBuild.java:534)
at hudson.model.Run.execute(Run.java:1738)
at hudson.maven.MavenModuleSetBuild.run(MavenModuleSetBuild.java:531)
at hudson.model.ResourceController.execute(ResourceController.java:98)
at hudson.model.Executor.run(Executor.java:410)
Caused by: hudson.remoting.ProxyException: hudson.maven.MavenModuleSetBuild$MavenExecutionException: org.apache.maven.project.ProjectBuildingException: Some problems were encountered while processing the POMs:
[FATAL] Non-resolvable parent POM: Could not find artifact org.apache.sling:sling:pom:27-SNAPSHOT and 'parent.relativePath' points at no local POM @ line 24, column 11
at hudson.maven.MavenModuleSetBuild$PomParser.invoke(MavenModuleSetBuild.java:1364)
at hudson.maven.MavenModuleSetBuild$PomParser.invoke(MavenModuleSetBuild.java:1098)
at hudson.FilePath$FileCallableWrapper.call(FilePath.java:2719)
at hudson.remoting.UserRequest.perform(UserRequest.java:120)
at hudson.remoting.UserRequest.perform(UserRequest.java:48)
at hudson.remoting.Request$2.run(Request.java:326)
at hudson.remoting.InterceptingExecutorService$1.call(InterceptingExecutorService.java:68)
at java.util.concurrent.FutureTask.run(FutureTask.java:262)
at java.util.concurrent.ThreadPoolExecutor.runWorker(ThreadPoolExecutor.java:1145)
at java.util.concurrent.ThreadPoolExecutor$Worker.run(ThreadPoolExecutor.java:615)
at java.lang.Thread.run(Thread.java:745)
at ......remote call to jenkins-test-87d(Native Method)
at hudson.remoting.Channel.attachCallSiteStackTrace(Channel.java:1416)
at hudson.remoting.UserResponse.retrieve(UserRequest.java:220)
at hudson.remoting.Channel.call(Channel.java:781)
at hudson.FilePath.act(FilePath.java:979)
... 8 more
Caused by: hudson.remoting.ProxyException: org.apache.maven.project.ProjectBuildingException: Some problems were encountered while processing the POMs:
[FATAL] Non-resolvable parent POM: Could not find artifact org.apache.sling:sling:pom:27-SNAPSHOT and 'parent.relativePath' points at no local POM @ line 24, column 11
at org.apache.maven.project.DefaultProjectBuilder.build(DefaultProjectBuilder.java:364)
at hudson.maven.MavenEmbedder.buildProjects(MavenEmbedder.java:361)
at hudson.maven.MavenEmbedder.readProjects(MavenEmbedder.java:331)
at hudson.maven.MavenModuleSetBuild$PomParser.invoke(MavenModuleSetBuild.java:1301)
at hudson.maven.MavenModuleSetBuild$PomParser.invoke(MavenModuleSetBuild.java:1098)
at hudson.FilePath$FileCallableWrapper.call(FilePath.java:2719)
at hudson.remoting.UserRequest.perform(UserRequest.java:120)
at hudson.remoting.UserRequest.perform(UserRequest.java:48)
at hudson.remoting.Request$2.run(Request.java:326)
at hudson.remoting.InterceptingExecutorService$1.call(InterceptingExecutorService.java:68)
at java.util.concurrent.FutureTask.run(FutureTask.java:262)
at java.util.concurrent.ThreadPoolExecutor.runWorker(ThreadPoolExecutor.java:1145)
at java.util.concurrent.ThreadPoolExecutor$Worker.run(ThreadPoolExecutor.java:615)
at java.lang.Thread.run(Thread.java:745)
Jenkins build is still unstable: sling-trunk-1.8 #3414
Posted by Apache Jenkins Server <je...@builds.apache.org>.
See <https://builds.apache.org/job/sling-trunk-1.8/changes>