You are viewing a plain text version of this content. The canonical link for it is here.
Posted to builds@lucene.apache.org by Policeman Jenkins Server via builds <bu...@lucene.apache.org> on 2026/05/24 14:55:18 UTC

[JENKINS] Lucene-nightly-main-Linux (64bit/hotspot/jdk-25.0.2) - Build # 1630 - Unstable!

Build: https://jenkins.thetaphi.de/job/Lucene-nightly-main-Linux/1630/
Java: 64bit/hotspot/jdk-25.0.2 -XX:+UseCompressedOops -XX:+UseSerialGC

2 tests failed.
FAILED:  org.apache.lucene.sandbox.search.TestSortedDvMultiRangeQuery.executionError

Error Message:
org.opentest4j.MultipleFailuresError: Multiple Failures (2 failures)
	com.carrotsearch.randomizedtesting.ThreadLeakError: 1 thread leaked from SUITE scope at org.apache.lucene.sandbox.search.TestSortedDvMultiRangeQuery: 
   1) Thread[id=24361, name=CachedExecutor-315-thread-1, state=TIMED_WAITING, group=TGRP-TestSortedDvMultiRangeQuery]
        at java.base/jdk.internal.misc.Unsafe.park(Native Method)
        at java.base/java.util.concurrent.locks.LockSupport.parkNanos(LockSupport.java:408)
        at java.base/java.util.concurrent.LinkedTransferQueue$DualNode.await(LinkedTransferQueue.java:452)
        at java.base/java.util.concurrent.SynchronousQueue$Transferer.xferLifo(SynchronousQueue.java:194)
        at java.base/java.util.concurrent.SynchronousQueue.xfer(SynchronousQueue.java:235)
        at java.base/java.util.concurrent.SynchronousQueue.poll(SynchronousQueue.java:338)
        at java.base/java.util.concurrent.ThreadPoolExecutor.getTask(ThreadPoolExecutor.java:1015)
        at java.base/java.util.concurrent.ThreadPoolExecutor.runWorker(ThreadPoolExecutor.java:1076)
        at java.base/java.util.concurrent.ThreadPoolExecutor$Worker.run(ThreadPoolExecutor.java:614)
        at java.base/java.lang.Thread.run(Thread.java:1474)
	com.carrotsearch.randomizedtesting.ThreadLeakError: There are still zombie threads that couldn't be terminated:
   1) Thread[id=24361, name=CachedExecutor-315-thread-1, state=TIMED_WAITING, group=TGRP-TestSortedDvMultiRangeQuery]
        at java.base/jdk.internal.misc.Unsafe.park(Native Method)
        at java.base/java.util.concurrent.locks.LockSupport.parkNanos(LockSupport.java:408)
        at java.base/java.util.concurrent.LinkedTransferQueue$DualNode.await(LinkedTransferQueue.java:452)
        at java.base/java.util.concurrent.SynchronousQueue$Transferer.xferLifo(SynchronousQueue.java:194)
        at java.base/java.util.concurrent.SynchronousQueue.xfer(SynchronousQueue.java:235)
        at java.base/java.util.concurrent.SynchronousQueue.poll(SynchronousQueue.java:338)
        at java.base/java.util.concurrent.ThreadPoolExecutor.getTask(ThreadPoolExecutor.java:1015)
        at java.base/java.util.concurrent.ThreadPoolExecutor.runWorker(ThreadPoolExecutor.java:1076)
        at java.base/java.util.concurrent.ThreadPoolExecutor$Worker.run(ThreadPoolExecutor.java:614)
        at java.base/java.lang.Thread.run(Thread.java:1474)

Stack Trace:
org.opentest4j.MultipleFailuresError: Multiple Failures (2 failures)
	com.carrotsearch.randomizedtesting.ThreadLeakError: 1 thread leaked from SUITE scope at org.apache.lucene.sandbox.search.TestSortedDvMultiRangeQuery: 
   1) Thread[id=24361, name=CachedExecutor-315-thread-1, state=TIMED_WAITING, group=TGRP-TestSortedDvMultiRangeQuery]
        at java.base/jdk.internal.misc.Unsafe.park(Native Method)
        at java.base/java.util.concurrent.locks.LockSupport.parkNanos(LockSupport.java:408)
        at java.base/java.util.concurrent.LinkedTransferQueue$DualNode.await(LinkedTransferQueue.java:452)
        at java.base/java.util.concurrent.SynchronousQueue$Transferer.xferLifo(SynchronousQueue.java:194)
        at java.base/java.util.concurrent.SynchronousQueue.xfer(SynchronousQueue.java:235)
        at java.base/java.util.concurrent.SynchronousQueue.poll(SynchronousQueue.java:338)
        at java.base/java.util.concurrent.ThreadPoolExecutor.getTask(ThreadPoolExecutor.java:1015)
        at java.base/java.util.concurrent.ThreadPoolExecutor.runWorker(ThreadPoolExecutor.java:1076)
        at java.base/java.util.concurrent.ThreadPoolExecutor$Worker.run(ThreadPoolExecutor.java:614)
        at java.base/java.lang.Thread.run(Thread.java:1474)
	com.carrotsearch.randomizedtesting.ThreadLeakError: There are still zombie threads that couldn't be terminated:
   1) Thread[id=24361, name=CachedExecutor-315-thread-1, state=TIMED_WAITING, group=TGRP-TestSortedDvMultiRangeQuery]
        at java.base/jdk.internal.misc.Unsafe.park(Native Method)
        at java.base/java.util.concurrent.locks.LockSupport.parkNanos(LockSupport.java:408)
        at java.base/java.util.concurrent.LinkedTransferQueue$DualNode.await(LinkedTransferQueue.java:452)
        at java.base/java.util.concurrent.SynchronousQueue$Transferer.xferLifo(SynchronousQueue.java:194)
        at java.base/java.util.concurrent.SynchronousQueue.xfer(SynchronousQueue.java:235)
        at java.base/java.util.concurrent.SynchronousQueue.poll(SynchronousQueue.java:338)
        at java.base/java.util.concurrent.ThreadPoolExecutor.getTask(ThreadPoolExecutor.java:1015)
        at java.base/java.util.concurrent.ThreadPoolExecutor.runWorker(ThreadPoolExecutor.java:1076)
        at java.base/java.util.concurrent.ThreadPoolExecutor$Worker.run(ThreadPoolExecutor.java:614)
        at java.base/java.lang.Thread.run(Thread.java:1474)
	Suppressed: com.carrotsearch.randomizedtesting.ThreadLeakError: 1 thread leaked from SUITE scope at org.apache.lucene.sandbox.search.TestSortedDvMultiRangeQuery: 
   1) Thread[id=24361, name=CachedExecutor-315-thread-1, state=TIMED_WAITING, group=TGRP-TestSortedDvMultiRangeQuery]
        at java.base/jdk.internal.misc.Unsafe.park(Native Method)
        at java.base/java.util.concurrent.locks.LockSupport.parkNanos(LockSupport.java:408)
        at java.base/java.util.concurrent.LinkedTransferQueue$DualNode.await(LinkedTransferQueue.java:452)
        at java.base/java.util.concurrent.SynchronousQueue$Transferer.xferLifo(SynchronousQueue.java:194)
        at java.base/java.util.concurrent.SynchronousQueue.xfer(SynchronousQueue.java:235)
        at java.base/java.util.concurrent.SynchronousQueue.poll(SynchronousQueue.java:338)
        at java.base/java.util.concurrent.ThreadPoolExecutor.getTask(ThreadPoolExecutor.java:1015)
        at java.base/java.util.concurrent.ThreadPoolExecutor.runWorker(ThreadPoolExecutor.java:1076)
        at java.base/java.util.concurrent.ThreadPoolExecutor$Worker.run(ThreadPoolExecutor.java:614)
        at java.base/java.lang.Thread.run(Thread.java:1474)
		at __randomizedtesting.SeedInfo.seed([C469FEE764ADF46E]:0)
	Suppressed: com.carrotsearch.randomizedtesting.ThreadLeakError: There are still zombie threads that couldn't be terminated:
   1) Thread[id=24361, name=CachedExecutor-315-thread-1, state=TIMED_WAITING, group=TGRP-TestSortedDvMultiRangeQuery]
        at java.base/jdk.internal.misc.Unsafe.park(Native Method)
        at java.base/java.util.concurrent.locks.LockSupport.parkNanos(LockSupport.java:408)
        at java.base/java.util.concurrent.LinkedTransferQueue$DualNode.await(LinkedTransferQueue.java:452)
        at java.base/java.util.concurrent.SynchronousQueue$Transferer.xferLifo(SynchronousQueue.java:194)
        at java.base/java.util.concurrent.SynchronousQueue.xfer(SynchronousQueue.java:235)
        at java.base/java.util.concurrent.SynchronousQueue.poll(SynchronousQueue.java:338)
        at java.base/java.util.concurrent.ThreadPoolExecutor.getTask(ThreadPoolExecutor.java:1015)
        at java.base/java.util.concurrent.ThreadPoolExecutor.runWorker(ThreadPoolExecutor.java:1076)
        at java.base/java.util.concurrent.ThreadPoolExecutor$Worker.run(ThreadPoolExecutor.java:614)
        at java.base/java.lang.Thread.run(Thread.java:1474)
		at __randomizedtesting.SeedInfo.seed([C469FEE764ADF46E]:0)


FAILED:  org.apache.lucene.sandbox.search.TestSortedDvMultiRangeQuery.testDuelWithStandardDisjunction

Error Message:
java.lang.AssertionError: expected:<85 hits> but was:<86 hits>

Stack Trace:
java.lang.AssertionError: expected:<85 hits> but was:<86 hits>
	at __randomizedtesting.SeedInfo.seed([C469FEE764ADF46E:466A27247C3EC1AA]:0)
	at junit@4.13.2/org.junit.Assert.fail(Assert.java:89)
	at junit@4.13.2/org.junit.Assert.failNotEquals(Assert.java:835)
	at junit@4.13.2/org.junit.Assert.assertEquals(Assert.java:120)
	at junit@4.13.2/org.junit.Assert.assertEquals(Assert.java:146)
	at org.apache.lucene.sandbox.search.TestSortedDvMultiRangeQuery.testDuelWithStandardDisjunction(TestSortedDvMultiRangeQuery.java:154)