You are viewing a plain text version of this content. The canonical link for it is here.
Posted to dev@zookeeper.apache.org by Apache Jenkins Server <je...@builds.apache.org> on 2016/11/16 08:55:04 UTC

ZooKeeper_branch35_jdk7 - Build # 734 - Failure

See https://builds.apache.org/job/ZooKeeper_branch35_jdk7/734/

###################################################################################
########################## LAST 60 LINES OF THE CONSOLE ###########################
[...truncated 459654 lines...]
    [junit] 	at org.apache.zookeeper.ClientCnxn$SendThread.run(ClientCnxn.java:1214)
    [junit] 2016-11-16 08:52:12,327 [myid:127.0.0.1:24687] - INFO  [main-SendThread(127.0.0.1:24687):ClientCnxn$SendThread@1113] - Opening socket connection to server 127.0.0.1/127.0.0.1:24687. Will not attempt to authenticate using SASL (unknown error)
    [junit] 2016-11-16 08:52:12,328 [myid:127.0.0.1:24687] - WARN  [main-SendThread(127.0.0.1:24687):ClientCnxn$SendThread@1235] - Session 0x1037199d9f50000 for server 127.0.0.1/127.0.0.1:24687, unexpected error, closing socket connection and attempting reconnect
    [junit] java.net.ConnectException: Connection refused
    [junit] 	at sun.nio.ch.SocketChannelImpl.checkConnect(Native Method)
    [junit] 	at sun.nio.ch.SocketChannelImpl.finishConnect(SocketChannelImpl.java:744)
    [junit] 	at org.apache.zookeeper.ClientCnxnSocketNIO.doTransport(ClientCnxnSocketNIO.java:357)
    [junit] 	at org.apache.zookeeper.ClientCnxn$SendThread.run(ClientCnxn.java:1214)
    [junit] 2016-11-16 08:52:12,369 [myid:127.0.0.1:24808] - INFO  [main-SendThread(127.0.0.1:24808):ClientCnxn$SendThread@1113] - Opening socket connection to server 127.0.0.1/127.0.0.1:24808. Will not attempt to authenticate using SASL (unknown error)
    [junit] 2016-11-16 08:52:12,370 [myid:127.0.0.1:24808] - WARN  [main-SendThread(127.0.0.1:24808):ClientCnxn$SendThread@1235] - Session 0x103719f23790000 for server 127.0.0.1/127.0.0.1:24808, unexpected error, closing socket connection and attempting reconnect
    [junit] java.net.ConnectException: Connection refused
    [junit] 	at sun.nio.ch.SocketChannelImpl.checkConnect(Native Method)
    [junit] 	at sun.nio.ch.SocketChannelImpl.finishConnect(SocketChannelImpl.java:744)
    [junit] 	at org.apache.zookeeper.ClientCnxnSocketNIO.doTransport(ClientCnxnSocketNIO.java:357)
    [junit] 	at org.apache.zookeeper.ClientCnxn$SendThread.run(ClientCnxn.java:1214)
    [junit] 2016-11-16 08:52:46,181 [myid:] - INFO  [main:JUnit4ZKTestRunner$LoggedInvokeMethod@82] - Memory used 38674
    [junit] 2016-11-16 08:52:46,181 [myid:] - INFO  [main:JUnit4ZKTestRunner$LoggedInvokeMethod@87] - Number of threads 55
    [junit] 2016-11-16 08:52:46,181 [myid:] - INFO  [main:JUnit4ZKTestRunner$LoggedInvokeMethod@102] - FINISHED TEST METHOD testManyChildWatchersAutoReset
    [junit] 2016-11-16 08:52:46,181 [myid:] - INFO  [main:ClientBase@543] - tearDown starting
    [junit] 2016-11-16 08:52:46,182 [myid:] - INFO  [ProcessThread(sid:0 cport:11225)::PrepRequestProcessor@656] - Processed session termination for sessionid: 0x1037197fcd40000
    [junit] 2016-11-16 08:52:46,214 [myid:] - INFO  [main:ZooKeeper@1311] - Session: 0x1037197fcd40000 closed
    [junit] 2016-11-16 08:52:46,214 [myid:] - INFO  [NIOWorkerThread-5:MBeanRegistry@128] - Unregister MBean [org.apache.ZooKeeperService:name0=StandaloneServer_port11225,name1=Connections,name2=127.0.0.1,name3=0x1037197fcd40000]
    [junit] 2016-11-16 08:52:46,214 [myid:] - INFO  [ProcessThread(sid:0 cport:11225)::PrepRequestProcessor@656] - Processed session termination for sessionid: 0x1037197fcd40001
    [junit] 2016-11-16 08:52:46,214 [myid:] - INFO  [main-EventThread:ClientCnxn$EventThread@513] - EventThread shut down for session: 0x1037197fcd40000
    [junit] 2016-11-16 08:52:46,215 [myid:] - INFO  [NIOWorkerThread-5:NIOServerCnxn@607] - Closed socket connection for client /127.0.0.1:44260 which had sessionid 0x1037197fcd40000
    [junit] 2016-11-16 08:52:46,222 [myid:] - INFO  [main:ZooKeeper@1311] - Session: 0x1037197fcd40001 closed
    [junit] 2016-11-16 08:52:46,222 [myid:] - INFO  [main:ClientBase@513] - STOPPING server
    [junit] 2016-11-16 08:52:46,222 [myid:] - INFO  [NIOWorkerThread-6:MBeanRegistry@128] - Unregister MBean [org.apache.ZooKeeperService:name0=StandaloneServer_port11225,name1=Connections,name2=127.0.0.1,name3=0x1037197fcd40001]
    [junit] 2016-11-16 08:52:46,223 [myid:] - INFO  [ConnnectionExpirer:NIOServerCnxnFactory$ConnectionExpirerThread@583] - ConnnectionExpirerThread interrupted
    [junit] 2016-11-16 08:52:46,223 [myid:] - INFO  [NIOWorkerThread-6:NIOServerCnxn@607] - Closed socket connection for client /127.0.0.1:44215 which had sessionid 0x1037197fcd40001
    [junit] 2016-11-16 08:52:46,222 [myid:] - INFO  [main-EventThread:ClientCnxn$EventThread@513] - EventThread shut down for session: 0x1037197fcd40001
    [junit] 2016-11-16 08:52:46,224 [myid:] - INFO  [NIOServerCxnFactory.SelectorThread-0:NIOServerCnxnFactory$SelectorThread@420] - selector thread exitted run method
    [junit] 2016-11-16 08:52:46,225 [myid:] - INFO  [NIOServerCxnFactory.SelectorThread-1:NIOServerCnxnFactory$SelectorThread@420] - selector thread exitted run method
    [junit] 2016-11-16 08:52:46,225 [myid:] - INFO  [NIOServerCxnFactory.AcceptThread:0.0.0.0/0.0.0.0:11225:NIOServerCnxnFactory$AcceptThread@219] - accept thread exitted run method
    [junit] 2016-11-16 08:52:46,242 [myid:] - INFO  [main:ZooKeeperServer@530] - shutting down
    [junit] 2016-11-16 08:52:46,242 [myid:] - ERROR [main:ZooKeeperServer@502] - ZKShutdownHandler is not registered, so ZooKeeper server won't take any action on ERROR or SHUTDOWN server state changes
    [junit] 2016-11-16 08:52:46,243 [myid:] - INFO  [main:SessionTrackerImpl@232] - Shutting down
    [junit] 2016-11-16 08:52:46,243 [myid:] - INFO  [main:PrepRequestProcessor@974] - Shutting down
    [junit] 2016-11-16 08:52:46,243 [myid:] - INFO  [main:SyncRequestProcessor@191] - Shutting down
    [junit] 2016-11-16 08:52:46,243 [myid:] - INFO  [ProcessThread(sid:0 cport:11225)::PrepRequestProcessor@154] - PrepRequestProcessor exited loop!
    [junit] 2016-11-16 08:52:46,243 [myid:] - INFO  [SyncThread:0:SyncRequestProcessor@169] - SyncRequestProcessor exited!
    [junit] 2016-11-16 08:52:46,251 [myid:] - INFO  [main:FinalRequestProcessor@479] - shutdown of request processor complete
    [junit] 2016-11-16 08:52:46,252 [myid:] - INFO  [main:MBeanRegistry@128] - Unregister MBean [org.apache.ZooKeeperService:name0=StandaloneServer_port11225,name1=InMemoryDataTree]
    [junit] 2016-11-16 08:52:46,252 [myid:] - INFO  [main:MBeanRegistry@128] - Unregister MBean [org.apache.ZooKeeperService:name0=StandaloneServer_port11225]
    [junit] 2016-11-16 08:52:46,253 [myid:] - INFO  [main:FourLetterWordMain@85] - connecting to 127.0.0.1 11225
    [junit] 2016-11-16 08:52:46,253 [myid:] - INFO  [main:JMXEnv@146] - ensureOnly:[]
    [junit] 2016-11-16 08:52:46,267 [myid:] - INFO  [main:ClientBase@568] - fdcount after test is: 54 at start it was 54
    [junit] 2016-11-16 08:52:46,267 [myid:] - INFO  [main:ZKTestCase$1@65] - SUCCEEDED testManyChildWatchersAutoReset
    [junit] 2016-11-16 08:52:46,267 [myid:] - INFO  [main:ZKTestCase$1@60] - FINISHED testManyChildWatchersAutoReset
    [junit] Tests run: 4, Failures: 0, Errors: 0, Skipped: 0, Time elapsed: 748.567 sec, Thread: 1, Class: org.apache.zookeeper.test.DisconnectedWatcherTest

BUILD FAILED
/home/jenkins/jenkins-slave/workspace/ZooKeeper_branch35_jdk7/build.xml:1208: Tests failed!

Total time: 16 minutes 4 seconds
Build step 'Invoke Ant' marked build as failure
Recording test results
Email was triggered for: Failure - Any
Sending email for trigger: Failure - Any



###################################################################################
############################## FAILED TESTS (if any) ##############################
2 tests failed.
FAILED:  org.apache.zookeeper.server.quorum.ReconfigDuringLeaderSyncTest.testDuringLeaderSync

Error Message:
zoo.cfg.dynamic.next is not deleted.

Stack Trace:
junit.framework.AssertionFailedError: zoo.cfg.dynamic.next is not deleted.
	at org.apache.zookeeper.server.quorum.ReconfigDuringLeaderSyncTest.testDuringLeaderSync(ReconfigDuringLeaderSyncTest.java:165)
	at org.apache.zookeeper.JUnit4ZKTestRunner$LoggedInvokeMethod.evaluate(JUnit4ZKTestRunner.java:79)


FAILED:  org.apache.zookeeper.test.SSLTest.testSecureQuorumServer

Error Message:
waiting for server 0 being up

Stack Trace:
junit.framework.AssertionFailedError: waiting for server 0 being up
	at org.apache.zookeeper.test.SSLTest.testSecureQuorumServer(SSLTest.java:96)
	at org.apache.zookeeper.JUnit4ZKTestRunner$LoggedInvokeMethod.evaluate(JUnit4ZKTestRunner.java:79)



ZooKeeper_branch35_jdk7 - Build # 737 - Still Failing

Posted by Apache Jenkins Server <je...@builds.apache.org>.
See https://builds.apache.org/job/ZooKeeper_branch35_jdk7/737/

###################################################################################
########################## LAST 60 LINES OF THE CONSOLE ###########################
[...truncated 474317 lines...]
    [junit] 	at java.util.concurrent.ThreadPoolExecutor.runWorker(ThreadPoolExecutor.java:1145)
    [junit] 	at java.util.concurrent.ThreadPoolExecutor$Worker.run(ThreadPoolExecutor.java:615)
    [junit] 	at java.lang.Thread.run(Thread.java:745)
    [junit] 2016-11-19 08:48:53,211 [myid:] - INFO  [SyncThread:0:MBeanRegistry@128] - Unregister MBean [org.apache.ZooKeeperService:name0=StandaloneServer_port22238,name1=Connections,name2=127.0.0.1,name3=0x100a820eeea0000]
    [junit] 2016-11-19 08:48:53,312 [myid:] - INFO  [main:ZooKeeper@1311] - Session: 0x100a820eeea0000 closed
    [junit] 2016-11-19 08:48:53,312 [myid:] - INFO  [main-EventThread:ClientCnxn$EventThread@513] - EventThread shut down for session: 0x100a820eeea0000
    [junit] 2016-11-19 08:48:53,312 [myid:] - INFO  [main:JUnit4ZKTestRunner$LoggedInvokeMethod@82] - Memory used 157643
    [junit] 2016-11-19 08:48:53,312 [myid:] - INFO  [main:JUnit4ZKTestRunner$LoggedInvokeMethod@87] - Number of threads 1642
    [junit] 2016-11-19 08:48:53,312 [myid:] - INFO  [main:JUnit4ZKTestRunner$LoggedInvokeMethod@102] - FINISHED TEST METHOD testWatcherAutoResetWithLocal
    [junit] 2016-11-19 08:48:53,313 [myid:] - INFO  [main:ClientBase@543] - tearDown starting
    [junit] 2016-11-19 08:48:53,313 [myid:] - INFO  [main:ClientBase@513] - STOPPING server
    [junit] 2016-11-19 08:48:53,313 [myid:] - INFO  [main:NettyServerCnxnFactory@464] - shutdown called 0.0.0.0/0.0.0.0:22238
    [junit] 2016-11-19 08:48:53,318 [myid:] - INFO  [main:ZooKeeperServer@530] - shutting down
    [junit] 2016-11-19 08:48:53,319 [myid:] - ERROR [main:ZooKeeperServer@502] - ZKShutdownHandler is not registered, so ZooKeeper server won't take any action on ERROR or SHUTDOWN server state changes
    [junit] 2016-11-19 08:48:53,319 [myid:] - INFO  [main:SessionTrackerImpl@232] - Shutting down
    [junit] 2016-11-19 08:48:53,319 [myid:] - INFO  [main:PrepRequestProcessor@974] - Shutting down
    [junit] 2016-11-19 08:48:53,319 [myid:] - INFO  [main:SyncRequestProcessor@191] - Shutting down
    [junit] 2016-11-19 08:48:53,319 [myid:] - INFO  [ProcessThread(sid:0 cport:22238)::PrepRequestProcessor@154] - PrepRequestProcessor exited loop!
    [junit] 2016-11-19 08:48:53,319 [myid:] - INFO  [SyncThread:0:SyncRequestProcessor@169] - SyncRequestProcessor exited!
    [junit] 2016-11-19 08:48:53,322 [myid:] - INFO  [main:FinalRequestProcessor@479] - shutdown of request processor complete
    [junit] 2016-11-19 08:48:53,322 [myid:] - INFO  [main:MBeanRegistry@128] - Unregister MBean [org.apache.ZooKeeperService:name0=StandaloneServer_port22238,name1=InMemoryDataTree]
    [junit] 2016-11-19 08:48:53,322 [myid:] - INFO  [main:MBeanRegistry@128] - Unregister MBean [org.apache.ZooKeeperService:name0=StandaloneServer_port22238]
    [junit] 2016-11-19 08:48:53,345 [myid:] - INFO  [main:FourLetterWordMain@85] - connecting to 127.0.0.1 22238
    [junit] 2016-11-19 08:48:53,345 [myid:] - INFO  [main:JMXEnv@146] - ensureOnly:[]
    [junit] 2016-11-19 08:48:53,353 [myid:] - INFO  [main:ClientBase@568] - fdcount after test is: 4825 at start it was 4829
    [junit] 2016-11-19 08:48:53,353 [myid:] - INFO  [main:ZKTestCase$1@65] - SUCCEEDED testWatcherAutoResetWithLocal
    [junit] 2016-11-19 08:48:53,353 [myid:] - INFO  [main:ZKTestCase$1@60] - FINISHED testWatcherAutoResetWithLocal
    [junit] Tests run: 101, Failures: 1, Errors: 0, Skipped: 0, Time elapsed: 477.593 sec, Thread: 5, Class: org.apache.zookeeper.test.NioNettySuiteTest
    [junit] 2016-11-19 08:48:53,389 [myid:127.0.0.1:22115] - INFO  [main-SendThread(127.0.0.1:22115):ClientCnxn$SendThread@1113] - Opening socket connection to server 127.0.0.1/127.0.0.1:22115. Will not attempt to authenticate using SASL (unknown error)
    [junit] 2016-11-19 08:48:53,389 [myid:127.0.0.1:22115] - WARN  [main-SendThread(127.0.0.1:22115):ClientCnxn$SendThread@1235] - Session 0x100a81db59b0000 for server 127.0.0.1/127.0.0.1:22115, unexpected error, closing socket connection and attempting reconnect
    [junit] java.net.ConnectException: Connection refused
    [junit] 	at sun.nio.ch.SocketChannelImpl.checkConnect(Native Method)
    [junit] 	at sun.nio.ch.SocketChannelImpl.finishConnect(SocketChannelImpl.java:744)
    [junit] 	at org.apache.zookeeper.ClientCnxnSocketNIO.doTransport(ClientCnxnSocketNIO.java:357)
    [junit] 	at org.apache.zookeeper.ClientCnxn$SendThread.run(ClientCnxn.java:1214)
    [junit] 2016-11-19 08:48:53,491 [myid:127.0.0.1:22118] - INFO  [main-SendThread(127.0.0.1:22118):ClientCnxn$SendThread@1113] - Opening socket connection to server 127.0.0.1/127.0.0.1:22118. Will not attempt to authenticate using SASL (unknown error)
    [junit] 2016-11-19 08:48:53,492 [myid:127.0.0.1:22118] - WARN  [main-SendThread(127.0.0.1:22118):ClientCnxn$SendThread@1235] - Session 0x200a81db9210000 for server 127.0.0.1/127.0.0.1:22118, unexpected error, closing socket connection and attempting reconnect
    [junit] java.net.ConnectException: Connection refused
    [junit] 	at sun.nio.ch.SocketChannelImpl.checkConnect(Native Method)
    [junit] 	at sun.nio.ch.SocketChannelImpl.finishConnect(SocketChannelImpl.java:744)
    [junit] 	at org.apache.zookeeper.ClientCnxnSocketNIO.doTransport(ClientCnxnSocketNIO.java:357)
    [junit] 	at org.apache.zookeeper.ClientCnxn$SendThread.run(ClientCnxn.java:1214)
    [junit] 2016-11-19 08:48:53,554 [myid:127.0.0.1:22121] - INFO  [main-SendThread(127.0.0.1:22121):ClientCnxn$SendThread@1113] - Opening socket connection to server 127.0.0.1/127.0.0.1:22121. Will not attempt to authenticate using SASL (unknown error)
    [junit] 2016-11-19 08:48:53,554 [myid:127.0.0.1:22121] - WARN  [main-SendThread(127.0.0.1:22121):ClientCnxn$SendThread@1235] - Session 0x300a81db59f0000 for server 127.0.0.1/127.0.0.1:22121, unexpected error, closing socket connection and attempting reconnect
    [junit] java.net.ConnectException: Connection refused
    [junit] 	at sun.nio.ch.SocketChannelImpl.checkConnect(Native Method)
    [junit] 	at sun.nio.ch.SocketChannelImpl.finishConnect(SocketChannelImpl.java:744)
    [junit] 	at org.apache.zookeeper.ClientCnxnSocketNIO.doTransport(ClientCnxnSocketNIO.java:357)
    [junit] 	at org.apache.zookeeper.ClientCnxn$SendThread.run(ClientCnxn.java:1214)
    [junit] Test org.apache.zookeeper.test.NioNettySuiteTest FAILED

BUILD FAILED
/home/jenkins/jenkins-slave/workspace/ZooKeeper_branch35_jdk7/build.xml:1208: Tests failed!

Total time: 11 minutes 2 seconds
Build step 'Invoke Ant' marked build as failure
Recording test results
Email was triggered for: Failure - Any
Sending email for trigger: Failure - Any



###################################################################################
############################## FAILED TESTS (if any) ##############################
1 tests failed.
FAILED:  org.apache.zookeeper.test.ReconfigTest.testQuorumSystemChange

Error Message:
waiting for server up

Stack Trace:
junit.framework.AssertionFailedError: waiting for server up
	at org.apache.zookeeper.test.QuorumUtil.startAll(QuorumUtil.java:151)
	at org.apache.zookeeper.test.ReconfigTest.testQuorumSystemChange(ReconfigTest.java:819)
	at org.apache.zookeeper.JUnit4ZKTestRunner$LoggedInvokeMethod.evaluate(JUnit4ZKTestRunner.java:79)



ZooKeeper_branch35_jdk7 - Build # 736 - Still Failing

Posted by Apache Jenkins Server <je...@builds.apache.org>.
See https://builds.apache.org/job/ZooKeeper_branch35_jdk7/736/

###################################################################################
########################## LAST 60 LINES OF THE CONSOLE ###########################
[...truncated 475618 lines...]
    [junit] 	at org.jboss.netty.channel.socket.nio.AbstractNioWorker.writeFromTaskLoop(AbstractNioWorker.java:151)
    [junit] 	at org.jboss.netty.channel.socket.nio.AbstractNioChannel$WriteTask.run(AbstractNioChannel.java:315)
    [junit] 	at org.jboss.netty.channel.socket.nio.AbstractNioSelector.processTaskQueue(AbstractNioSelector.java:391)
    [junit] 	at org.jboss.netty.channel.socket.nio.AbstractNioSelector.run(AbstractNioSelector.java:315)
    [junit] 	at org.jboss.netty.channel.socket.nio.AbstractNioWorker.run(AbstractNioWorker.java:89)
    [junit] 	at org.jboss.netty.channel.socket.nio.NioWorker.run(NioWorker.java:178)
    [junit] 	at org.jboss.netty.util.ThreadRenamingRunnable.run(ThreadRenamingRunnable.java:108)
    [junit] 	at org.jboss.netty.util.internal.DeadLockProofWorker$1.run(DeadLockProofWorker.java:42)
    [junit] 	at java.util.concurrent.ThreadPoolExecutor.runWorker(ThreadPoolExecutor.java:1145)
    [junit] 	at java.util.concurrent.ThreadPoolExecutor$Worker.run(ThreadPoolExecutor.java:615)
    [junit] 	at java.lang.Thread.run(Thread.java:745)
    [junit] 2016-11-18 08:51:58,574 [myid:] - INFO  [SyncThread:0:MBeanRegistry@128] - Unregister MBean [org.apache.ZooKeeperService:name0=StandaloneServer_port19545,name1=Connections,name2=127.0.0.1,name3=0x1009651f5830000]
    [junit] 2016-11-18 08:51:58,674 [myid:] - INFO  [main:ZooKeeper@1311] - Session: 0x1009651f5830000 closed
    [junit] 2016-11-18 08:51:58,674 [myid:] - INFO  [main-EventThread:ClientCnxn$EventThread@513] - EventThread shut down for session: 0x1009651f5830000
    [junit] 2016-11-18 08:51:58,674 [myid:] - INFO  [main:JUnit4ZKTestRunner$LoggedInvokeMethod@82] - Memory used 202453
    [junit] 2016-11-18 08:51:58,675 [myid:] - INFO  [main:JUnit4ZKTestRunner$LoggedInvokeMethod@87] - Number of threads 1642
    [junit] 2016-11-18 08:51:58,675 [myid:] - INFO  [main:JUnit4ZKTestRunner$LoggedInvokeMethod@102] - FINISHED TEST METHOD testWatcherAutoResetWithLocal
    [junit] 2016-11-18 08:51:58,675 [myid:] - INFO  [main:ClientBase@543] - tearDown starting
    [junit] 2016-11-18 08:51:58,675 [myid:] - INFO  [main:ClientBase@513] - STOPPING server
    [junit] 2016-11-18 08:51:58,675 [myid:] - INFO  [main:NettyServerCnxnFactory@464] - shutdown called 0.0.0.0/0.0.0.0:19545
    [junit] 2016-11-18 08:51:58,681 [myid:] - INFO  [main:ZooKeeperServer@530] - shutting down
    [junit] 2016-11-18 08:51:58,681 [myid:] - ERROR [main:ZooKeeperServer@502] - ZKShutdownHandler is not registered, so ZooKeeper server won't take any action on ERROR or SHUTDOWN server state changes
    [junit] 2016-11-18 08:51:58,681 [myid:] - INFO  [main:SessionTrackerImpl@232] - Shutting down
    [junit] 2016-11-18 08:51:58,681 [myid:] - INFO  [main:PrepRequestProcessor@974] - Shutting down
    [junit] 2016-11-18 08:51:58,681 [myid:] - INFO  [main:SyncRequestProcessor@191] - Shutting down
    [junit] 2016-11-18 08:51:58,681 [myid:] - INFO  [ProcessThread(sid:0 cport:19545)::PrepRequestProcessor@154] - PrepRequestProcessor exited loop!
    [junit] 2016-11-18 08:51:58,682 [myid:] - INFO  [SyncThread:0:SyncRequestProcessor@169] - SyncRequestProcessor exited!
    [junit] 2016-11-18 08:51:58,682 [myid:] - INFO  [main:FinalRequestProcessor@479] - shutdown of request processor complete
    [junit] 2016-11-18 08:51:58,682 [myid:] - INFO  [main:MBeanRegistry@128] - Unregister MBean [org.apache.ZooKeeperService:name0=StandaloneServer_port19545,name1=InMemoryDataTree]
    [junit] 2016-11-18 08:51:58,683 [myid:] - INFO  [main:MBeanRegistry@128] - Unregister MBean [org.apache.ZooKeeperService:name0=StandaloneServer_port19545]
    [junit] 2016-11-18 08:51:58,683 [myid:] - INFO  [main:FourLetterWordMain@85] - connecting to 127.0.0.1 19545
    [junit] 2016-11-18 08:51:58,683 [myid:] - INFO  [main:JMXEnv@146] - ensureOnly:[]
    [junit] 2016-11-18 08:51:58,689 [myid:] - INFO  [main:ClientBase@568] - fdcount after test is: 4826 at start it was 4826
    [junit] 2016-11-18 08:51:58,689 [myid:] - INFO  [main:ZKTestCase$1@65] - SUCCEEDED testWatcherAutoResetWithLocal
    [junit] 2016-11-18 08:51:58,689 [myid:] - INFO  [main:ZKTestCase$1@60] - FINISHED testWatcherAutoResetWithLocal
    [junit] Tests run: 101, Failures: 0, Errors: 0, Skipped: 0, Time elapsed: 578.545 sec, Thread: 4, Class: org.apache.zookeeper.test.NioNettySuiteTest
    [junit] 2016-11-18 08:51:59,090 [myid:127.0.0.1:19422] - INFO  [main-SendThread(127.0.0.1:19422):ClientCnxn$SendThread@1113] - Opening socket connection to server 127.0.0.1/127.0.0.1:19422. Will not attempt to authenticate using SASL (unknown error)
    [junit] 2016-11-18 08:51:59,091 [myid:127.0.0.1:19422] - WARN  [main-SendThread(127.0.0.1:19422):ClientCnxn$SendThread@1235] - Session 0x100964e792a0000 for server 127.0.0.1/127.0.0.1:19422, unexpected error, closing socket connection and attempting reconnect
    [junit] java.net.ConnectException: Connection refused
    [junit] 	at sun.nio.ch.SocketChannelImpl.checkConnect(Native Method)
    [junit] 	at sun.nio.ch.SocketChannelImpl.finishConnect(SocketChannelImpl.java:744)
    [junit] 	at org.apache.zookeeper.ClientCnxnSocketNIO.doTransport(ClientCnxnSocketNIO.java:357)
    [junit] 	at org.apache.zookeeper.ClientCnxn$SendThread.run(ClientCnxn.java:1214)
    [junit] 2016-11-18 08:51:59,308 [myid:127.0.0.1:19301] - INFO  [main-SendThread(127.0.0.1:19301):ClientCnxn$SendThread@1113] - Opening socket connection to server 127.0.0.1/127.0.0.1:19301. Will not attempt to authenticate using SASL (unknown error)
    [junit] 2016-11-18 08:51:59,308 [myid:127.0.0.1:19301] - WARN  [main-SendThread(127.0.0.1:19301):ClientCnxn$SendThread@1235] - Session 0x10096493ea80000 for server 127.0.0.1/127.0.0.1:19301, unexpected error, closing socket connection and attempting reconnect
    [junit] java.net.ConnectException: Connection refused
    [junit] 	at sun.nio.ch.SocketChannelImpl.checkConnect(Native Method)
    [junit] 	at sun.nio.ch.SocketChannelImpl.finishConnect(SocketChannelImpl.java:744)
    [junit] 	at org.apache.zookeeper.ClientCnxnSocketNIO.doTransport(ClientCnxnSocketNIO.java:357)
    [junit] 	at org.apache.zookeeper.ClientCnxn$SendThread.run(ClientCnxn.java:1214)

BUILD FAILED
/home/jenkins/jenkins-slave/workspace/ZooKeeper_branch35_jdk7/build.xml:1208: Tests failed!

Total time: 14 minutes 25 seconds
Build step 'Invoke Ant' marked build as failure
Recording test results
Email was triggered for: Failure - Any
Sending email for trigger: Failure - Any



###################################################################################
############################## FAILED TESTS (if any) ##############################
7 tests failed.
FAILED:  org.apache.zookeeper.test.WatcherTest.testWatchAutoResetWithPending

Error Message:
Unexpected bean exists! expected:<0> but was:<1>

Stack Trace:
junit.framework.AssertionFailedError: Unexpected bean exists! expected:<0> but was:<1>
	at org.apache.zookeeper.test.ClientBase.verifyUnexpectedBeans(ClientBase.java:498)
	at org.apache.zookeeper.test.ClientBase.startServer(ClientBase.java:477)
	at org.apache.zookeeper.test.ClientBase.setUp(ClientBase.java:460)
	at org.apache.zookeeper.test.WatcherTest.setUp(WatcherTest.java:73)


FAILED:  org.apache.zookeeper.test.WatcherTest.testWatcherCorrectness

Error Message:
Unexpected bean exists! expected:<0> but was:<1>

Stack Trace:
junit.framework.AssertionFailedError: Unexpected bean exists! expected:<0> but was:<1>
	at org.apache.zookeeper.test.ClientBase.verifyUnexpectedBeans(ClientBase.java:498)
	at org.apache.zookeeper.test.ClientBase.startServer(ClientBase.java:477)
	at org.apache.zookeeper.test.ClientBase.setUp(ClientBase.java:460)
	at org.apache.zookeeper.test.WatcherTest.setUp(WatcherTest.java:73)


FAILED:  org.apache.zookeeper.test.WatcherTest.testWatcherAutoResetDisabledWithLocal

Error Message:
Unexpected bean exists! expected:<0> but was:<1>

Stack Trace:
junit.framework.AssertionFailedError: Unexpected bean exists! expected:<0> but was:<1>
	at org.apache.zookeeper.test.ClientBase.verifyUnexpectedBeans(ClientBase.java:498)
	at org.apache.zookeeper.test.ClientBase.startServer(ClientBase.java:477)
	at org.apache.zookeeper.test.ClientBase.setUp(ClientBase.java:460)
	at org.apache.zookeeper.test.WatcherTest.setUp(WatcherTest.java:73)


FAILED:  org.apache.zookeeper.test.WatcherTest.testWatcherAutoResetWithGlobal

Error Message:
Unexpected bean exists! expected:<0> but was:<1>

Stack Trace:
junit.framework.AssertionFailedError: Unexpected bean exists! expected:<0> but was:<1>
	at org.apache.zookeeper.test.ClientBase.verifyUnexpectedBeans(ClientBase.java:498)
	at org.apache.zookeeper.test.ClientBase.startServer(ClientBase.java:477)
	at org.apache.zookeeper.test.ClientBase.setUp(ClientBase.java:460)
	at org.apache.zookeeper.test.WatcherTest.setUp(WatcherTest.java:73)


FAILED:  org.apache.zookeeper.test.WatcherTest.testWatcherCount

Error Message:
Unexpected bean exists! expected:<0> but was:<1>

Stack Trace:
junit.framework.AssertionFailedError: Unexpected bean exists! expected:<0> but was:<1>
	at org.apache.zookeeper.test.ClientBase.verifyUnexpectedBeans(ClientBase.java:498)
	at org.apache.zookeeper.test.ClientBase.startServer(ClientBase.java:477)
	at org.apache.zookeeper.test.ClientBase.setUp(ClientBase.java:460)
	at org.apache.zookeeper.test.WatcherTest.setUp(WatcherTest.java:73)


FAILED:  org.apache.zookeeper.test.WatcherTest.testWatcherAutoResetDisabledWithGlobal

Error Message:
Unexpected bean exists! expected:<0> but was:<1>

Stack Trace:
junit.framework.AssertionFailedError: Unexpected bean exists! expected:<0> but was:<1>
	at org.apache.zookeeper.test.ClientBase.verifyUnexpectedBeans(ClientBase.java:498)
	at org.apache.zookeeper.test.ClientBase.startServer(ClientBase.java:477)
	at org.apache.zookeeper.test.ClientBase.setUp(ClientBase.java:460)
	at org.apache.zookeeper.test.WatcherTest.setUp(WatcherTest.java:73)


FAILED:  org.apache.zookeeper.test.WatcherTest.testWatcherAutoResetWithLocal

Error Message:
Unexpected bean exists! expected:<0> but was:<1>

Stack Trace:
junit.framework.AssertionFailedError: Unexpected bean exists! expected:<0> but was:<1>
	at org.apache.zookeeper.test.ClientBase.verifyUnexpectedBeans(ClientBase.java:498)
	at org.apache.zookeeper.test.ClientBase.startServer(ClientBase.java:477)
	at org.apache.zookeeper.test.ClientBase.setUp(ClientBase.java:460)
	at org.apache.zookeeper.test.WatcherTest.setUp(WatcherTest.java:73)



ZooKeeper_branch35_jdk7 - Build # 735 - Still Failing

Posted by Apache Jenkins Server <je...@builds.apache.org>.
See https://builds.apache.org/job/ZooKeeper_branch35_jdk7/735/

###################################################################################
########################## LAST 60 LINES OF THE CONSOLE ###########################
[...truncated 493366 lines...]
    [junit] 2016-11-17 08:52:25,985 [myid:127.0.0.1:21994] - INFO  [main-SendThread(127.0.0.1:21994):ClientCnxn$SendThread@1113] - Opening socket connection to server 127.0.0.1/127.0.0.1:21994. Will not attempt to authenticate using SASL (unknown error)
    [junit] 2016-11-17 08:52:25,986 [myid:127.0.0.1:21994] - WARN  [main-SendThread(127.0.0.1:21994):ClientCnxn$SendThread@1235] - Session 0x10376c05bfe0000 for server 127.0.0.1/127.0.0.1:21994, unexpected error, closing socket connection and attempting reconnect
    [junit] java.net.ConnectException: Connection refused
    [junit] 	at sun.nio.ch.SocketChannelImpl.checkConnect(Native Method)
    [junit] 	at sun.nio.ch.SocketChannelImpl.finishConnect(SocketChannelImpl.java:744)
    [junit] 	at org.apache.zookeeper.ClientCnxnSocketNIO.doTransport(ClientCnxnSocketNIO.java:357)
    [junit] 	at org.apache.zookeeper.ClientCnxn$SendThread.run(ClientCnxn.java:1214)
    [junit] 2016-11-17 08:52:26,397 [myid:127.0.0.1:22118] - INFO  [main-SendThread(127.0.0.1:22118):ClientCnxn$SendThread@1113] - Opening socket connection to server 127.0.0.1/127.0.0.1:22118. Will not attempt to authenticate using SASL (unknown error)
    [junit] 2016-11-17 08:52:26,398 [myid:127.0.0.1:22118] - WARN  [main-SendThread(127.0.0.1:22118):ClientCnxn$SendThread@1235] - Session 0x20376c5a1820000 for server 127.0.0.1/127.0.0.1:22118, unexpected error, closing socket connection and attempting reconnect
    [junit] java.net.ConnectException: Connection refused
    [junit] 	at sun.nio.ch.SocketChannelImpl.checkConnect(Native Method)
    [junit] 	at sun.nio.ch.SocketChannelImpl.finishConnect(SocketChannelImpl.java:744)
    [junit] 	at org.apache.zookeeper.ClientCnxnSocketNIO.doTransport(ClientCnxnSocketNIO.java:357)
    [junit] 	at org.apache.zookeeper.ClientCnxn$SendThread.run(ClientCnxn.java:1214)
    [junit] 2016-11-17 08:52:56,788 [myid:] - INFO  [main:JUnit4ZKTestRunner$LoggedInvokeMethod@82] - Memory used 28956
    [junit] 2016-11-17 08:52:56,789 [myid:] - INFO  [main:JUnit4ZKTestRunner$LoggedInvokeMethod@87] - Number of threads 55
    [junit] 2016-11-17 08:52:56,789 [myid:] - INFO  [main:JUnit4ZKTestRunner$LoggedInvokeMethod@102] - FINISHED TEST METHOD testManyChildWatchersAutoReset
    [junit] 2016-11-17 08:52:56,789 [myid:] - INFO  [main:ClientBase@543] - tearDown starting
    [junit] 2016-11-17 08:52:56,790 [myid:] - INFO  [ProcessThread(sid:0 cport:19304)::PrepRequestProcessor@656] - Processed session termination for sessionid: 0x10376be83310000
    [junit] 2016-11-17 08:52:56,805 [myid:] - INFO  [main:ZooKeeper@1311] - Session: 0x10376be83310000 closed
    [junit] 2016-11-17 08:52:56,805 [myid:] - INFO  [NIOWorkerThread-21:MBeanRegistry@128] - Unregister MBean [org.apache.ZooKeeperService:name0=StandaloneServer_port19304,name1=Connections,name2=127.0.0.1,name3=0x10376be83310000]
    [junit] 2016-11-17 08:52:56,805 [myid:] - INFO  [main-EventThread:ClientCnxn$EventThread@513] - EventThread shut down for session: 0x10376be83310000
    [junit] 2016-11-17 08:52:56,806 [myid:] - INFO  [ProcessThread(sid:0 cport:19304)::PrepRequestProcessor@656] - Processed session termination for sessionid: 0x10376be83310001
    [junit] 2016-11-17 08:52:56,806 [myid:] - INFO  [NIOWorkerThread-21:NIOServerCnxn@607] - Closed socket connection for client /127.0.0.1:54490 which had sessionid 0x10376be83310000
    [junit] 2016-11-17 08:52:56,847 [myid:] - INFO  [NIOWorkerThread-25:MBeanRegistry@128] - Unregister MBean [org.apache.ZooKeeperService:name0=StandaloneServer_port19304,name1=Connections,name2=127.0.0.1,name3=0x10376be83310001]
    [junit] 2016-11-17 08:52:56,848 [myid:] - INFO  [NIOWorkerThread-25:NIOServerCnxn@607] - Closed socket connection for client /127.0.0.1:54477 which had sessionid 0x10376be83310001
    [junit] 2016-11-17 08:52:56,848 [myid:] - INFO  [main:ZooKeeper@1311] - Session: 0x10376be83310001 closed
    [junit] 2016-11-17 08:52:56,848 [myid:] - INFO  [main:ClientBase@513] - STOPPING server
    [junit] 2016-11-17 08:52:56,848 [myid:] - INFO  [main-EventThread:ClientCnxn$EventThread@513] - EventThread shut down for session: 0x10376be83310001
    [junit] 2016-11-17 08:52:56,849 [myid:] - INFO  [ConnnectionExpirer:NIOServerCnxnFactory$ConnectionExpirerThread@583] - ConnnectionExpirerThread interrupted
    [junit] 2016-11-17 08:52:56,850 [myid:] - INFO  [NIOServerCxnFactory.AcceptThread:0.0.0.0/0.0.0.0:19304:NIOServerCnxnFactory$AcceptThread@219] - accept thread exitted run method
    [junit] 2016-11-17 08:52:56,852 [myid:] - INFO  [NIOServerCxnFactory.SelectorThread-0:NIOServerCnxnFactory$SelectorThread@420] - selector thread exitted run method
    [junit] 2016-11-17 08:52:56,852 [myid:] - INFO  [NIOServerCxnFactory.SelectorThread-1:NIOServerCnxnFactory$SelectorThread@420] - selector thread exitted run method
    [junit] 2016-11-17 08:52:56,852 [myid:] - INFO  [main:ZooKeeperServer@530] - shutting down
    [junit] 2016-11-17 08:52:56,853 [myid:] - ERROR [main:ZooKeeperServer@502] - ZKShutdownHandler is not registered, so ZooKeeper server won't take any action on ERROR or SHUTDOWN server state changes
    [junit] 2016-11-17 08:52:56,853 [myid:] - INFO  [main:SessionTrackerImpl@232] - Shutting down
    [junit] 2016-11-17 08:52:56,853 [myid:] - INFO  [main:PrepRequestProcessor@974] - Shutting down
    [junit] 2016-11-17 08:52:56,853 [myid:] - INFO  [main:SyncRequestProcessor@191] - Shutting down
    [junit] 2016-11-17 08:52:56,857 [myid:] - INFO  [SyncThread:0:SyncRequestProcessor@169] - SyncRequestProcessor exited!
    [junit] 2016-11-17 08:52:56,861 [myid:] - INFO  [ProcessThread(sid:0 cport:19304)::PrepRequestProcessor@154] - PrepRequestProcessor exited loop!
    [junit] 2016-11-17 08:52:56,865 [myid:] - INFO  [main:FinalRequestProcessor@479] - shutdown of request processor complete
    [junit] 2016-11-17 08:52:56,866 [myid:] - INFO  [main:MBeanRegistry@128] - Unregister MBean [org.apache.ZooKeeperService:name0=StandaloneServer_port19304,name1=InMemoryDataTree]
    [junit] 2016-11-17 08:52:56,866 [myid:] - INFO  [main:MBeanRegistry@128] - Unregister MBean [org.apache.ZooKeeperService:name0=StandaloneServer_port19304]
    [junit] 2016-11-17 08:52:56,867 [myid:] - INFO  [main:FourLetterWordMain@85] - connecting to 127.0.0.1 19304
    [junit] 2016-11-17 08:52:56,868 [myid:] - INFO  [main:JMXEnv@146] - ensureOnly:[]
    [junit] 2016-11-17 08:52:56,882 [myid:] - INFO  [main:ClientBase@568] - fdcount after test is: 54 at start it was 50
    [junit] 2016-11-17 08:52:56,882 [myid:] - INFO  [main:ClientBase@570] - sleeping for 20 secs
    [junit] 2016-11-17 08:52:56,882 [myid:] - INFO  [main:ZKTestCase$1@65] - SUCCEEDED testManyChildWatchersAutoReset
    [junit] 2016-11-17 08:52:56,882 [myid:] - INFO  [main:ZKTestCase$1@60] - FINISHED testManyChildWatchersAutoReset
    [junit] Tests run: 4, Failures: 0, Errors: 0, Skipped: 0, Time elapsed: 747.014 sec, Thread: 4, Class: org.apache.zookeeper.test.DisconnectedWatcherTest

BUILD FAILED
/home/jenkins/jenkins-slave/workspace/ZooKeeper_branch35_jdk7/build.xml:1208: Tests failed!

Total time: 16 minutes 38 seconds
Build step 'Invoke Ant' marked build as failure
Recording test results
Email was triggered for: Failure - Any
Sending email for trigger: Failure - Any



###################################################################################
############################## FAILED TESTS (if any) ##############################
3 tests failed.
FAILED:  org.apache.zookeeper.server.ZxidRolloverTest.testRolloverThenLeaderRestart

Error Message:
Timeout occurred. Please note the time in the report does not reflect the time until the timeout.

Stack Trace:
junit.framework.AssertionFailedError: Timeout occurred. Please note the time in the report does not reflect the time until the timeout.
	at java.lang.Thread.run(Thread.java:745)


FAILED:  org.apache.zookeeper.server.quorum.ReconfigRecoveryTest.testCurrentServersAreObserversInNextConfig

Error Message:
waiting for server 3 being up

Stack Trace:
junit.framework.AssertionFailedError: waiting for server 3 being up
	at org.apache.zookeeper.server.quorum.ReconfigRecoveryTest.testCurrentServersAreObserversInNextConfig(ReconfigRecoveryTest.java:217)
	at org.apache.zookeeper.JUnit4ZKTestRunner$LoggedInvokeMethod.evaluate(JUnit4ZKTestRunner.java:79)


FAILED:  org.apache.zookeeper.test.SSLTest.testSecureQuorumServer

Error Message:
waiting for server 0 being up

Stack Trace:
junit.framework.AssertionFailedError: waiting for server 0 being up
	at org.apache.zookeeper.test.SSLTest.testSecureQuorumServer(SSLTest.java:96)
	at org.apache.zookeeper.JUnit4ZKTestRunner$LoggedInvokeMethod.evaluate(JUnit4ZKTestRunner.java:79)