You are viewing a plain text version of this content. The canonical link for it is here.
Posted to dev@pdfbox.apache.org by Apache Jenkins Server <je...@builds.apache.org> on 2026/04/10 07:12:38 UTC
Build failed in Jenkins: PDFBox » PDFBox-trunk #3167
See <https://ci-builds.apache.org/job/PDFBox/job/PDFBox-trunk/3167/display/redirect?page=changes>
Changes:
[Maruan Sahyoun] PDFBOX-5660: improve createOutputStream further; add Sonar exception after review
------------------------------------------
[...truncated 259.55 KiB...]
[INFO] Downloading from central: https://repo.maven.apache.org/maven2/com/vaadin/external/google/android-json/0.0.20131108.vaadin1/android-json-0.0.20131108.vaadin1.jar
[INFO] Downloaded from central: https://repo.maven.apache.org/maven2/javax/ws/rs/javax.ws.rs-api/2.0.1/javax.ws.rs-api-2.0.1.jar (116 kB at 201 kB/s)
[INFO] Downloading from central: https://repo.maven.apache.org/maven2/org/apache/maven/shared/maven-dependency-tree/3.3.0/maven-dependency-tree-3.3.0.jar
[INFO] Downloaded from central: https://repo.maven.apache.org/maven2/com/esotericsoftware/minlog/1.3.1/minlog-1.3.1.jar (5.9 kB at 10 kB/s)
[INFO] Downloading from central: https://repo.maven.apache.org/maven2/org/apache/maven/shared/maven-artifact-transfer/0.13.1/maven-artifact-transfer-0.13.1.jar
[INFO] Downloaded from central: https://repo.maven.apache.org/maven2/org/owasp/dependency-check-utils/12.2.0/dependency-check-utils-12.2.0.jar (61 kB at 105 kB/s)
[INFO] Downloading from central: https://repo.maven.apache.org/maven2/org/apache/maven/maven-core/3.6.3/maven-core-3.6.3.jar
[INFO] Downloaded from central: https://repo.maven.apache.org/maven2/com/vaadin/external/google/android-json/0.0.20131108.vaadin1/android-json-0.0.20131108.vaadin1.jar (18 kB at 31 kB/s)
[INFO] Downloading from central: https://repo.maven.apache.org/maven2/org/apache/maven/maven-settings/3.6.3/maven-settings-3.6.3.jar
[INFO] Downloaded from central: https://repo.maven.apache.org/maven2/org/apache/maven/shared/maven-artifact-transfer/0.13.1/maven-artifact-transfer-0.13.1.jar (159 kB at 257 kB/s)
[INFO] Downloading from central: https://repo.maven.apache.org/maven2/org/codehaus/plexus/plexus-interpolation/1.25/plexus-interpolation-1.25.jar
[INFO] Downloaded from central: https://repo.maven.apache.org/maven2/org/apache/maven/shared/maven-dependency-tree/3.3.0/maven-dependency-tree-3.3.0.jar (43 kB at 69 kB/s)
[INFO] Downloading from central: https://repo.maven.apache.org/maven2/org/apache/maven/maven-builder-support/3.6.3/maven-builder-support-3.6.3.jar
[INFO] Downloaded from central: https://repo.maven.apache.org/maven2/org/apache/maven/maven-settings/3.6.3/maven-settings-3.6.3.jar (44 kB at 71 kB/s)
[INFO] Downloading from central: https://repo.maven.apache.org/maven2/org/apache/maven/maven-repository-metadata/3.6.3/maven-repository-metadata-3.6.3.jar
[INFO] Downloaded from central: https://repo.maven.apache.org/maven2/org/apache/maven/maven-core/3.6.3/maven-core-3.6.3.jar (633 kB at 1.0 MB/s)
[INFO] Downloading from central: https://repo.maven.apache.org/maven2/org/apache/maven/maven-plugin-api/3.6.3/maven-plugin-api-3.6.3.jar
[INFO] Downloaded from central: https://repo.maven.apache.org/maven2/org/apache/maven/maven-plugin-api/3.6.3/maven-plugin-api-3.6.3.jar (47 kB at 74 kB/s)
[INFO] Downloading from central: https://repo.maven.apache.org/maven2/org/apache/maven/maven-model-builder/3.6.3/maven-model-builder-3.6.3.jar
[INFO] Downloaded from central: https://repo.maven.apache.org/maven2/org/apache/maven/maven-repository-metadata/3.6.3/maven-repository-metadata-3.6.3.jar (27 kB at 42 kB/s)
[INFO] Downloading from central: https://repo.maven.apache.org/maven2/org/apache/maven/maven-resolver-provider/3.6.3/maven-resolver-provider-3.6.3.jar
[INFO] Downloaded from central: https://repo.maven.apache.org/maven2/org/apache/maven/maven-builder-support/3.6.3/maven-builder-support-3.6.3.jar (14 kB at 22 kB/s)
[INFO] Downloading from central: https://repo.maven.apache.org/maven2/org/apache/maven/resolver/maven-resolver-impl/1.4.1/maven-resolver-impl-1.4.1.jar
[INFO] Downloaded from central: https://repo.maven.apache.org/maven2/org/codehaus/plexus/plexus-interpolation/1.25/plexus-interpolation-1.25.jar (85 kB at 133 kB/s)
[INFO] Downloading from central: https://repo.maven.apache.org/maven2/org/apache/maven/resolver/maven-resolver-spi/1.4.1/maven-resolver-spi-1.4.1.jar
[INFO] Downloaded from central: https://repo.maven.apache.org/maven2/org/apache/maven/maven-model-builder/3.6.3/maven-model-builder-3.6.3.jar (192 kB at 294 kB/s)
[INFO] Downloading from central: https://repo.maven.apache.org/maven2/org/eclipse/sisu/org.eclipse.sisu.plexus/0.3.4/org.eclipse.sisu.plexus-0.3.4.jar
[INFO] Downloaded from central: https://repo.maven.apache.org/maven2/org/apache/maven/resolver/maven-resolver-spi/1.4.1/maven-resolver-spi-1.4.1.jar (37 kB at 54 kB/s)
[INFO] Downloading from central: https://repo.maven.apache.org/maven2/org/eclipse/sisu/org.eclipse.sisu.inject/0.3.4/org.eclipse.sisu.inject-0.3.4.jar
[INFO] Downloaded from central: https://repo.maven.apache.org/maven2/org/apache/maven/maven-resolver-provider/3.6.3/maven-resolver-provider-3.6.3.jar (66 kB at 98 kB/s)
[INFO] Downloading from central: https://repo.maven.apache.org/maven2/com/google/inject/guice/4.2.1/guice-4.2.1-no_aop.jar
[INFO] Downloaded from central: https://repo.maven.apache.org/maven2/org/eclipse/sisu/org.eclipse.sisu.plexus/0.3.4/org.eclipse.sisu.plexus-0.3.4.jar (205 kB at 301 kB/s)
[INFO] Downloading from central: https://repo.maven.apache.org/maven2/io/github/jeremylong/open-vulnerability-clients/9.0.2/open-vulnerability-clients-9.0.2.jar
[INFO] Downloaded from central: https://repo.maven.apache.org/maven2/org/apache/maven/resolver/maven-resolver-impl/1.4.1/maven-resolver-impl-1.4.1.jar (181 kB at 259 kB/s)
[INFO] Downloading from central: https://repo.maven.apache.org/maven2/org/jspecify/jspecify/1.0.0/jspecify-1.0.0.jar
[INFO] Downloaded from central: https://repo.maven.apache.org/maven2/org/eclipse/sisu/org.eclipse.sisu.inject/0.3.4/org.eclipse.sisu.inject-0.3.4.jar (379 kB at 542 kB/s)
[INFO] Downloading from central: https://repo.maven.apache.org/maven2/org/apache/httpcomponents/client5/httpclient5-cache/5.5.1/httpclient5-cache-5.5.1.jar
[INFO] Downloaded from central: https://repo.maven.apache.org/maven2/io/github/jeremylong/open-vulnerability-clients/9.0.2/open-vulnerability-clients-9.0.2.jar (261 kB at 369 kB/s)
[INFO] Downloading from central: https://repo.maven.apache.org/maven2/com/samskivert/jmustache/1.16/jmustache-1.16.jar
[INFO] Downloaded from central: https://repo.maven.apache.org/maven2/org/jspecify/jspecify/1.0.0/jspecify-1.0.0.jar (3.8 kB at 5.3 kB/s)
[INFO] Downloading from central: https://repo.maven.apache.org/maven2/com/github/package-url/packageurl-java/1.5.0/packageurl-java-1.5.0.jar
[INFO] Downloaded from central: https://repo.maven.apache.org/maven2/com/google/inject/guice/4.2.1/guice-4.2.1-no_aop.jar (521 kB at 726 kB/s)
[INFO] Downloading from central: https://repo.maven.apache.org/maven2/org/jetbrains/annotations/26.0.2-1/annotations-26.0.2-1.jar
[INFO] Downloaded from central: https://repo.maven.apache.org/maven2/org/bouncycastle/bcprov-jdk18on/1.78/bcprov-jdk18on-1.78.jar (8.3 MB at 12 MB/s)
[INFO] Downloading from central: https://repo.maven.apache.org/maven2/com/github/spotbugs/spotbugs-annotations/4.9.8/spotbugs-annotations-4.9.8.jar
[INFO] Downloaded from central: https://repo.maven.apache.org/maven2/com/samskivert/jmustache/1.16/jmustache-1.16.jar (81 kB at 111 kB/s)
[INFO] Downloaded from central: https://repo.maven.apache.org/maven2/com/github/package-url/packageurl-java/1.5.0/packageurl-java-1.5.0.jar (17 kB at 23 kB/s)
[INFO] Downloaded from central: https://repo.maven.apache.org/maven2/org/apache/httpcomponents/client5/httpclient5-cache/5.5.1/httpclient5-cache-5.5.1.jar (253 kB at 345 kB/s)
[INFO] Downloaded from central: https://repo.maven.apache.org/maven2/org/jetbrains/annotations/26.0.2-1/annotations-26.0.2-1.jar (31 kB at 42 kB/s)
[INFO] Downloaded from central: https://repo.maven.apache.org/maven2/com/github/spotbugs/spotbugs-annotations/4.9.8/spotbugs-annotations-4.9.8.jar (16 kB at 22 kB/s)
[INFO] Checking for updates
[WARNING] An NVD API Key was not provided - it is highly recommended to use an NVD API key as the update can take a VERY long time without an API Key
[INFO] NVD API has 343,774 records in this update
[INFO] Downloaded 10,000/343,774 (3%)
[INFO] Downloaded 20,000/343,774 (6%)
[INFO] Downloaded 30,000/343,774 (9%)
[INFO] Downloaded 40,000/343,774 (12%)
[INFO] Downloaded 50,000/343,774 (15%)
[INFO] Downloaded 60,000/343,774 (17%)
[INFO] Downloaded 70,000/343,774 (20%)
[INFO] Downloaded 80,000/343,774 (23%)
[INFO] Downloaded 90,000/343,774 (26%)
[INFO] Downloaded 100,000/343,774 (29%)
[INFO] Downloaded 110,000/343,774 (32%)
[INFO] Downloaded 120,000/343,774 (35%)
[INFO] Downloaded 130,000/343,774 (38%)
[INFO] Downloaded 140,000/343,774 (41%)
[INFO] Downloaded 150,000/343,774 (44%)
[INFO] Downloaded 160,000/343,774 (47%)
[WARNING] NVD API request failures are occurring; retrying request for the 15th time
[WARNING] NVD API request failures are occurring; retrying request for the 16th time
[WARNING] NVD API request failures are occurring; retrying request for the 17th time
[WARNING] NVD API request failures are occurring; retrying request for the 18th time
[WARNING] NVD API request failures are occurring; retrying request for the 19th time
[WARNING] NVD API request failures are occurring; retrying request for the 20th time
[WARNING] NVD API request failures are occurring; retrying request for the 15th time
[WARNING] NVD API request failures are occurring; retrying request for the 16th time
[WARNING] NVD API request failures are occurring; retrying request for the 17th time
[WARNING] NVD API request failures are occurring; retrying request for the 18th time
[WARNING] NVD API request failures are occurring; retrying request for the 19th time
[WARNING] NVD API request failures are occurring; retrying request for the 20th time
[WARNING] NVD API request failures are occurring; retrying request for the 21st time
[WARNING] NVD API request failures are occurring; retrying request for the 22nd time
[WARNING] NVD API request failures are occurring; retrying request for the 23rd time
[WARNING] NVD API request failures are occurring; retrying request for the 24th time
[WARNING] NVD API request failures are occurring; retrying request for the 25th time
[WARNING] NVD API request failures are occurring; retrying request for the 26th time
[WARNING] NVD API request failures are occurring; retrying request for the 27th time
[WARNING] NVD API request failures are occurring; retrying request for the 28th time
[WARNING] NVD API request failures are occurring; retrying request for the 29th time
[WARNING] NVD API request failures are occurring; retrying request for the 30th time
[WARNING] NVD API request failures are occurring; retrying request for the 31st time
[ERROR] Error updating the NVD Data
org.owasp.dependencycheck.data.update.exception.UpdateException: Error updating the NVD Data
at org.owasp.dependencycheck.data.update.NvdApiDataSource.processApi (NvdApiDataSource.java:387)
at org.owasp.dependencycheck.data.update.NvdApiDataSource.update (NvdApiDataSource.java:128)
at org.owasp.dependencycheck.Engine.doUpdates (Engine.java:902)
at org.owasp.dependencycheck.Engine.initializeAndUpdateDatabase (Engine.java:707)
at org.owasp.dependencycheck.Engine.analyzeDependencies (Engine.java:634)
at org.owasp.dependencycheck.maven.BaseDependencyCheckMojo.runCheck (BaseDependencyCheckMojo.java:2069)
at org.owasp.dependencycheck.maven.BaseDependencyCheckMojo.execute (BaseDependencyCheckMojo.java:1267)
at org.apache.maven.plugin.DefaultBuildPluginManager.executeMojo (DefaultBuildPluginManager.java:126)
at org.apache.maven.lifecycle.internal.MojoExecutor.doExecute2 (MojoExecutor.java:328)
at org.apache.maven.lifecycle.internal.MojoExecutor.doExecute (MojoExecutor.java:316)
at org.apache.maven.lifecycle.internal.MojoExecutor.execute (MojoExecutor.java:212)
at org.apache.maven.lifecycle.internal.MojoExecutor.execute (MojoExecutor.java:174)
at org.apache.maven.lifecycle.internal.MojoExecutor.access$000 (MojoExecutor.java:75)
at org.apache.maven.lifecycle.internal.MojoExecutor$1.run (MojoExecutor.java:162)
at org.apache.maven.plugin.DefaultMojosExecutionStrategy.execute (DefaultMojosExecutionStrategy.java:39)
at org.apache.maven.lifecycle.internal.MojoExecutor.execute (MojoExecutor.java:159)
at org.apache.maven.lifecycle.internal.LifecycleModuleBuilder.buildProject (LifecycleModuleBuilder.java:105)
at org.apache.maven.lifecycle.internal.LifecycleModuleBuilder.buildProject (LifecycleModuleBuilder.java:73)
at org.apache.maven.lifecycle.internal.builder.singlethreaded.SingleThreadedBuilder.build (SingleThreadedBuilder.java:53)
at org.apache.maven.lifecycle.internal.LifecycleStarter.execute (LifecycleStarter.java:118)
at org.apache.maven.DefaultMaven.doExecute (DefaultMaven.java:261)
at org.apache.maven.DefaultMaven.doExecute (DefaultMaven.java:173)
at org.apache.maven.DefaultMaven.execute (DefaultMaven.java:101)
at org.jvnet.hudson.maven3.launcher.Maven35Launcher.main (Maven35Launcher.java:138)
at jdk.internal.reflect.NativeMethodAccessorImpl.invoke0 (Native Method)
at jdk.internal.reflect.NativeMethodAccessorImpl.invoke (NativeMethodAccessorImpl.java:77)
at jdk.internal.reflect.DelegatingMethodAccessorImpl.invoke (DelegatingMethodAccessorImpl.java:43)
at java.lang.reflect.Method.invoke (Method.java:569)
at org.codehaus.plexus.classworlds.launcher.Launcher.launchEnhanced (Launcher.java:255)
at org.codehaus.plexus.classworlds.launcher.Launcher.launch (Launcher.java:201)
at jenkins.maven3.agent.Maven35Main.launch (Maven35Main.java:179)
at jdk.internal.reflect.NativeMethodAccessorImpl.invoke0 (Native Method)
at jdk.internal.reflect.NativeMethodAccessorImpl.invoke (NativeMethodAccessorImpl.java:77)
at jdk.internal.reflect.DelegatingMethodAccessorImpl.invoke (DelegatingMethodAccessorImpl.java:43)
at java.lang.reflect.Method.invoke (Method.java:569)
at hudson.maven.Maven3Builder.call (Maven3Builder.java:140)
at hudson.maven.Maven3Builder.call (Maven3Builder.java:71)
at hudson.remoting.UserRequest.perform (UserRequest.java:225)
at hudson.remoting.UserRequest.perform (UserRequest.java:50)
at hudson.remoting.Request$2.run (Request.java:391)
at hudson.remoting.InterceptingExecutorService.lambda$wrap$0 (InterceptingExecutorService.java:81)
at java.util.concurrent.FutureTask.run (FutureTask.java:264)
at java.util.concurrent.ThreadPoolExecutor.runWorker (ThreadPoolExecutor.java:1136)
at java.util.concurrent.ThreadPoolExecutor$Worker.run (ThreadPoolExecutor.java:635)
at java.lang.Thread.run (Thread.java:840)
Caused by: io.github.jeremylong.openvulnerability.client.nvd.NvdApiException: NVD Returned Status Code: 429
at io.github.jeremylong.openvulnerability.client.nvd.NvdCveClient._next (NvdCveClient.java:445)
at io.github.jeremylong.openvulnerability.client.nvd.NvdCveClient.next (NvdCveClient.java:356)
at org.owasp.dependencycheck.data.update.NvdApiDataSource.processApi (NvdApiDataSource.java:343)
at org.owasp.dependencycheck.data.update.NvdApiDataSource.update (NvdApiDataSource.java:128)
at org.owasp.dependencycheck.Engine.doUpdates (Engine.java:902)
at org.owasp.dependencycheck.Engine.initializeAndUpdateDatabase (Engine.java:707)
at org.owasp.dependencycheck.Engine.analyzeDependencies (Engine.java:634)
at org.owasp.dependencycheck.maven.BaseDependencyCheckMojo.runCheck (BaseDependencyCheckMojo.java:2069)
at org.owasp.dependencycheck.maven.BaseDependencyCheckMojo.execute (BaseDependencyCheckMojo.java:1267)
at org.apache.maven.plugin.DefaultBuildPluginManager.executeMojo (DefaultBuildPluginManager.java:126)
at org.apache.maven.lifecycle.internal.MojoExecutor.doExecute2 (MojoExecutor.java:328)
at org.apache.maven.lifecycle.internal.MojoExecutor.doExecute (MojoExecutor.java:316)
at org.apache.maven.lifecycle.internal.MojoExecutor.execute (MojoExecutor.java:212)
at org.apache.maven.lifecycle.internal.MojoExecutor.execute (MojoExecutor.java:174)
at org.apache.maven.lifecycle.internal.MojoExecutor.access$000 (MojoExecutor.java:75)
at org.apache.maven.lifecycle.internal.MojoExecutor$1.run (MojoExecutor.java:162)
at org.apache.maven.plugin.DefaultMojosExecutionStrategy.execute (DefaultMojosExecutionStrategy.java:39)
at org.apache.maven.lifecycle.internal.MojoExecutor.execute (MojoExecutor.java:159)
at org.apache.maven.lifecycle.internal.LifecycleModuleBuilder.buildProject (LifecycleModuleBuilder.java:105)
at org.apache.maven.lifecycle.internal.LifecycleModuleBuilder.buildProject (LifecycleModuleBuilder.java:73)
at org.apache.maven.lifecycle.internal.builder.singlethreaded.SingleThreadedBuilder.build (SingleThreadedBuilder.java:53)
at org.apache.maven.lifecycle.internal.LifecycleStarter.execute (LifecycleStarter.java:118)
at org.apache.maven.DefaultMaven.doExecute (DefaultMaven.java:261)
at org.apache.maven.DefaultMaven.doExecute (DefaultMaven.java:173)
at org.apache.maven.DefaultMaven.execute (DefaultMaven.java:101)
at org.jvnet.hudson.maven3.launcher.Maven35Launcher.main (Maven35Launcher.java:138)
at jdk.internal.reflect.NativeMethodAccessorImpl.invoke0 (Native Method)
at jdk.internal.reflect.NativeMethodAccessorImpl.invoke (NativeMethodAccessorImpl.java:77)
at jdk.internal.reflect.DelegatingMethodAccessorImpl.invoke (DelegatingMethodAccessorImpl.java:43)
at java.lang.reflect.Method.invoke (Method.java:569)
at org.codehaus.plexus.classworlds.launcher.Launcher.launchEnhanced (Launcher.java:255)
at org.codehaus.plexus.classworlds.launcher.Launcher.launch (Launcher.java:201)
at jenkins.maven3.agent.Maven35Main.launch (Maven35Main.java:179)
at jdk.internal.reflect.NativeMethodAccessorImpl.invoke0 (Native Method)
at jdk.internal.reflect.NativeMethodAccessorImpl.invoke (NativeMethodAccessorImpl.java:77)
at jdk.internal.reflect.DelegatingMethodAccessorImpl.invoke (DelegatingMethodAccessorImpl.java:43)
at java.lang.reflect.Method.invoke (Method.java:569)
at hudson.maven.Maven3Builder.call (Maven3Builder.java:140)
at hudson.maven.Maven3Builder.call (Maven3Builder.java:71)
at hudson.remoting.UserRequest.perform (UserRequest.java:225)
at hudson.remoting.UserRequest.perform (UserRequest.java:50)
at hudson.remoting.Request$2.run (Request.java:391)
at hudson.remoting.InterceptingExecutorService.lambda$wrap$0 (InterceptingExecutorService.java:81)
at java.util.concurrent.FutureTask.run (FutureTask.java:264)
at java.util.concurrent.ThreadPoolExecutor.runWorker (ThreadPoolExecutor.java:1136)
at java.util.concurrent.ThreadPoolExecutor$Worker.run (ThreadPoolExecutor.java:635)
at java.lang.Thread.run (Thread.java:840)
[INFO] Updating CISA Known Exploited Vulnerability list: https://www.cisa.gov/sites/default/files/feeds/known_exploited_vulnerabilities.json
[INFO] Begin database defrag
[INFO] End database defrag (5815 ms)
[WARNING] Unable to update 1 or more Cached Web DataSource, using local data instead. Results may not include recent vulnerabilities.
[ERROR] Unable to continue dependency-check analysis.
[WARNING] Attempt to (de-)serialize anonymous class org.jfrog.hudson.maven2.MavenDependenciesRecorder$1; see: https://jenkins.io/redirect/serialization-of-anonymous-classes/
[INFO] ------------------------------------------------------------------------
[INFO] Reactor Summary for pdfbox-reactor 4.0.0-SNAPSHOT:
[INFO]
[INFO] Apache PDFBox parent ............................... FAILURE [11:45 min]
[INFO] Apache PDFBox io ................................... SKIPPED
[INFO] Apache FontBox ..................................... SKIPPED
[INFO] Apache XmpBox ...................................... SKIPPED
[INFO] Apache PDFBox ...................................... SKIPPED
[INFO] Apache PDFBox Debugger ............................. SKIPPED
[INFO] Apache PDFBox tools ................................ SKIPPED
[INFO] Apache PDFBox application .......................... SKIPPED
[INFO] Apache PDFBox Debugger application ................. SKIPPED
[INFO] Apache PDFBox examples ............................. SKIPPED
[INFO] pdfbox-reactor ..................................... SKIPPED
[INFO] ------------------------------------------------------------------------
[INFO] BUILD FAILURE
[INFO] ------------------------------------------------------------------------
[INFO] Total time: 11:58 min
[INFO] Finished at: 2026-04-10T07:12:23Z
[INFO] ------------------------------------------------------------------------
Waiting for Jenkins to finish collecting data
[ERROR] Failed to execute goal org.owasp:dependency-check-maven:12.2.0:check (default) on project pdfbox-parent: Fatal exception(s) analyzing Apache PDFBox parent: One or more exceptions occurred during analysis:
[ERROR] UpdateException: Error updating the NVD Data
[ERROR] caused by NvdApiException: NVD Returned Status Code: 429
[ERROR] NoDataException: No documents exist
[ERROR] -> [Help 1]
[ERROR]
[ERROR] To see the full stack trace of the errors, re-run Maven with the -e switch.
[ERROR] Re-run Maven using the -X switch to enable full debug logging.
[ERROR]
[ERROR] For more information about the errors and possible solutions, please read the following articles:
[ERROR] [Help 1] http://cwiki.apache.org/confluence/display/MAVEN/MojoExecutionException
[JENKINS] Archiving <https://ci-builds.apache.org/job/PDFBox/job/PDFBox-trunk/ws/xmpbox/pom.xml> to org.apache.pdfbox/xmpbox/4.0.0-SNAPSHOT/xmpbox-4.0.0-SNAPSHOT.pom
[JENKINS] Archiving <https://ci-builds.apache.org/job/PDFBox/job/PDFBox-trunk/ws/tools/pom.xml> to org.apache.pdfbox/pdfbox-tools/4.0.0-SNAPSHOT/pdfbox-tools-4.0.0-SNAPSHOT.pom
[JENKINS] Archiving <https://ci-builds.apache.org/job/PDFBox/job/PDFBox-trunk/ws/debugger/pom.xml> to org.apache.pdfbox/pdfbox-debugger/4.0.0-SNAPSHOT/pdfbox-debugger-4.0.0-SNAPSHOT.pom
[JENKINS] Archiving <https://ci-builds.apache.org/job/PDFBox/job/PDFBox-trunk/ws/app/pom.xml> to org.apache.pdfbox/pdfbox-app/4.0.0-SNAPSHOT/pdfbox-app-4.0.0-SNAPSHOT.pom
[JENKINS] Archiving <https://ci-builds.apache.org/job/PDFBox/job/PDFBox-trunk/ws/examples/pom.xml> to org.apache.pdfbox/pdfbox-examples/4.0.0-SNAPSHOT/pdfbox-examples-4.0.0-SNAPSHOT.pom
[JENKINS] Archiving <https://ci-builds.apache.org/job/PDFBox/job/PDFBox-trunk/ws/pom.xml> to org.apache.pdfbox/pdfbox-reactor/4.0.0-SNAPSHOT/pdfbox-reactor-4.0.0-SNAPSHOT.pom
[JENKINS] Archiving <https://ci-builds.apache.org/job/PDFBox/job/PDFBox-trunk/ws/parent/pom.xml> to org.apache.pdfbox/pdfbox-parent/4.0.0-SNAPSHOT/pdfbox-parent-4.0.0-SNAPSHOT.pom
[JENKINS] Archiving <https://ci-builds.apache.org/job/PDFBox/job/PDFBox-trunk/ws/pdfbox/pom.xml> to org.apache.pdfbox/pdfbox/4.0.0-SNAPSHOT/pdfbox-4.0.0-SNAPSHOT.pom
[JENKINS] Archiving <https://ci-builds.apache.org/job/PDFBox/job/PDFBox-trunk/ws/debugger-app/pom.xml> to org.apache.pdfbox/debugger-app/4.0.0-SNAPSHOT/debugger-app-4.0.0-SNAPSHOT.pom
[JENKINS] Archiving <https://ci-builds.apache.org/job/PDFBox/job/PDFBox-trunk/ws/io/pom.xml> to org.apache.pdfbox/pdfbox-io/4.0.0-SNAPSHOT/pdfbox-io-4.0.0-SNAPSHOT.pom
[JENKINS] Archiving <https://ci-builds.apache.org/job/PDFBox/job/PDFBox-trunk/ws/fontbox/pom.xml> to org.apache.pdfbox/fontbox/4.0.0-SNAPSHOT/fontbox-4.0.0-SNAPSHOT.pom
No mail will be sent out, as 'PDFBox » PDFBox-trunk » Apache XmpBox #3167' does not have a result yet. Please make sure you set a proper result in case of pipeline/build scripts.
No mail will be sent out, as 'PDFBox » PDFBox-trunk » Apache PDFBox tools #3167' does not have a result yet. Please make sure you set a proper result in case of pipeline/build scripts.
No mail will be sent out, as 'PDFBox » PDFBox-trunk » Apache PDFBox Debugger #3167' does not have a result yet. Please make sure you set a proper result in case of pipeline/build scripts.
No mail will be sent out, as 'PDFBox » PDFBox-trunk » Apache PDFBox application #3167' does not have a result yet. Please make sure you set a proper result in case of pipeline/build scripts.
No mail will be sent out, as 'PDFBox » PDFBox-trunk » Apache PDFBox examples #3167' does not have a result yet. Please make sure you set a proper result in case of pipeline/build scripts.
No mail will be sent out, as 'PDFBox » PDFBox-trunk » pdfbox-reactor #3167' does not have a result yet. Please make sure you set a proper result in case of pipeline/build scripts.
Sending e-mails to: dev@pdfbox.apache.org
No mail will be sent out, as 'PDFBox » PDFBox-trunk » Apache PDFBox #3167' does not have a result yet. Please make sure you set a proper result in case of pipeline/build scripts.
No mail will be sent out, as 'PDFBox » PDFBox-trunk » Apache PDFBox Debugger application #3167' does not have a result yet. Please make sure you set a proper result in case of pipeline/build scripts.
No mail will be sent out, as 'PDFBox » PDFBox-trunk » Apache PDFBox io #3167' does not have a result yet. Please make sure you set a proper result in case of pipeline/build scripts.
No mail will be sent out, as 'PDFBox » PDFBox-trunk » Apache FontBox #3167' does not have a result yet. Please make sure you set a proper result in case of pipeline/build scripts.
channel stopped
Archiving artifacts
---------------------------------------------------------------------
To unsubscribe, e-mail: dev-unsubscribe@pdfbox.apache.org
For additional commands, e-mail: dev-help@pdfbox.apache.org
Jenkins build is back to normal : PDFBox » PDFBox-trunk #3168
Posted by Apache Jenkins Server <je...@builds.apache.org>.
See <https://ci-builds.apache.org/job/PDFBox/job/PDFBox-trunk/3168/display/redirect?page=changes>
---------------------------------------------------------------------
To unsubscribe, e-mail: dev-unsubscribe@pdfbox.apache.org
For additional commands, e-mail: dev-help@pdfbox.apache.org