You are viewing a plain text version of this content. The canonical link for it is here.
Posted to dev@beam.apache.org by Apache Jenkins Server <je...@builds.apache.org> on 2018/03/02 11:06:59 UTC
Build failed in Jenkins: beam_Release_NightlySnapshot #702
See <https://builds.apache.org/job/beam_Release_NightlySnapshot/702/display/redirect?page=changes>
Changes:
[robertwb] [maven-release-plugin] prepare branch release-2.4.0
[robertwb] [maven-release-plugin] prepare for next development iteration
[robertwb] Bump Python dev version.
------------------------------------------
[...truncated 3.91 MB...]
2018-03-02T11:05:08.060 [INFO]
2018-03-02T11:05:08.060 [INFO] --- mvn-golang-wrapper:2.1.6:build (go-build) @ beam-runners-gcp-gcsproxy ---
2018-03-02T11:05:08.061 [INFO] Prepared command line : bin/go build -buildmode=default -o <https://builds.apache.org/job/beam_Release_NightlySnapshot/ws/src/runners/gcp/gcsproxy/target/gcsproxy> github.com/apache/beam/cmd/gcsproxy
2018-03-02T11:05:09.793 [INFO] The Result file has been successfuly created : <https://builds.apache.org/job/beam_Release_NightlySnapshot/ws/src/runners/gcp/gcsproxy/target/gcsproxy>
2018-03-02T11:05:09.899 [INFO]
2018-03-02T11:05:09.899 [INFO] --- mvn-golang-wrapper:2.1.6:build (go-build-linux-amd64) @ beam-runners-gcp-gcsproxy ---
2018-03-02T11:05:09.901 [INFO] Prepared command line : bin/go build -buildmode=default -o <https://builds.apache.org/job/beam_Release_NightlySnapshot/ws/src/runners/gcp/gcsproxy/target/linux_amd64/gcsproxy> github.com/apache/beam/cmd/gcsproxy
2018-03-02T11:05:11.372 [INFO] The Result file has been successfuly created : <https://builds.apache.org/job/beam_Release_NightlySnapshot/ws/src/runners/gcp/gcsproxy/target/linux_amd64/gcsproxy>
2018-03-02T11:05:11.479 [INFO]
2018-03-02T11:05:11.479 [INFO] --- maven-checkstyle-plugin:3.0.0:check (default) @ beam-runners-gcp-gcsproxy ---
2018-03-02T11:05:11.573 [INFO] Starting audit...
Audit done.
2018-03-02T11:05:11.680 [INFO]
2018-03-02T11:05:11.680 [INFO] >>> findbugs-maven-plugin:3.0.5:check (default) > :findbugs @ beam-runners-gcp-gcsproxy >>>
2018-03-02T11:05:11.681 [INFO]
2018-03-02T11:05:11.681 [INFO] --- findbugs-maven-plugin:3.0.5:findbugs (findbugs) @ beam-runners-gcp-gcsproxy ---
2018-03-02T11:05:11.895 [INFO]
2018-03-02T11:05:11.896 [INFO] <<< findbugs-maven-plugin:3.0.5:check (default) < :findbugs @ beam-runners-gcp-gcsproxy <<<
2018-03-02T11:05:11.896 [INFO]
2018-03-02T11:05:11.896 [INFO]
2018-03-02T11:05:11.896 [INFO] --- findbugs-maven-plugin:3.0.5:check (default) @ beam-runners-gcp-gcsproxy ---
2018-03-02T11:05:12.003 [INFO]
2018-03-02T11:05:12.003 [INFO] --- build-helper-maven-plugin:3.0.0:regex-properties (render-artifact-id) @ beam-runners-gcp-gcsproxy ---
2018-03-02T11:05:12.110 [INFO]
2018-03-02T11:05:12.110 [INFO] --- maven-site-plugin:3.7:attach-descriptor (attach-descriptor) @ beam-runners-gcp-gcsproxy ---
2018-03-02T11:05:12.111 [INFO] No site descriptor found: nothing to attach.
2018-03-02T11:05:12.343 [INFO]
2018-03-02T11:05:12.343 [INFO] --- maven-jar-plugin:3.0.2:jar (default-jar) @ beam-runners-gcp-gcsproxy ---
2018-03-02T11:05:12.344 [INFO] Skipping packaging of the jar
2018-03-02T11:05:12.555 [INFO]
2018-03-02T11:05:12.555 [INFO] --- maven-jar-plugin:3.0.2:test-jar (default-test-jar) @ beam-runners-gcp-gcsproxy ---
2018-03-02T11:05:12.556 [INFO] Skipping packaging of the test-jar
2018-03-02T11:05:12.667 [INFO]
2018-03-02T11:05:12.667 [INFO] --- maven-shade-plugin:3.1.0:shade (bundle-and-repackage) @ beam-runners-gcp-gcsproxy ---
2018-03-02T11:05:12.670 [INFO] Replacing original artifact with shaded artifact.
2018-03-02T11:05:12.777 [INFO]
2018-03-02T11:05:12.777 [INFO] --- maven-assembly-plugin:3.1.0:single (source-release-assembly) @ beam-runners-gcp-gcsproxy ---
2018-03-02T11:05:12.778 [INFO] Skipping the assembly in this project because it's not the Execution Root
2018-03-02T11:05:12.885 [INFO]
2018-03-02T11:05:12.885 [INFO] --- maven-source-plugin:3.0.1:jar-no-fork (attach-sources) @ beam-runners-gcp-gcsproxy ---
2018-03-02T11:05:12.993 [INFO]
2018-03-02T11:05:12.993 [INFO] --- maven-source-plugin:3.0.1:test-jar-no-fork (attach-test-sources) @ beam-runners-gcp-gcsproxy ---
2018-03-02T11:05:13.264 [INFO]
2018-03-02T11:05:13.264 [INFO] --- maven-javadoc-plugin:3.0.0-M1:jar (attach-javadocs) @ beam-runners-gcp-gcsproxy ---
2018-03-02T11:05:13.267 [INFO] Not executing Javadoc as the project is not a Java classpath-capable package
2018-03-02T11:05:13.375 [INFO]
2018-03-02T11:05:13.375 [INFO] --- reproducible-build-maven-plugin:0.4:strip-jar (default) @ beam-runners-gcp-gcsproxy ---
2018-03-02T11:05:13.552 [INFO]
2018-03-02T11:05:13.552 [INFO] --- maven-dependency-plugin:3.0.2:analyze-only (default) @ beam-runners-gcp-gcsproxy ---
2018-03-02T11:05:13.553 [INFO] Skipping pom project
2018-03-02T11:05:13.660 [INFO]
2018-03-02T11:05:13.661 [INFO] --- maven-install-plugin:2.5.2:install (default-install) @ beam-runners-gcp-gcsproxy ---
2018-03-02T11:05:13.661 [INFO] Installing <https://builds.apache.org/job/beam_Release_NightlySnapshot/ws/src/runners/gcp/gcsproxy/pom.xml> to <https://builds.apache.org/job/beam_Release_NightlySnapshot/ws/.repository/org/apache/beam/beam-runners-gcp-gcsproxy/2.5.0-SNAPSHOT/beam-runners-gcp-gcsproxy-2.5.0-SNAPSHOT.pom>
2018-03-02T11:05:13.769 [INFO]
2018-03-02T11:05:13.769 [INFO] --- maven-deploy-plugin:2.8.2:deploy (default-deploy) @ beam-runners-gcp-gcsproxy ---
2018-03-02T11:05:13.771 [INFO] Downloading from apache.snapshots.https: https://repository.apache.org/content/repositories/snapshots/org/apache/beam/beam-runners-gcp-gcsproxy/2.5.0-SNAPSHOT/maven-metadata.xml
2018-03-02T11:05:13.878 [INFO] Uploading to apache.snapshots.https: https://repository.apache.org/content/repositories/snapshots/org/apache/beam/beam-runners-gcp-gcsproxy/2.5.0-SNAPSHOT/beam-runners-gcp-gcsproxy-2.5.0-20180302.110513-1.pom
2018-03-02T11:05:14.327 [INFO] Uploaded to apache.snapshots.https: https://repository.apache.org/content/repositories/snapshots/org/apache/beam/beam-runners-gcp-gcsproxy/2.5.0-SNAPSHOT/beam-runners-gcp-gcsproxy-2.5.0-20180302.110513-1.pom (5.5 kB at 12 kB/s)
2018-03-02T11:05:14.327 [INFO] Downloading from apache.snapshots.https: https://repository.apache.org/content/repositories/snapshots/org/apache/beam/beam-runners-gcp-gcsproxy/maven-metadata.xml
2018-03-02T11:05:14.554 [INFO] Downloaded from apache.snapshots.https: https://repository.apache.org/content/repositories/snapshots/org/apache/beam/beam-runners-gcp-gcsproxy/maven-metadata.xml (360 B at 1.6 kB/s)
2018-03-02T11:05:14.555 [INFO] Uploading to apache.snapshots.https: https://repository.apache.org/content/repositories/snapshots/org/apache/beam/beam-runners-gcp-gcsproxy/2.5.0-SNAPSHOT/maven-metadata.xml
2018-03-02T11:05:14.980 [INFO] Uploaded to apache.snapshots.https: https://repository.apache.org/content/repositories/snapshots/org/apache/beam/beam-runners-gcp-gcsproxy/2.5.0-SNAPSHOT/maven-metadata.xml (617 B at 1.5 kB/s)
2018-03-02T11:05:14.981 [INFO] Uploading to apache.snapshots.https: https://repository.apache.org/content/repositories/snapshots/org/apache/beam/beam-runners-gcp-gcsproxy/maven-metadata.xml
2018-03-02T11:05:15.411 [INFO] Uploaded to apache.snapshots.https: https://repository.apache.org/content/repositories/snapshots/org/apache/beam/beam-runners-gcp-gcsproxy/maven-metadata.xml (400 B at 928 B/s)
[JENKINS] Archiving disabled
2018-03-02T11:05:16.404 [INFO]
2018-03-02T11:05:16.404 [INFO] ------------------------------------------------------------------------
2018-03-02T11:05:16.404 [INFO] Skipping Apache Beam :: SDKs :: Java :: Aggregated Javadoc
2018-03-02T11:05:16.404 [INFO] This project has been banned from the build due to previous failures.
2018-03-02T11:05:16.404 [INFO] ------------------------------------------------------------------------
[JENKINS] Archiving disabled
[JENKINS] Archiving disabled
[JENKINS] Archiving disabled
[JENKINS] Archiving disabled
[JENKINS] Archiving disabled
[JENKINS] Archiving disabled
[JENKINS] Archiving disabled
[JENKINS] Archiving disabled
[JENKINS] Archiving disabled
[JENKINS] Archiving disabled
[JENKINS] Archiving disabled
[JENKINS] Archiving disabled
[JENKINS] Archiving disabled
[JENKINS] Archiving disabled
[JENKINS] Archiving disabled
[JENKINS] Archiving disabled
[JENKINS] Archiving disabled
[JENKINS] Archiving disabled
[JENKINS] Archiving disabled
[JENKINS] Archiving disabled
[JENKINS] Archiving disabled
[JENKINS] Archiving disabled
[JENKINS] Archiving disabled
[JENKINS] Archiving disabled
[JENKINS] Archiving disabled
[JENKINS] Archiving disabled
[JENKINS] Archiving disabled
[JENKINS] Archiving disabled
[JENKINS] Archiving disabled
[JENKINS] Archiving disabled
[JENKINS] Archiving disabled
[JENKINS] Archiving disabled
[JENKINS] Archiving disabled
[JENKINS] Archiving disabled
[JENKINS] Archiving disabled
[JENKINS] Archiving disabled
[JENKINS] Archiving disabled
[JENKINS] Archiving disabled
[JENKINS] Archiving disabled
[JENKINS] Archiving disabled
[JENKINS] Archiving disabled
[JENKINS] Archiving disabled
[JENKINS] Archiving disabled
[JENKINS] Archiving disabled
[JENKINS] Archiving disabled
[JENKINS] Archiving disabled
[JENKINS] Archiving disabled
[JENKINS] Archiving disabled
[JENKINS] Archiving disabled
[JENKINS] Archiving disabled
[JENKINS] Archiving disabled
[JENKINS] Archiving disabled
[JENKINS] Archiving disabled
[JENKINS] Archiving disabled
[JENKINS] Archiving disabled
[JENKINS] Archiving disabled
[JENKINS] Archiving disabled
[JENKINS] Archiving disabled
[JENKINS] Archiving disabled
[JENKINS] Archiving disabled
[JENKINS] Archiving disabled
[JENKINS] Archiving disabled
[JENKINS] Archiving disabled
[JENKINS] Archiving disabled
[JENKINS] Archiving disabled
[JENKINS] Archiving disabled
[JENKINS] Archiving disabled
[JENKINS] Archiving disabled
[JENKINS] Archiving disabled
[JENKINS] Archiving disabled
[JENKINS] Archiving disabled
[JENKINS] Archiving disabled
[JENKINS] Archiving disabled
[JENKINS] Archiving disabled
[JENKINS] Archiving disabled
2018-03-02T11:06:29.556 [INFO] ------------------------------------------------------------------------
2018-03-02T11:06:29.556 [INFO] Reactor Summary:
2018-03-02T11:06:29.556 [INFO]
2018-03-02T11:06:29.556 [INFO] Apache Beam :: Parent .............................. SUCCESS [ 57.671 s]
2018-03-02T11:06:29.556 [INFO] Apache Beam :: SDKs :: Java :: Build Tools ......... SUCCESS [ 27.969 s]
2018-03-02T11:06:29.556 [INFO] Apache Beam :: Model ............................... SUCCESS [ 4.228 s]
2018-03-02T11:06:29.556 [INFO] Apache Beam :: Model :: Pipeline ................... SUCCESS [01:08 min]
2018-03-02T11:06:29.556 [INFO] Apache Beam :: Model :: Job Management ............. SUCCESS [ 41.105 s]
2018-03-02T11:06:29.556 [INFO] Apache Beam :: Model :: Fn Execution ............... SUCCESS [ 53.278 s]
2018-03-02T11:06:29.556 [INFO] Apache Beam :: SDKs ................................ SUCCESS [ 5.343 s]
2018-03-02T11:06:29.556 [INFO] Apache Beam :: SDKs :: Go .......................... SUCCESS [ 31.581 s]
2018-03-02T11:06:29.556 [INFO] Apache Beam :: SDKs :: Java ........................ SUCCESS [ 5.400 s]
2018-03-02T11:06:29.556 [INFO] Apache Beam :: SDKs :: Java :: Core ................ SUCCESS [08:00 min]
2018-03-02T11:06:29.556 [INFO] Apache Beam :: SDKs :: Java :: Fn Execution ........ SUCCESS [01:07 min]
2018-03-02T11:06:29.556 [INFO] Apache Beam :: SDKs :: Java :: Extensions .......... SUCCESS [ 4.994 s]
2018-03-02T11:06:29.556 [INFO] Apache Beam :: SDKs :: Java :: Extensions :: Google Cloud Platform Core SUCCESS [01:18 min]
2018-03-02T11:06:29.556 [INFO] Apache Beam :: Runners ............................. SUCCESS [ 5.333 s]
2018-03-02T11:06:29.556 [INFO] Apache Beam :: Runners :: Core Construction Java ... SUCCESS [01:37 min]
2018-03-02T11:06:29.557 [INFO] Apache Beam :: Runners :: Core Java ................ SUCCESS [01:59 min]
2018-03-02T11:06:29.557 [INFO] Apache Beam :: SDKs :: Java :: Harness ............. SUCCESS [01:52 min]
2018-03-02T11:06:29.557 [INFO] Apache Beam :: SDKs :: Java :: Container ........... SUCCESS [ 20.835 s]
2018-03-02T11:06:29.557 [INFO] Apache Beam :: SDKs :: Java :: IO .................. SUCCESS [ 5.087 s]
2018-03-02T11:06:29.557 [INFO] Apache Beam :: SDKs :: Java :: IO :: Amazon Web Services SUCCESS [01:01 min]
2018-03-02T11:06:29.557 [INFO] Apache Beam :: Runners :: Local Java Core .......... SUCCESS [ 35.634 s]
2018-03-02T11:06:29.557 [INFO] Apache Beam :: Runners :: Direct Java .............. SUCCESS [10:30 min]
2018-03-02T11:06:29.557 [INFO] Apache Beam :: SDKs :: Java :: IO :: AMQP .......... SUCCESS [01:20 min]
2018-03-02T11:06:29.557 [INFO] Apache Beam :: SDKs :: Java :: IO :: Common ........ SUCCESS [ 25.323 s]
2018-03-02T11:06:29.557 [INFO] Apache Beam :: SDKs :: Java :: IO :: Cassandra ..... SUCCESS [01:17 min]
2018-03-02T11:06:29.557 [INFO] Apache Beam :: SDKs :: Java :: IO :: Elasticsearch . SUCCESS [ 45.818 s]
2018-03-02T11:06:29.557 [INFO] Apache Beam :: SDKs :: Java :: IO :: Elasticsearch-Tests SUCCESS [ 10.067 s]
2018-03-02T11:06:29.557 [INFO] Apache Beam :: SDKs :: Java :: IO :: Elasticsearch-Tests :: Common SUCCESS [ 13.073 s]
2018-03-02T11:06:29.557 [INFO] Apache Beam :: SDKs :: Java :: IO :: Elasticsearch-Tests :: 2.x SUCCESS [01:01 min]
2018-03-02T11:06:29.557 [INFO] Apache Beam :: SDKs :: Java :: IO :: Elasticsearch-Tests :: 5.x SUCCESS [01:17 min]
2018-03-02T11:06:29.557 [INFO] Apache Beam :: SDKs :: Java :: Extensions :: Protobuf SUCCESS [ 52.924 s]
2018-03-02T11:06:29.557 [INFO] Apache Beam :: SDKs :: Java :: IO :: Google Cloud Platform SUCCESS [04:44 min]
2018-03-02T11:06:29.557 [INFO] Apache Beam :: Runners :: Google Cloud Dataflow .... SUCCESS [12:06 min]
2018-03-02T11:06:29.557 [INFO] Apache Beam :: SDKs :: Java :: IO :: File-based-io-tests SUCCESS [ 22.172 s]
2018-03-02T11:06:29.557 [INFO] Apache Beam :: SDKs :: Java :: IO :: Hadoop Common . SUCCESS [ 58.175 s]
2018-03-02T11:06:29.557 [INFO] Apache Beam :: SDKs :: Java :: IO :: Hadoop File System SUCCESS [01:44 min]
2018-03-02T11:06:29.557 [INFO] Apache Beam :: SDKs :: Java :: IO :: JDBC .......... SUCCESS [02:43 min]
2018-03-02T11:06:29.557 [INFO] Apache Beam :: SDKs :: Java :: IO :: Hadoop Input Format SUCCESS [03:18 min]
2018-03-02T11:06:29.557 [INFO] Apache Beam :: SDKs :: Java :: IO :: HBase ......... SUCCESS [05:46 min]
2018-03-02T11:06:29.557 [INFO] Apache Beam :: SDKs :: Java :: IO :: HCatalog ...... SUCCESS [02:32 min]
2018-03-02T11:06:29.557 [INFO] Apache Beam :: SDKs :: Java :: IO :: JMS ........... SUCCESS [01:00 min]
2018-03-02T11:06:29.557 [INFO] Apache Beam :: SDKs :: Java :: IO :: Kafka ......... SUCCESS [01:25 min]
2018-03-02T11:06:29.557 [INFO] Apache Beam :: SDKs :: Java :: IO :: Kinesis ....... SUCCESS [01:23 min]
2018-03-02T11:06:29.557 [INFO] Apache Beam :: SDKs :: Java :: IO :: MongoDB ....... SUCCESS [01:40 min]
2018-03-02T11:06:29.557 [INFO] Apache Beam :: SDKs :: Java :: IO :: MQTT .......... SUCCESS [01:04 min]
2018-03-02T11:06:29.557 [INFO] Apache Beam :: SDKs :: Java :: IO :: Redis ......... SUCCESS [ 55.027 s]
2018-03-02T11:06:29.557 [INFO] Apache Beam :: SDKs :: Java :: IO :: Solr .......... SUCCESS [01:42 min]
2018-03-02T11:06:29.557 [INFO] Apache Beam :: SDKs :: Java :: IO :: Tika .......... SUCCESS [01:12 min]
2018-03-02T11:06:29.557 [INFO] Apache Beam :: SDKs :: Java :: IO :: XML ........... SUCCESS [01:20 min]
2018-03-02T11:06:29.557 [INFO] Apache Beam :: SDKs :: Java :: Maven Archetypes .... SUCCESS [ 4.743 s]
2018-03-02T11:06:29.557 [INFO] Apache Beam :: SDKs :: Java :: Maven Archetypes :: Starter SUCCESS [ 45.739 s]
2018-03-02T11:06:29.557 [INFO] Apache Beam :: Examples ............................ SUCCESS [ 5.285 s]
2018-03-02T11:06:29.557 [INFO] Apache Beam :: Examples :: Java .................... SUCCESS [07:18 min]
2018-03-02T11:06:29.557 [INFO] Apache Beam :: SDKs :: Java :: Maven Archetypes :: Examples SUCCESS [01:27 min]
2018-03-02T11:06:29.557 [INFO] Apache Beam :: SDKs :: Java :: Extensions :: Jackson SUCCESS [ 50.862 s]
2018-03-02T11:06:29.557 [INFO] Apache Beam :: SDKs :: Java :: Extensions :: Join library SUCCESS [ 53.677 s]
2018-03-02T11:06:29.557 [INFO] Apache Beam :: SDKs :: Java :: Extensions :: Sketching SUCCESS [01:12 min]
2018-03-02T11:06:29.557 [INFO] Apache Beam :: SDKs :: Java :: Extensions :: Sorter SUCCESS [01:35 min]
2018-03-02T11:06:29.557 [INFO] Apache Beam :: SDKs :: Java :: Extensions :: SQL ... SUCCESS [04:03 min]
2018-03-02T11:06:29.557 [INFO] Apache Beam :: SDKs :: Java :: Nexmark ............. SUCCESS [03:20 min]
2018-03-02T11:06:29.558 [INFO] Apache Beam :: SDKs :: Python ...................... SUCCESS [52:42 min]
2018-03-02T11:06:29.558 [INFO] Apache Beam :: SDKs :: Python :: Container ......... SUCCESS [ 24.669 s]
2018-03-02T11:06:29.558 [INFO] Apache Beam :: Runners :: Java Fn Execution ........ SUCCESS [02:07 min]
2018-03-02T11:06:29.558 [INFO] Apache Beam :: Runners :: Java Local Artifact Service SUCCESS [ 47.902 s]
2018-03-02T11:06:29.558 [INFO] Apache Beam :: Runners :: Reference ................ SUCCESS [ 5.084 s]
2018-03-02T11:06:29.558 [INFO] Apache Beam :: Runners :: Reference :: Java ........ SUCCESS [01:07 min]
2018-03-02T11:06:29.558 [INFO] Apache Beam :: Runners :: Reference :: Job Orchestrator SUCCESS [ 23.405 s]
2018-03-02T11:06:29.558 [INFO] Apache Beam :: Runners :: Flink .................... FAILURE [ 8.310 s]
2018-03-02T11:06:29.558 [INFO] Apache Beam :: Runners :: Gearpump ................. SUCCESS [ 41.480 s]
2018-03-02T11:06:29.558 [INFO] Apache Beam :: Runners :: Spark .................... SUCCESS [01:56 min]
2018-03-02T11:06:29.558 [INFO] Apache Beam :: Runners :: Apex ..................... SUCCESS [01:10 min]
2018-03-02T11:06:29.558 [INFO] Apache Beam :: Runners :: Google Cloud Platform .... SUCCESS [ 4.705 s]
2018-03-02T11:06:29.558 [INFO] Apache Beam :: Runners :: Google Cloud Platform :: GCE metadata provisioning SUCCESS [ 8.740 s]
2018-03-02T11:06:29.558 [INFO] Apache Beam :: Runners :: Google Cloud Platform :: GCS artifact proxy SUCCESS [ 9.009 s]
2018-03-02T11:06:29.558 [INFO] Apache Beam :: SDKs :: Java :: Aggregated Javadoc .. SKIPPED
2018-03-02T11:06:29.558 [INFO] ------------------------------------------------------------------------
2018-03-02T11:06:29.558 [INFO] BUILD FAILURE
2018-03-02T11:06:29.558 [INFO] ------------------------------------------------------------------------
2018-03-02T11:06:29.558 [INFO] Total time: 02:53 h
2018-03-02T11:06:29.558 [INFO] Finished at: 2018-03-02T11:06:29Z
2018-03-02T11:06:30.592 [INFO] Final Memory: 378M/1813M
2018-03-02T11:06:30.592 [INFO] ------------------------------------------------------------------------
2018-03-02T11:06:30.603 [ERROR] Failed to execute goal org.apache.maven.plugins:maven-compiler-plugin:3.7.0:compile (default-compile) on project beam-runners-flink_2.11: Compilation failure
2018-03-02T11:06:30.603 [ERROR] <https://builds.apache.org/job/beam_Release_NightlySnapshot/ws/src/runners/flink/src/main/java/org/apache/beam/runners/flink/translation/wrappers/streaming/DoFnOperator.java>:[359,11] cannot infer type arguments for org.apache.beam.runners.core.ProcessFnRunner<>
2018-03-02T11:06:30.603 [ERROR] reason: cannot infer type-variable(s) InputT,OutputT,RestrictionT
2018-03-02T11:06:30.603 [ERROR] (argument mismatch; org.apache.beam.runners.core.DoFnRunner cannot be converted to org.apache.beam.runners.core.SimpleDoFnRunner<org.apache.beam.runners.core.KeyedWorkItem<java.lang.String,org.apache.beam.sdk.values.KV<InputT,RestrictionT>>,OutputT>)
2018-03-02T11:06:30.603 [ERROR] -> [Help 1]
2018-03-02T11:06:30.603 [ERROR]
2018-03-02T11:06:30.603 [ERROR] To see the full stack trace of the errors, re-run Maven with the -e switch.
2018-03-02T11:06:30.603 [ERROR] Re-run Maven using the -X switch to enable full debug logging.
2018-03-02T11:06:30.603 [ERROR]
2018-03-02T11:06:30.603 [ERROR] For more information about the errors and possible solutions, please read the following articles:
2018-03-02T11:06:30.603 [ERROR] [Help 1] http://cwiki.apache.org/confluence/display/MAVEN/MojoFailureException
2018-03-02T11:06:30.603 [ERROR]
2018-03-02T11:06:30.603 [ERROR] After correcting the problems, you can resume the build with the command
2018-03-02T11:06:30.603 [ERROR] mvn <goals> -rf :beam-runners-flink_2.11
channel stopped
Not sending mail to unregistered user sidhom@google.com
Not sending mail to unregistered user yifanzou@yifanzou-linuxworkstation.sea.corp.google.com
Not sending mail to unregistered user ccy@google.com
Not sending mail to unregistered user github@alasdairhodge.co.uk
Jenkins build is back to normal : beam_Release_NightlySnapshot #703
Posted by Apache Jenkins Server <je...@builds.apache.org>.
See <https://builds.apache.org/job/beam_Release_NightlySnapshot/703/display/redirect?page=changes>