You are viewing a plain text version of this content. The canonical link for it is here.
Posted to dev@lucene.apache.org by Policeman Jenkins Server <je...@thetaphi.de> on 2018/02/05 00:42:50 UTC

[JENKINS-EA] Lucene-Solr-7.x-Linux (64bit/jdk-10-ea+42) - Build # 1299 - Still Unstable!

Build: https://jenkins.thetaphi.de/job/Lucene-Solr-7.x-Linux/1299/
Java: 64bit/jdk-10-ea+42 -XX:-UseCompressedOops -XX:+UseConcMarkSweepGC

3 tests failed.
FAILED:  junit.framework.TestSuite.org.apache.solr.cloud.api.collections.TestCollectionsAPIViaSolrCloudCluster

Error Message:
1 thread leaked from SUITE scope at org.apache.solr.cloud.api.collections.TestCollectionsAPIViaSolrCloudCluster:     1) Thread[id=4750, name=qtp1844163411-4750, state=TIMED_WAITING, group=TGRP-TestCollectionsAPIViaSolrCloudCluster]         at java.base@10-ea/jdk.internal.misc.Unsafe.park(Native Method)         at java.base@10-ea/java.util.concurrent.locks.LockSupport.parkNanos(LockSupport.java:234)         at java.base@10-ea/java.util.concurrent.locks.AbstractQueuedSynchronizer$ConditionObject.await(AbstractQueuedSynchronizer.java:2205)         at app//org.eclipse.jetty.util.thread.ReservedThreadExecutor$ReservedThread.reservedWait(ReservedThreadExecutor.java:308)         at app//org.eclipse.jetty.util.thread.ReservedThreadExecutor$ReservedThread.run(ReservedThreadExecutor.java:373)         at app//org.eclipse.jetty.util.thread.QueuedThreadPool.runJob(QueuedThreadPool.java:708)         at app//org.eclipse.jetty.util.thread.QueuedThreadPool$2.run(QueuedThreadPool.java:626)         at java.base@10-ea/java.lang.Thread.run(Thread.java:844)

Stack Trace:
com.carrotsearch.randomizedtesting.ThreadLeakError: 1 thread leaked from SUITE scope at org.apache.solr.cloud.api.collections.TestCollectionsAPIViaSolrCloudCluster: 
   1) Thread[id=4750, name=qtp1844163411-4750, state=TIMED_WAITING, group=TGRP-TestCollectionsAPIViaSolrCloudCluster]
        at java.base@10-ea/jdk.internal.misc.Unsafe.park(Native Method)
        at java.base@10-ea/java.util.concurrent.locks.LockSupport.parkNanos(LockSupport.java:234)
        at java.base@10-ea/java.util.concurrent.locks.AbstractQueuedSynchronizer$ConditionObject.await(AbstractQueuedSynchronizer.java:2205)
        at app//org.eclipse.jetty.util.thread.ReservedThreadExecutor$ReservedThread.reservedWait(ReservedThreadExecutor.java:308)
        at app//org.eclipse.jetty.util.thread.ReservedThreadExecutor$ReservedThread.run(ReservedThreadExecutor.java:373)
        at app//org.eclipse.jetty.util.thread.QueuedThreadPool.runJob(QueuedThreadPool.java:708)
        at app//org.eclipse.jetty.util.thread.QueuedThreadPool$2.run(QueuedThreadPool.java:626)
        at java.base@10-ea/java.lang.Thread.run(Thread.java:844)
	at __randomizedtesting.SeedInfo.seed([90ABBFB1936023C8]:0)


FAILED:  junit.framework.TestSuite.org.apache.solr.cloud.api.collections.TestCollectionsAPIViaSolrCloudCluster

Error Message:
There are still zombie threads that couldn't be terminated:    1) Thread[id=4750, name=qtp1844163411-4750, state=TIMED_WAITING, group=TGRP-TestCollectionsAPIViaSolrCloudCluster]         at java.base@10-ea/jdk.internal.misc.Unsafe.park(Native Method)         at java.base@10-ea/java.util.concurrent.locks.LockSupport.parkNanos(LockSupport.java:234)         at java.base@10-ea/java.util.concurrent.locks.AbstractQueuedSynchronizer$ConditionObject.await(AbstractQueuedSynchronizer.java:2205)         at app//org.eclipse.jetty.util.thread.ReservedThreadExecutor$ReservedThread.reservedWait(ReservedThreadExecutor.java:308)         at app//org.eclipse.jetty.util.thread.ReservedThreadExecutor$ReservedThread.run(ReservedThreadExecutor.java:373)         at app//org.eclipse.jetty.util.thread.QueuedThreadPool.runJob(QueuedThreadPool.java:708)         at app//org.eclipse.jetty.util.thread.QueuedThreadPool$2.run(QueuedThreadPool.java:626)         at java.base@10-ea/java.lang.Thread.run(Thread.java:844)

Stack Trace:
com.carrotsearch.randomizedtesting.ThreadLeakError: There are still zombie threads that couldn't be terminated:
   1) Thread[id=4750, name=qtp1844163411-4750, state=TIMED_WAITING, group=TGRP-TestCollectionsAPIViaSolrCloudCluster]
        at java.base@10-ea/jdk.internal.misc.Unsafe.park(Native Method)
        at java.base@10-ea/java.util.concurrent.locks.LockSupport.parkNanos(LockSupport.java:234)
        at java.base@10-ea/java.util.concurrent.locks.AbstractQueuedSynchronizer$ConditionObject.await(AbstractQueuedSynchronizer.java:2205)
        at app//org.eclipse.jetty.util.thread.ReservedThreadExecutor$ReservedThread.reservedWait(ReservedThreadExecutor.java:308)
        at app//org.eclipse.jetty.util.thread.ReservedThreadExecutor$ReservedThread.run(ReservedThreadExecutor.java:373)
        at app//org.eclipse.jetty.util.thread.QueuedThreadPool.runJob(QueuedThreadPool.java:708)
        at app//org.eclipse.jetty.util.thread.QueuedThreadPool$2.run(QueuedThreadPool.java:626)
        at java.base@10-ea/java.lang.Thread.run(Thread.java:844)
	at __randomizedtesting.SeedInfo.seed([90ABBFB1936023C8]:0)


FAILED:  org.apache.solr.cloud.autoscaling.ComputePlanActionTest.testNodeWithMultipleReplicasLost

Error Message:
The operations computed by ComputePlanAction should not be null SolrClientNodeStateProvider.DEBUG{AFTER_ACTION=[compute_plan, null], BEFORE_ACTION=[compute_plan, null]}

Stack Trace:
java.lang.AssertionError: The operations computed by ComputePlanAction should not be null SolrClientNodeStateProvider.DEBUG{AFTER_ACTION=[compute_plan, null], BEFORE_ACTION=[compute_plan, null]}
	at __randomizedtesting.SeedInfo.seed([90ABBFB1936023C8:A06B5E331B12C294]:0)
	at org.junit.Assert.fail(Assert.java:93)
	at org.junit.Assert.assertTrue(Assert.java:43)
	at org.junit.Assert.assertNotNull(Assert.java:526)
	at org.apache.solr.cloud.autoscaling.ComputePlanActionTest.testNodeWithMultipleReplicasLost(ComputePlanActionTest.java:291)
	at java.base/jdk.internal.reflect.NativeMethodAccessorImpl.invoke0(Native Method)
	at java.base/jdk.internal.reflect.NativeMethodAccessorImpl.invoke(NativeMethodAccessorImpl.java:62)
	at java.base/jdk.internal.reflect.DelegatingMethodAccessorImpl.invoke(DelegatingMethodAccessorImpl.java:43)
	at java.base/java.lang.reflect.Method.invoke(Method.java:564)
	at com.carrotsearch.randomizedtesting.RandomizedRunner.invoke(RandomizedRunner.java:1737)
	at com.carrotsearch.randomizedtesting.RandomizedRunner$8.evaluate(RandomizedRunner.java:934)
	at com.carrotsearch.randomizedtesting.RandomizedRunner$9.evaluate(RandomizedRunner.java:970)
	at com.carrotsearch.randomizedtesting.RandomizedRunner$10.evaluate(RandomizedRunner.java:984)
	at com.carrotsearch.randomizedtesting.rules.SystemPropertiesRestoreRule$1.evaluate(SystemPropertiesRestoreRule.java:57)
	at org.apache.lucene.util.TestRuleSetupTeardownChained$1.evaluate(TestRuleSetupTeardownChained.java:49)
	at org.apache.lucene.util.AbstractBeforeAfterRule$1.evaluate(AbstractBeforeAfterRule.java:45)
	at org.apache.lucene.util.TestRuleThreadAndTestName$1.evaluate(TestRuleThreadAndTestName.java:48)
	at org.apache.lucene.util.TestRuleIgnoreAfterMaxFailures$1.evaluate(TestRuleIgnoreAfterMaxFailures.java:64)
	at org.apache.lucene.util.TestRuleMarkFailure$1.evaluate(TestRuleMarkFailure.java:47)
	at com.carrotsearch.randomizedtesting.rules.StatementAdapter.evaluate(StatementAdapter.java:36)
	at com.carrotsearch.randomizedtesting.ThreadLeakControl$StatementRunner.run(ThreadLeakControl.java:368)
	at com.carrotsearch.randomizedtesting.ThreadLeakControl.forkTimeoutingTask(ThreadLeakControl.java:817)
	at com.carrotsearch.randomizedtesting.ThreadLeakControl$3.evaluate(ThreadLeakControl.java:468)
	at com.carrotsearch.randomizedtesting.RandomizedRunner.runSingleTest(RandomizedRunner.java:943)
	at com.carrotsearch.randomizedtesting.RandomizedRunner$5.evaluate(RandomizedRunner.java:829)
	at com.carrotsearch.randomizedtesting.RandomizedRunner$6.evaluate(RandomizedRunner.java:879)
	at com.carrotsearch.randomizedtesting.RandomizedRunner$7.evaluate(RandomizedRunner.java:890)
	at com.carrotsearch.randomizedtesting.rules.StatementAdapter.evaluate(StatementAdapter.java:36)
	at com.carrotsearch.randomizedtesting.rules.SystemPropertiesRestoreRule$1.evaluate(SystemPropertiesRestoreRule.java:57)
	at org.apache.lucene.util.AbstractBeforeAfterRule$1.evaluate(AbstractBeforeAfterRule.java:45)
	at com.carrotsearch.randomizedtesting.rules.StatementAdapter.evaluate(StatementAdapter.java:36)
	at org.apache.lucene.util.TestRuleStoreClassName$1.evaluate(TestRuleStoreClassName.java:41)
	at com.carrotsearch.randomizedtesting.rules.NoShadowingOrOverridesOnMethodsRule$1.evaluate(NoShadowingOrOverridesOnMethodsRule.java:40)
	at com.carrotsearch.randomizedtesting.rules.NoShadowingOrOverridesOnMethodsRule$1.evaluate(NoShadowingOrOverridesOnMethodsRule.java:40)
	at com.carrotsearch.randomizedtesting.rules.StatementAdapter.evaluate(StatementAdapter.java:36)
	at com.carrotsearch.randomizedtesting.rules.StatementAdapter.evaluate(StatementAdapter.java:36)
	at org.apache.lucene.util.TestRuleAssertionsRequired$1.evaluate(TestRuleAssertionsRequired.java:53)
	at org.apache.lucene.util.TestRuleMarkFailure$1.evaluate(TestRuleMarkFailure.java:47)
	at org.apache.lucene.util.TestRuleIgnoreAfterMaxFailures$1.evaluate(TestRuleIgnoreAfterMaxFailures.java:64)
	at org.apache.lucene.util.TestRuleIgnoreTestSuites$1.evaluate(TestRuleIgnoreTestSuites.java:54)
	at com.carrotsearch.randomizedtesting.rules.StatementAdapter.evaluate(StatementAdapter.java:36)
	at com.carrotsearch.randomizedtesting.ThreadLeakControl$StatementRunner.run(ThreadLeakControl.java:368)
	at java.base/java.lang.Thread.run(Thread.java:844)




Build Log:
[...truncated 1734 lines...]
   [junit4] JVM J1: stderr was not empty, see: /home/jenkins/workspace/Lucene-Solr-7.x-Linux/lucene/build/core/test/temp/junit4-J1-20180204_235102_15318026025650874727943.syserr
   [junit4] >>> JVM J1 emitted unexpected output (verbatim) ----
   [junit4] Java HotSpot(TM) 64-Bit Server VM warning: Option UseConcMarkSweepGC was deprecated in version 9.0 and will likely be removed in a future release.
   [junit4] <<< JVM J1: EOF ----

[...truncated 3 lines...]
   [junit4] JVM J0: stderr was not empty, see: /home/jenkins/workspace/Lucene-Solr-7.x-Linux/lucene/build/core/test/temp/junit4-J0-20180204_235102_1539503037343651333095.syserr
   [junit4] >>> JVM J0 emitted unexpected output (verbatim) ----
   [junit4] Java HotSpot(TM) 64-Bit Server VM warning: Option UseConcMarkSweepGC was deprecated in version 9.0 and will likely be removed in a future release.
   [junit4] <<< JVM J0: EOF ----

[...truncated 3 lines...]
   [junit4] JVM J2: stderr was not empty, see: /home/jenkins/workspace/Lucene-Solr-7.x-Linux/lucene/build/core/test/temp/junit4-J2-20180204_235102_1539898537517987642798.syserr
   [junit4] >>> JVM J2 emitted unexpected output (verbatim) ----
   [junit4] Java HotSpot(TM) 64-Bit Server VM warning: Option UseConcMarkSweepGC was deprecated in version 9.0 and will likely be removed in a future release.
   [junit4] <<< JVM J2: EOF ----

[...truncated 299 lines...]
   [junit4] JVM J1: stderr was not empty, see: /home/jenkins/workspace/Lucene-Solr-7.x-Linux/lucene/build/test-framework/test/temp/junit4-J1-20180204_235648_80215074397371769836306.syserr
   [junit4] >>> JVM J1 emitted unexpected output (verbatim) ----
   [junit4] Java HotSpot(TM) 64-Bit Server VM warning: Option UseConcMarkSweepGC was deprecated in version 9.0 and will likely be removed in a future release.
   [junit4] <<< JVM J1: EOF ----

   [junit4] JVM J0: stderr was not empty, see: /home/jenkins/workspace/Lucene-Solr-7.x-Linux/lucene/build/test-framework/test/temp/junit4-J0-20180204_235648_80215323040332265002816.syserr
   [junit4] >>> JVM J0 emitted unexpected output (verbatim) ----
   [junit4] Java HotSpot(TM) 64-Bit Server VM warning: Option UseConcMarkSweepGC was deprecated in version 9.0 and will likely be removed in a future release.
   [junit4] <<< JVM J0: EOF ----

[...truncated 3 lines...]
   [junit4] JVM J2: stderr was not empty, see: /home/jenkins/workspace/Lucene-Solr-7.x-Linux/lucene/build/test-framework/test/temp/junit4-J2-20180204_235648_8025717017714597732051.syserr
   [junit4] >>> JVM J2 emitted unexpected output (verbatim) ----
   [junit4] Java HotSpot(TM) 64-Bit Server VM warning: Option UseConcMarkSweepGC was deprecated in version 9.0 and will likely be removed in a future release.
   [junit4] <<< JVM J2: EOF ----

[...truncated 1057 lines...]
   [junit4] JVM J1: stderr was not empty, see: /home/jenkins/workspace/Lucene-Solr-7.x-Linux/lucene/build/analysis/common/test/temp/junit4-J1-20180204_235758_63114893059032618726654.syserr
   [junit4] >>> JVM J1 emitted unexpected output (verbatim) ----
   [junit4] Java HotSpot(TM) 64-Bit Server VM warning: Option UseConcMarkSweepGC was deprecated in version 9.0 and will likely be removed in a future release.
   [junit4] <<< JVM J1: EOF ----

[...truncated 3 lines...]
   [junit4] JVM J0: stderr was not empty, see: /home/jenkins/workspace/Lucene-Solr-7.x-Linux/lucene/build/analysis/common/test/temp/junit4-J0-20180204_235758_6313803801239354720792.syserr
   [junit4] >>> JVM J0 emitted unexpected output (verbatim) ----
   [junit4] Java HotSpot(TM) 64-Bit Server VM warning: Option UseConcMarkSweepGC was deprecated in version 9.0 and will likely be removed in a future release.
   [junit4] <<< JVM J0: EOF ----

[...truncated 3 lines...]
   [junit4] JVM J2: stderr was not empty, see: /home/jenkins/workspace/Lucene-Solr-7.x-Linux/lucene/build/analysis/common/test/temp/junit4-J2-20180204_235758_63116087547155994096469.syserr
   [junit4] >>> JVM J2 emitted unexpected output (verbatim) ----
   [junit4] Java HotSpot(TM) 64-Bit Server VM warning: Option UseConcMarkSweepGC was deprecated in version 9.0 and will likely be removed in a future release.
   [junit4] <<< JVM J2: EOF ----

[...truncated 226 lines...]
   [junit4] JVM J1: stderr was not empty, see: /home/jenkins/workspace/Lucene-Solr-7.x-Linux/lucene/build/analysis/icu/test/temp/junit4-J1-20180204_235931_3308988144915686872911.syserr
   [junit4] >>> JVM J1 emitted unexpected output (verbatim) ----
   [junit4] Java HotSpot(TM) 64-Bit Server VM warning: Option UseConcMarkSweepGC was deprecated in version 9.0 and will likely be removed in a future release.
   [junit4] <<< JVM J1: EOF ----

   [junit4] JVM J2: stderr was not empty, see: /home/jenkins/workspace/Lucene-Solr-7.x-Linux/lucene/build/analysis/icu/test/temp/junit4-J2-20180204_235931_33011240256387946944918.syserr
   [junit4] >>> JVM J2 emitted unexpected output (verbatim) ----
   [junit4] Java HotSpot(TM) 64-Bit Server VM warning: Option UseConcMarkSweepGC was deprecated in version 9.0 and will likely be removed in a future release.
   [junit4] <<< JVM J2: EOF ----

[...truncated 5 lines...]
   [junit4] JVM J0: stderr was not empty, see: /home/jenkins/workspace/Lucene-Solr-7.x-Linux/lucene/build/analysis/icu/test/temp/junit4-J0-20180204_235931_3306889836819949199899.syserr
   [junit4] >>> JVM J0 emitted unexpected output (verbatim) ----
   [junit4] Java HotSpot(TM) 64-Bit Server VM warning: Option UseConcMarkSweepGC was deprecated in version 9.0 and will likely be removed in a future release.
   [junit4] <<< JVM J0: EOF ----

[...truncated 252 lines...]
   [junit4] JVM J1: stderr was not empty, see: /home/jenkins/workspace/Lucene-Solr-7.x-Linux/lucene/build/analysis/kuromoji/test/temp/junit4-J1-20180204_235940_0254647514056774692090.syserr
   [junit4] >>> JVM J1 emitted unexpected output (verbatim) ----
   [junit4] Java HotSpot(TM) 64-Bit Server VM warning: Option UseConcMarkSweepGC was deprecated in version 9.0 and will likely be removed in a future release.
   [junit4] <<< JVM J1: EOF ----

   [junit4] JVM J0: stderr was not empty, see: /home/jenkins/workspace/Lucene-Solr-7.x-Linux/lucene/build/analysis/kuromoji/test/temp/junit4-J0-20180204_235940_0256187903008955283348.syserr
   [junit4] >>> JVM J0 emitted unexpected output (verbatim) ----
   [junit4] Java HotSpot(TM) 64-Bit Server VM warning: Option UseConcMarkSweepGC was deprecated in version 9.0 and will likely be removed in a future release.
   [junit4] <<< JVM J0: EOF ----

[...truncated 3 lines...]
   [junit4] JVM J2: stderr was not empty, see: /home/jenkins/workspace/Lucene-Solr-7.x-Linux/lucene/build/analysis/kuromoji/test/temp/junit4-J2-20180204_235940_02517235672139549579031.syserr
   [junit4] >>> JVM J2 emitted unexpected output (verbatim) ----
   [junit4] Java HotSpot(TM) 64-Bit Server VM warning: Option UseConcMarkSweepGC was deprecated in version 9.0 and will likely be removed in a future release.
   [junit4] <<< JVM J2: EOF ----

[...truncated 154 lines...]
   [junit4] JVM J1: stderr was not empty, see: /home/jenkins/workspace/Lucene-Solr-7.x-Linux/lucene/build/analysis/morfologik/test/temp/junit4-J1-20180205_000006_7803241194539715743920.syserr
   [junit4] >>> JVM J1 emitted unexpected output (verbatim) ----
   [junit4] Java HotSpot(TM) 64-Bit Server VM warning: Option UseConcMarkSweepGC was deprecated in version 9.0 and will likely be removed in a future release.
   [junit4] <<< JVM J1: EOF ----

[...truncated 3 lines...]
   [junit4] JVM J2: stderr was not empty, see: /home/jenkins/workspace/Lucene-Solr-7.x-Linux/lucene/build/analysis/morfologik/test/temp/junit4-J2-20180205_000006_78014314510568007215691.syserr
   [junit4] >>> JVM J2 emitted unexpected output (verbatim) ----
   [junit4] Java HotSpot(TM) 64-Bit Server VM warning: Option UseConcMarkSweepGC was deprecated in version 9.0 and will likely be removed in a future release.
   [junit4] <<< JVM J2: EOF ----

[...truncated 3 lines...]
   [junit4] JVM J0: stderr was not empty, see: /home/jenkins/workspace/Lucene-Solr-7.x-Linux/lucene/build/analysis/morfologik/test/temp/junit4-J0-20180205_000006_780231266326188068336.syserr
   [junit4] >>> JVM J0 emitted unexpected output (verbatim) ----
   [junit4] Java HotSpot(TM) 64-Bit Server VM warning: Option UseConcMarkSweepGC was deprecated in version 9.0 and will likely be removed in a future release.
   [junit4] <<< JVM J0: EOF ----

[...truncated 158 lines...]
   [junit4] JVM J1: stderr was not empty, see: /home/jenkins/workspace/Lucene-Solr-7.x-Linux/lucene/build/analysis/opennlp/test/temp/junit4-J1-20180205_000010_7826440837786516046174.syserr
   [junit4] >>> JVM J1 emitted unexpected output (verbatim) ----
   [junit4] Java HotSpot(TM) 64-Bit Server VM warning: Option UseConcMarkSweepGC was deprecated in version 9.0 and will likely be removed in a future release.
   [junit4] <<< JVM J1: EOF ----

[...truncated 3 lines...]
   [junit4] JVM J0: stderr was not empty, see: /home/jenkins/workspace/Lucene-Solr-7.x-Linux/lucene/build/analysis/opennlp/test/temp/junit4-J0-20180205_000010_78211364691123842343175.syserr
   [junit4] >>> JVM J0 emitted unexpected output (verbatim) ----
   [junit4] Java HotSpot(TM) 64-Bit Server VM warning: Option UseConcMarkSweepGC was deprecated in version 9.0 and will likely be removed in a future release.
   [junit4] <<< JVM J0: EOF ----

[...truncated 3 lines...]
   [junit4] JVM J2: stderr was not empty, see: /home/jenkins/workspace/Lucene-Solr-7.x-Linux/lucene/build/analysis/opennlp/test/temp/junit4-J2-20180205_000010_78210180474269893878663.syserr
   [junit4] >>> JVM J2 emitted unexpected output (verbatim) ----
   [junit4] Java HotSpot(TM) 64-Bit Server VM warning: Option UseConcMarkSweepGC was deprecated in version 9.0 and will likely be removed in a future release.
   [junit4] <<< JVM J2: EOF ----

[...truncated 168 lines...]
   [junit4] JVM J2: stderr was not empty, see: /home/jenkins/workspace/Lucene-Solr-7.x-Linux/lucene/build/analysis/phonetic/test/temp/junit4-J2-20180205_000013_3162261363425528674575.syserr
   [junit4] >>> JVM J2 emitted unexpected output (verbatim) ----
   [junit4] Java HotSpot(TM) 64-Bit Server VM warning: Option UseConcMarkSweepGC was deprecated in version 9.0 and will likely be removed in a future release.
   [junit4] <<< JVM J2: EOF ----

[...truncated 3 lines...]
   [junit4] JVM J0: stderr was not empty, see: /home/jenkins/workspace/Lucene-Solr-7.x-Linux/lucene/build/analysis/phonetic/test/temp/junit4-J0-20180205_000013_3169122178295418219921.syserr
   [junit4] >>> JVM J0 emitted unexpected output (verbatim) ----
   [junit4] Java HotSpot(TM) 64-Bit Server VM warning: Option UseConcMarkSweepGC was deprecated in version 9.0 and will likely be removed in a future release.
   [junit4] <<< JVM J0: EOF ----

[...truncated 3 lines...]
   [junit4] JVM J1: stderr was not empty, see: /home/jenkins/workspace/Lucene-Solr-7.x-Linux/lucene/build/analysis/phonetic/test/temp/junit4-J1-20180205_000013_3167185203991780426040.syserr
   [junit4] >>> JVM J1 emitted unexpected output (verbatim) ----
   [junit4] Java HotSpot(TM) 64-Bit Server VM warning: Option UseConcMarkSweepGC was deprecated in version 9.0 and will likely be removed in a future release.
   [junit4] <<< JVM J1: EOF ----

[...truncated 153 lines...]
   [junit4] JVM J1: stderr was not empty, see: /home/jenkins/workspace/Lucene-Solr-7.x-Linux/lucene/build/analysis/smartcn/test/temp/junit4-J1-20180205_000023_54715048304528081077789.syserr
   [junit4] >>> JVM J1 emitted unexpected output (verbatim) ----
   [junit4] Java HotSpot(TM) 64-Bit Server VM warning: Option UseConcMarkSweepGC was deprecated in version 9.0 and will likely be removed in a future release.
   [junit4] <<< JVM J1: EOF ----

[...truncated 3 lines...]
   [junit4] JVM J0: stderr was not empty, see: /home/jenkins/workspace/Lucene-Solr-7.x-Linux/lucene/build/analysis/smartcn/test/temp/junit4-J0-20180205_000023_54715307268412553674043.syserr
   [junit4] >>> JVM J0 emitted unexpected output (verbatim) ----
   [junit4] Java HotSpot(TM) 64-Bit Server VM warning: Option UseConcMarkSweepGC was deprecated in version 9.0 and will likely be removed in a future release.
   [junit4] <<< JVM J0: EOF ----

[...truncated 154 lines...]
   [junit4] JVM J1: stderr was not empty, see: /home/jenkins/workspace/Lucene-Solr-7.x-Linux/lucene/build/analysis/stempel/test/temp/junit4-J1-20180205_000031_3581020531641908583606.syserr
   [junit4] >>> JVM J1 emitted unexpected output (verbatim) ----
   [junit4] Java HotSpot(TM) 64-Bit Server VM warning: Option UseConcMarkSweepGC was deprecated in version 9.0 and will likely be removed in a future release.
   [junit4] <<< JVM J1: EOF ----

[...truncated 3 lines...]
   [junit4] JVM J2: stderr was not empty, see: /home/jenkins/workspace/Lucene-Solr-7.x-Linux/lucene/build/analysis/stempel/test/temp/junit4-J2-20180205_000031_35810853620288024772060.syserr
   [junit4] >>> JVM J2 emitted unexpected output (verbatim) ----
   [junit4] Java HotSpot(TM) 64-Bit Server VM warning: Option UseConcMarkSweepGC was deprecated in version 9.0 and will likely be removed in a future release.
   [junit4] <<< JVM J2: EOF ----

[...truncated 3 lines...]
   [junit4] JVM J0: stderr was not empty, see: /home/jenkins/workspace/Lucene-Solr-7.x-Linux/lucene/build/analysis/stempel/test/temp/junit4-J0-20180205_000031_3581248490088255659620.syserr
   [junit4] >>> JVM J0 emitted unexpected output (verbatim) ----
   [junit4] Java HotSpot(TM) 64-Bit Server VM warning: Option UseConcMarkSweepGC was deprecated in version 9.0 and will likely be removed in a future release.
   [junit4] <<< JVM J0: EOF ----

[...truncated 169 lines...]
   [junit4] JVM J0: stderr was not empty, see: /home/jenkins/workspace/Lucene-Solr-7.x-Linux/lucene/build/analysis/uima/test/temp/junit4-J0-20180205_000033_92813010236424988570884.syserr
   [junit4] >>> JVM J0 emitted unexpected output (verbatim) ----
   [junit4] Java HotSpot(TM) 64-Bit Server VM warning: Option UseConcMarkSweepGC was deprecated in version 9.0 and will likely be removed in a future release.
   [junit4] <<< JVM J0: EOF ----

[...truncated 195 lines...]
   [junit4] JVM J1: stderr was not empty, see: /home/jenkins/workspace/Lucene-Solr-7.x-Linux/lucene/build/backward-codecs/test/temp/junit4-J1-20180205_000044_236379924796338413474.syserr
   [junit4] >>> JVM J1 emitted unexpected output (verbatim) ----
   [junit4] Java HotSpot(TM) 64-Bit Server VM warning: Option UseConcMarkSweepGC was deprecated in version 9.0 and will likely be removed in a future release.
   [junit4] <<< JVM J1: EOF ----

[...truncated 19 lines...]
   [junit4] JVM J0: stderr was not empty, see: /home/jenkins/workspace/Lucene-Solr-7.x-Linux/lucene/build/backward-codecs/test/temp/junit4-J0-20180205_000044_23611117811475295508699.syserr
   [junit4] >>> JVM J0 emitted unexpected output (verbatim) ----
   [junit4] Java HotSpot(TM) 64-Bit Server VM warning: Option UseConcMarkSweepGC was deprecated in version 9.0 and will likely be removed in a future release.
   [junit4] <<< JVM J0: EOF ----

[...truncated 9 lines...]
   [junit4] JVM J2: stderr was not empty, see: /home/jenkins/workspace/Lucene-Solr-7.x-Linux/lucene/build/backward-codecs/test/temp/junit4-J2-20180205_000044_23616796960189220844517.syserr
   [junit4] >>> JVM J2 emitted unexpected output (verbatim) ----
   [junit4] Java HotSpot(TM) 64-Bit Server VM warning: Option UseConcMarkSweepGC was deprecated in version 9.0 and will likely be removed in a future release.
   [junit4] <<< JVM J2: EOF ----

[...truncated 1306 lines...]
   [junit4] JVM J2: stderr was not empty, see: /home/jenkins/workspace/Lucene-Solr-7.x-Linux/lucene/build/benchmark/test/temp/junit4-J2-20180205_000222_70310237929305518104379.syserr
   [junit4] >>> JVM J2 emitted unexpected output (verbatim) ----
   [junit4] Java HotSpot(TM) 64-Bit Server VM warning: Option UseConcMarkSweepGC was deprecated in version 9.0 and will likely be removed in a future release.
   [junit4] <<< JVM J2: EOF ----

   [junit4] JVM J1: stderr was not empty, see: /home/jenkins/workspace/Lucene-Solr-7.x-Linux/lucene/build/benchmark/test/temp/junit4-J1-20180205_000222_7031048891896268820042.syserr
   [junit4] >>> JVM J1 emitted unexpected output (verbatim) ----
   [junit4] Java HotSpot(TM) 64-Bit Server VM warning: Option UseConcMarkSweepGC was deprecated in version 9.0 and will likely be removed in a future release.
   [junit4] <<< JVM J1: EOF ----

[...truncated 3 lines...]
   [junit4] JVM J0: stderr was not empty, see: /home/jenkins/workspace/Lucene-Solr-7.x-Linux/lucene/build/benchmark/test/temp/junit4-J0-20180205_000222_7038819673403918307974.syserr
   [junit4] >>> JVM J0 emitted unexpected output (verbatim) ----
   [junit4] Java HotSpot(TM) 64-Bit Server VM warning: Option UseConcMarkSweepGC was deprecated in version 9.0 and will likely be removed in a future release.
   [junit4] <<< JVM J0: EOF ----

[...truncated 230 lines...]
   [junit4] JVM J2: stderr was not empty, see: /home/jenkins/workspace/Lucene-Solr-7.x-Linux/lucene/build/classification/test/temp/junit4-J2-20180205_000230_95014466043127929757423.syserr
   [junit4] >>> JVM J2 emitted unexpected output (verbatim) ----
   [junit4] Java HotSpot(TM) 64-Bit Server VM warning: Option UseConcMarkSweepGC was deprecated in version 9.0 and will likely be removed in a future release.
   [junit4] <<< JVM J2: EOF ----

[...truncated 6 lines...]
   [junit4] JVM J1: stderr was not empty, see: /home/jenkins/workspace/Lucene-Solr-7.x-Linux/lucene/build/classification/test/temp/junit4-J1-20180205_000230_9501664632931906671706.syserr
   [junit4] >>> JVM J1 emitted unexpected output (verbatim) ----
   [junit4] Java HotSpot(TM) 64-Bit Server VM warning: Option UseConcMarkSweepGC was deprecated in version 9.0 and will likely be removed in a future release.
   [junit4] <<< JVM J1: EOF ----

   [junit4] JVM J0: stderr was not empty, see: /home/jenkins/workspace/Lucene-Solr-7.x-Linux/lucene/build/classification/test/temp/junit4-J0-20180205_000230_95011838595916810278404.syserr
   [junit4] >>> JVM J0 emitted unexpected output (verbatim) ----
   [junit4] Java HotSpot(TM) 64-Bit Server VM warning: Option UseConcMarkSweepGC was deprecated in version 9.0 and will likely be removed in a future release.
   [junit4] <<< JVM J0: EOF ----

[...truncated 259 lines...]
   [junit4] JVM J1: stderr was not empty, see: /home/jenkins/workspace/Lucene-Solr-7.x-Linux/lucene/build/codecs/test/temp/junit4-J1-20180205_000240_691813410784056235960.syserr
   [junit4] >>> JVM J1 emitted unexpected output (verbatim) ----
   [junit4] Java HotSpot(TM) 64-Bit Server VM warning: Option UseConcMarkSweepGC was deprecated in version 9.0 and will likely be removed in a future release.
   [junit4] <<< JVM J1: EOF ----

   [junit4] JVM J2: stderr was not empty, see: /home/jenkins/workspace/Lucene-Solr-7.x-Linux/lucene/build/codecs/test/temp/junit4-J2-20180205_000240_69116446961042425523568.syserr
   [junit4] >>> JVM J2 emitted unexpected output (verbatim) ----
   [junit4] Java HotSpot(TM) 64-Bit Server VM warning: Option UseConcMarkSweepGC was deprecated in version 9.0 and will likely be removed in a future release.
   [junit4] <<< JVM J2: EOF ----

[...truncated 6 lines...]
   [junit4] JVM J0: stderr was not empty, see: /home/jenkins/workspace/Lucene-Solr-7.x-Linux/lucene/build/codecs/test/temp/junit4-J0-20180205_000240_69113003464923122218682.syserr
   [junit4] >>> JVM J0 emitted unexpected output (verbatim) ----
   [junit4] Java HotSpot(TM) 64-Bit Server VM warning: Option UseConcMarkSweepGC was deprecated in version 9.0 and will likely be removed in a future release.
   [junit4] <<< JVM J0: EOF ----

[...truncated 214 lines...]
   [junit4] JVM J2: stderr was not empty, see: /home/jenkins/workspace/Lucene-Solr-7.x-Linux/lucene/build/demo/test/temp/junit4-J2-20180205_000449_64413032395513657743071.syserr
   [junit4] >>> JVM J2 emitted unexpected output (verbatim) ----
   [junit4] Java HotSpot(TM) 64-Bit Server VM warning: Option UseConcMarkSweepGC was deprecated in version 9.0 and will likely be removed in a future release.
   [junit4] <<< JVM J2: EOF ----

   [junit4] JVM J1: stderr was not empty, see: /home/jenkins/workspace/Lucene-Solr-7.x-Linux/lucene/build/demo/test/temp/junit4-J1-20180205_000449_644325312325635969078.syserr
   [junit4] >>> JVM J1 emitted unexpected output (verbatim) ----
   [junit4] Java HotSpot(TM) 64-Bit Server VM warning: Option UseConcMarkSweepGC was deprecated in version 9.0 and will likely be removed in a future release.
   [junit4] <<< JVM J1: EOF ----

   [junit4] JVM J0: stderr was not empty, see: /home/jenkins/workspace/Lucene-Solr-7.x-Linux/lucene/build/demo/test/temp/junit4-J0-20180205_000449_6444621800234224084376.syserr
   [junit4] >>> JVM J0 emitted unexpected output (verbatim) ----
   [junit4] Java HotSpot(TM) 64-Bit Server VM warning: Option UseConcMarkSweepGC was deprecated in version 9.0 and will likely be removed in a future release.
   [junit4] <<< JVM J0: EOF ----

[...truncated 170 lines...]
   [junit4] JVM J0: stderr was not empty, see: /home/jenkins/workspace/Lucene-Solr-7.x-Linux/lucene/build/expressions/test/temp/junit4-J0-20180205_000452_33510595297911299314574.syserr
   [junit4] >>> JVM J0 emitted unexpected output (verbatim) ----
   [junit4] Java HotSpot(TM) 64-Bit Server VM warning: Option UseConcMarkSweepGC was deprecated in version 9.0 and will likely be removed in a future release.
   [junit4] <<< JVM J0: EOF ----

[...truncated 3 lines...]
   [junit4] JVM J2: stderr was not empty, see: /home/jenkins/workspace/Lucene-Solr-7.x-Linux/lucene/build/expressions/test/temp/junit4-J2-20180205_000452_3351739823859451043140.syserr
   [junit4] >>> JVM J2 emitted unexpected output (verbatim) ----
   [junit4] Java HotSpot(TM) 64-Bit Server VM warning: Option UseConcMarkSweepGC was deprecated in version 9.0 and will likely be removed in a future release.
   [junit4] <<< JVM J2: EOF ----

[...truncated 3 lines...]
   [junit4] JVM J1: stderr was not empty, see: /home/jenkins/workspace/Lucene-Solr-7.x-Linux/lucene/build/expressions/test/temp/junit4-J1-20180205_000452_3359775063917361012470.syserr
   [junit4] >>> JVM J1 emitted unexpected output (verbatim) ----
   [junit4] Java HotSpot(TM) 64-Bit Server VM warning: Option UseConcMarkSweepGC was deprecated in version 9.0 and will likely be removed in a future release.
   [junit4] <<< JVM J1: EOF ----

[...truncated 226 lines...]
   [junit4] JVM J1: stderr was not empty, see: /home/jenkins/workspace/Lucene-Solr-7.x-Linux/lucene/build/facet/test/temp/junit4-J1-20180205_000457_85612073964959982766436.syserr
   [junit4] >>> JVM J1 emitted unexpected output (verbatim) ----
   [junit4] Java HotSpot(TM) 64-Bit Server VM warning: Option UseConcMarkSweepGC was deprecated in version 9.0 and will likely be removed in a future release.
   [junit4] <<< JVM J1: EOF ----

[...truncated 3 lines...]
   [junit4] JVM J0: stderr was not empty, see: /home/jenkins/workspace/Lucene-Solr-7.x-Linux/lucene/build/facet/test/temp/junit4-J0-20180205_000457_8569001507894105778837.syserr
   [junit4] >>> JVM J0 emitted unexpected output (verbatim) ----
   [junit4] Java HotSpot(TM) 64-Bit Server VM warning: Option UseConcMarkSweepGC was deprecated in version 9.0 and will likely be removed in a future release.
   [junit4] <<< JVM J0: EOF ----

[...truncated 3 lines...]
   [junit4] JVM J2: stderr was not empty, see: /home/jenkins/workspace/Lucene-Solr-7.x-Linux/lucene/build/facet/test/temp/junit4-J2-20180205_000457_85618072697960077003575.syserr
   [junit4] >>> JVM J2 emitted unexpected output (verbatim) ----
   [junit4] Java HotSpot(TM) 64-Bit Server VM warning: Option UseConcMarkSweepGC was deprecated in version 9.0 and will likely be removed in a future release.
   [junit4] <<< JVM J2: EOF ----

[...truncated 182 lines...]
   [junit4] JVM J0: stderr was not empty, see: /home/jenkins/workspace/Lucene-Solr-7.x-Linux/lucene/build/grouping/test/temp/junit4-J0-20180205_000524_4901940275677293723921.syserr
   [junit4] >>> JVM J0 emitted unexpected output (verbatim) ----
   [junit4] Java HotSpot(TM) 64-Bit Server VM warning: Option UseConcMarkSweepGC was deprecated in version 9.0 and will likely be removed in a future release.
   [junit4] <<< JVM J0: EOF ----

   [junit4] JVM J1: stderr was not empty, see: /home/jenkins/workspace/Lucene-Solr-7.x-Linux/lucene/build/grouping/test/temp/junit4-J1-20180205_000524_4909488931248784465468.syserr
   [junit4] >>> JVM J1 emitted unexpected output (verbatim) ----
   [junit4] Java HotSpot(TM) 64-Bit Server VM warning: Option UseConcMarkSweepGC was deprecated in version 9.0 and will likely be removed in a future release.
   [junit4] <<< JVM J1: EOF ----

[...truncated 3 lines...]
   [junit4] JVM J2: stderr was not empty, see: /home/jenkins/workspace/Lucene-Solr-7.x-Linux/lucene/build/grouping/test/temp/junit4-J2-20180205_000524_49014896882528341784279.syserr
   [junit4] >>> JVM J2 emitted unexpected output (verbatim) ----
   [junit4] Java HotSpot(TM) 64-Bit Server VM warning: Option UseConcMarkSweepGC was deprecated in version 9.0 and will likely be removed in a future release.
   [junit4] <<< JVM J2: EOF ----

[...truncated 243 lines...]
   [junit4] JVM J0: stderr was not empty, see: /home/jenkins/workspace/Lucene-Solr-7.x-Linux/lucene/build/highlighter/test/temp/junit4-J0-20180205_000533_9681829314386137394790.syserr
   [junit4] >>> JVM J0 emitted unexpected output (verbatim) ----
   [junit4] Java HotSpot(TM) 64-Bit Server VM warning: Option UseConcMarkSweepGC was deprecated in version 9.0 and will likely be removed in a future release.
   [junit4] <<< JVM J0: EOF ----

[...truncated 3 lines...]
   [junit4] JVM J1: stderr was not empty, see: /home/jenkins/workspace/Lucene-Solr-7.x-Linux/lucene/build/highlighter/test/temp/junit4-J1-20180205_000533_9685189833147940568437.syserr
   [junit4] >>> JVM J1 emitted unexpected output (verbatim) ----
   [junit4] Java HotSpot(TM) 64-Bit Server VM warning: Option UseConcMarkSweepGC was deprecated in version 9.0 and will likely be removed in a future release.
   [junit4] <<< JVM J1: EOF ----

[...truncated 3 lines...]
   [junit4] JVM J2: stderr was not empty, see: /home/jenkins/workspace/Lucene-Solr-7.x-Linux/lucene/build/highlighter/test/temp/junit4-J2-20180205_000533_9687028911167133409992.syserr
   [junit4] >>> JVM J2 emitted unexpected output (verbatim) ----
   [junit4] Java HotSpot(TM) 64-Bit Server VM warning: Option UseConcMarkSweepGC was deprecated in version 9.0 and will likely be removed in a future release.
   [junit4] <<< JVM J2: EOF ----

[...truncated 163 lines...]
   [junit4] JVM J0: stderr was not empty, see: /home/jenkins/workspace/Lucene-Solr-7.x-Linux/lucene/build/join/test/temp/junit4-J0-20180205_000557_50213264597191033804719.syserr
   [junit4] >>> JVM J0 emitted unexpected output (verbatim) ----
   [junit4] Java HotSpot(TM) 64-Bit Server VM warning: Option UseConcMarkSweepGC was deprecated in version 9.0 and will likely be removed in a future release.
   [junit4] <<< JVM J0: EOF ----

[...truncated 3 lines...]
   [junit4] JVM J2: stderr was not empty, see: /home/jenkins/workspace/Lucene-Solr-7.x-Linux/lucene/build/join/test/temp/junit4-J2-20180205_000557_5039753479003492223686.syserr
   [junit4] >>> JVM J2 emitted unexpected output (verbatim) ----
   [junit4] Java HotSpot(TM) 64-Bit Server VM warning: Option UseConcMarkSweepGC was deprecated in version 9.0 and will likely be removed in a future release.
   [junit4] <<< JVM J2: EOF ----

[...truncated 3 lines...]
   [junit4] JVM J1: stderr was not empty, see: /home/jenkins/workspace/Lucene-Solr-7.x-Linux/lucene/build/join/test/temp/junit4-J1-20180205_000557_50212151933486356835117.syserr
   [junit4] >>> JVM J1 emitted unexpected output (verbatim) ----
   [junit4] Java HotSpot(TM) 64-Bit Server VM warning: Option UseConcMarkSweepGC was deprecated in version 9.0 and will likely be removed in a future release.
   [junit4] <<< JVM J1: EOF ----

[...truncated 149 lines...]
   [junit4] JVM J0: stderr was not empty, see: /home/jenkins/workspace/Lucene-Solr-7.x-Linux/lucene/build/memory/test/temp/junit4-J0-20180205_000613_0937948696680861188700.syserr
   [junit4] >>> JVM J0 emitted unexpected output (verbatim) ----
   [junit4] Java HotSpot(TM) 64-Bit Server VM warning: Option UseConcMarkSweepGC was deprecated in version 9.0 and will likely be removed in a future release.
   [junit4] <<< JVM J0: EOF ----

[...truncated 3 lines...]
   [junit4] JVM J1: stderr was not empty, see: /home/jenkins/workspace/Lucene-Solr-7.x-Linux/lucene/build/memory/test/temp/junit4-J1-20180205_000613_093241607992738266781.syserr
   [junit4] >>> JVM J1 emitted unexpected output (verbatim) ----
   [junit4] Java HotSpot(TM) 64-Bit Server VM warning: Option UseConcMarkSweepGC was deprecated in version 9.0 and will likely be removed in a future release.
   [junit4] <<< JVM J1: EOF ----

[...truncated 177 lines...]
   [junit4] JVM J2: stderr was not empty, see: /home/jenkins/workspace/Lucene-Solr-7.x-Linux/lucene/build/misc/test/temp/junit4-J2-20180205_000621_93413690322477092531001.syserr
   [junit4] >>> JVM J2 emitted unexpected output (verbatim) ----
   [junit4] Java HotSpot(TM) 64-Bit Server VM warning: Option UseConcMarkSweepGC was deprecated in version 9.0 and will likely be removed in a future release.
   [junit4] <<< JVM J2: EOF ----

[...truncated 5 lines...]
   [junit4] JVM J1: stderr was not empty, see: /home/jenkins/workspace/Lucene-Solr-7.x-Linux/lucene/build/misc/test/temp/junit4-J1-20180205_000621_9347477120559593577182.syserr
   [junit4] >>> JVM J1 emitted unexpected output (verbatim) ----
   [junit4] Java HotSpot(TM) 64-Bit Server VM warning: Option UseConcMarkSweepGC was deprecated in version 9.0 and will likely be removed in a future release.
   [junit4] <<< JVM J1: EOF ----

[...truncated 6 lines...]
   [junit4] JVM J0: stderr was not empty, see: /home/jenkins/workspace/Lucene-Solr-7.x-Linux/lucene/build/misc/test/temp/junit4-J0-20180205_000621_93413187493898567959934.syserr
   [junit4] >>> JVM J0 emitted unexpected output (verbatim) ----
   [junit4] Java HotSpot(TM) 64-Bit Server VM warning: Option UseConcMarkSweepGC was deprecated in version 9.0 and will likely be removed in a future release.
   [junit4] <<< JVM J0: EOF ----

[...truncated 332 lines...]
   [junit4] JVM J0: stderr was not empty, see: /home/jenkins/workspace/Lucene-Solr-7.x-Linux/lucene/build/queries/test/temp/junit4-J0-20180205_000635_0745809085054116413143.syserr
   [junit4] >>> JVM J0 emitted unexpected output (verbatim) ----
   [junit4] Java HotSpot(TM) 64-Bit Server VM warning: Option UseConcMarkSweepGC was deprecated in version 9.0 and will likely be removed in a future release.
   [junit4] <<< JVM J0: EOF ----

[...truncated 6 lines...]
   [junit4] JVM J1: stderr was not empty, see: /home/jenkins/workspace/Lucene-Solr-7.x-Linux/lucene/build/queries/test/temp/junit4-J1-20180205_000635_074868799479739776145.syserr
   [junit4] >>> JVM J1 emitted unexpected output (verbatim) ----
   [junit4] Java HotSpot(TM) 64-Bit Server VM warning: Option UseConcMarkSweepGC was deprecated in version 9.0 and will likely be removed in a future release.
   [junit4] <<< JVM J1: EOF ----

   [junit4] JVM J2: stderr was not empty, see: /home/jenkins/workspace/Lucene-Solr-7.x-Linux/lucene/build/queries/test/temp/junit4-J2-20180205_000635_07414914744353551778405.syserr
   [junit4] >>> JVM J2 emitted unexpected output (verbatim) ----
   [junit4] Java HotSpot(TM) 64-Bit Server VM warning: Option UseConcMarkSweepGC was deprecated in version 9.0 and will likely be removed in a future release.
   [junit4] <<< JVM J2: EOF ----

[...truncated 230 lines...]
   [junit4] JVM J0: stderr was not empty, see: /home/jenkins/workspace/Lucene-Solr-7.x-Linux/lucene/build/queryparser/test/temp/junit4-J0-20180205_000642_56810436176450810666040.syserr
   [junit4] >>> JVM J0 emitted unexpected output (verbatim) ----
   [junit4] Java HotSpot(TM) 64-Bit Server VM warning: Option UseConcMarkSweepGC was deprecated in version 9.0 and will likely be removed in a future release.
   [junit4] <<< JVM J0: EOF ----

   [junit4] JVM J1: stderr was not empty, see: /home/jenkins/workspace/Lucene-Solr-7.x-Linux/lucene/build/queryparser/test/temp/junit4-J1-20180205_000642_56812050070634853960493.syserr
   [junit4] >>> JVM J1 emitted unexpected output (verbatim) ----
   [junit4] Java HotSpot(TM) 64-Bit Server VM warning: Option UseConcMarkSweepGC was deprecated in version 9.0 and will likely be removed in a future release.
   [junit4] <<< JVM J1: EOF ----

   [junit4] JVM J2: stderr was not empty, see: /home/jenkins/workspace/Lucene-Solr-7.x-Linux/lucene/build/queryparser/test/temp/junit4-J2-20180205_000642_5684130145372210442519.syserr
   [junit4] >>> JVM J2 emitted unexpected output (verbatim) ----
   [junit4] Java HotSpot(TM) 64-Bit Server VM warning: Option UseConcMarkSweepGC was deprecated in version 9.0 and will likely be removed in a future release.
   [junit4] <<< JVM J2: EOF ----

[...truncated 207 lines...]
   [junit4] JVM J1: stderr was not empty, see: /home/jenkins/workspace/Lucene-Solr-7.x-Linux/lucene/build/replicator/test/temp/junit4-J1-20180205_000649_66910329534336698520777.syserr
   [junit4] >>> JVM J1 emitted unexpected output (verbatim) ----
   [junit4] Java HotSpot(TM) 64-Bit Server VM warning: Option UseConcMarkSweepGC was deprecated in version 9.0 and will likely be removed in a future release.
   [junit4] <<< JVM J1: EOF ----

[...truncated 3 lines...]
   [junit4] JVM J2: stderr was not empty, see: /home/jenkins/workspace/Lucene-Solr-7.x-Linux/lucene/build/replicator/test/temp/junit4-J2-20180205_000649_6697326274469427897897.syserr
   [junit4] >>> JVM J2 emitted unexpected output (verbatim) ----
   [junit4] Java HotSpot(TM) 64-Bit Server VM warning: Option UseConcMarkSweepGC was deprecated in version 9.0 and will likely be removed in a future release.
   [junit4] <<< JVM J2: EOF ----

[...truncated 3 lines...]
   [junit4] JVM J0: stderr was not empty, see: /home/jenkins/workspace/Lucene-Solr-7.x-Linux/lucene/build/replicator/test/temp/junit4-J0-20180205_000649_6693532535349277257146.syserr
   [junit4] >>> JVM J0 emitted unexpected output (verbatim) ----
   [junit4] Java HotSpot(TM) 64-Bit Server VM warning: Option UseConcMarkSweepGC was deprecated in version 9.0 and will likely be removed in a future release.
   [junit4] <<< JVM J0: EOF ----

[...truncated 216 lines...]
   [junit4] JVM J2: stderr was not empty, see: /home/jenkins/workspace/Lucene-Solr-7.x-Linux/lucene/build/sandbox/test/temp/junit4-J2-20180205_000702_5195710279418619875953.syserr
   [junit4] >>> JVM J2 emitted unexpected output (verbatim) ----
   [junit4] Java HotSpot(TM) 64-Bit Server VM warning: Option UseConcMarkSweepGC was deprecated in version 9.0 and will likely be removed in a future release.
   [junit4] <<< JVM J2: EOF ----

[...truncated 3 lines...]
   [junit4] JVM J0: stderr was not empty, see: /home/jenkins/workspace/Lucene-Solr-7.x-Linux/lucene/build/sandbox/test/temp/junit4-J0-20180205_000702_51910151243847994820586.syserr
   [junit4] >>> JVM J0 emitted unexpected output (verbatim) ----
   [junit4] Java HotSpot(TM) 64-Bit Server VM warning: Option UseConcMarkSweepGC was deprecated in version 9.0 and will likely be removed in a future release.
   [junit4] <<< JVM J0: EOF ----

[...truncated 7 lines...]
   [junit4] JVM J1: stderr was not empty, see: /home/jenkins/workspace/Lucene-Solr-7.x-Linux/lucene/build/sandbox/test/temp/junit4-J1-20180205_000702_5192047654435758123851.syserr
   [junit4] >>> JVM J1 emitted unexpected output (verbatim) ----
   [junit4] Java HotSpot(TM) 64-Bit Server VM warning: Option UseConcMarkSweepGC was deprecated in version 9.0 and will likely be removed in a future release.
   [junit4] <<< JVM J1: EOF ----

[...truncated 320 lines...]
   [junit4] JVM J2: stderr was not empty, see: /home/jenkins/workspace/Lucene-Solr-7.x-Linux/lucene/build/spatial-extras/test/temp/junit4-J2-20180205_000745_94914055344913863822353.syserr
   [junit4] >>> JVM J2 emitted unexpected output (verbatim) ----
   [junit4] Java HotSpot(TM) 64-Bit Server VM warning: Option UseConcMarkSweepGC was deprecated in version 9.0 and will likely be removed in a future release.
   [junit4] <<< JVM J2: EOF ----

   [junit4] JVM J0: stderr was not empty, see: /home/jenkins/workspace/Lucene-Solr-7.x-Linux/lucene/build/spatial-extras/test/temp/junit4-J0-20180205_000745_9498446219243061738523.syserr
   [junit4] >>> JVM J0 emitted unexpected output (verbatim) ----
   [junit4] Java HotSpot(TM) 64-Bit Server VM warning: Option UseConcMarkSweepGC was deprecated in version 9.0 and will likely be removed in a future release.
   [junit4] <<< JVM J0: EOF ----

[...truncated 3 lines...]
   [junit4] JVM J1: stderr was not empty, see: /home/jenkins/workspace/Lucene-Solr-7.x-Linux/lucene/build/spatial-extras/test/temp/junit4-J1-20180205_000745_9496448382864168361909.syserr
   [junit4] >>> JVM J1 emitted unexpected output (verbatim) ----
   [junit4] Java HotSpot(TM) 64-Bit Server VM warning: Option UseConcMarkSweepGC was deprecated in version 9.0 and will likely be removed in a future release.
   [junit4] <<< JVM J1: EOF ----

[...truncated 148 lines...]
   [junit4] JVM J0: stderr was not empty, see: /home/jenkins/workspace/Lucene-Solr-7.x-Linux/lucene/build/spatial/test/temp/junit4-J0-20180205_000800_4734475708566076414980.syserr
   [junit4] >>> JVM J0 emitted unexpected output (verbatim) ----
   [junit4] Java HotSpot(TM) 64-Bit Server VM warning: Option UseConcMarkSweepGC was deprecated in version 9.0 and will likely be removed in a future release.
   [junit4] <<< JVM J0: EOF ----

[...truncated 175 lines...]
   [junit4] JVM J0: stderr was not empty, see: /home/jenkins/workspace/Lucene-Solr-7.x-Linux/lucene/build/spatial3d/test/temp/junit4-J0-20180205_000802_3866568133402930682793.syserr
   [junit4] >>> JVM J0 emitted unexpected output (verbatim) ----
   [junit4] Java HotSpot(TM) 64-Bit Server VM warning: Option UseConcMarkSweepGC was deprecated in version 9.0 and will likely be removed in a future release.
   [junit4] <<< JVM J0: EOF ----

[...truncated 6 lines...]
   [junit4] JVM J1: stderr was not empty, see: /home/jenkins/workspace/Lucene-Solr-7.x-Linux/lucene/build/spatial3d/test/temp/junit4-J1-20180205_000802_3869900590065156960025.syserr
   [junit4] >>> JVM J1 emitted unexpected output (verbatim) ----
   [junit4] Java HotSpot(TM) 64-Bit Server VM warning: Option UseConcMarkSweepGC was deprecated in version 9.0 and will likely be removed in a future release.
   [junit4] <<< JVM J1: EOF ----

[...truncated 5 lines...]
   [junit4] JVM J2: stderr was not empty, see: /home/jenkins/workspace/Lucene-Solr-7.x-Linux/lucene/build/spatial3d/test/temp/junit4-J2-20180205_000802_3867794091161954672192.syserr
   [junit4] >>> JVM J2 emitted unexpected output (verbatim) ----
   [junit4] Java HotSpot(TM) 64-Bit Server VM warning: Option UseConcMarkSweepGC was deprecated in version 9.0 and will likely be removed in a future release.
   [junit4] <<< JVM J2: EOF ----

[...truncated 253 lines...]
   [junit4] JVM J1: stderr was not empty, see: /home/jenkins/workspace/Lucene-Solr-7.x-Linux/lucene/build/suggest/test/temp/junit4-J1-20180205_000857_1791534356979746400463.syserr
   [junit4] >>> JVM J1 emitted unexpected output (verbatim) ----
   [junit4] Java HotSpot(TM) 64-Bit Server VM warning: Option UseConcMarkSweepGC was deprecated in version 9.0 and will likely be removed in a future release.
   [junit4] <<< JVM J1: EOF ----

   [junit4] JVM J0: stderr was not empty, see: /home/jenkins/workspace/Lucene-Solr-7.x-Linux/lucene/build/suggest/test/temp/junit4-J0-20180205_000857_17915557596036259046921.syserr
   [junit4] >>> JVM J0 emitted unexpected output (verbatim) ----
   [junit4] Java HotSpot(TM) 64-Bit Server VM warning: Option UseConcMarkSweepGC was deprecated in version 9.0 and will likely be removed in a future release.
   [junit4] <<< JVM J0: EOF ----

[...truncated 3 lines...]
   [junit4] JVM J2: stderr was not empty, see: /home/jenkins/workspace/Lucene-Solr-7.x-Linux/lucene/build/suggest/test/temp/junit4-J2-20180205_000857_17913512285711528955073.syserr
   [junit4] >>> JVM J2 emitted unexpected output (verbatim) ----
   [junit4] Java HotSpot(TM) 64-Bit Server VM warning: Option UseConcMarkSweepGC was deprecated in version 9.0 and will likely be removed in a future release.
   [junit4] <<< JVM J2: EOF ----

[...truncated 1901 lines...]
   [junit4] Suite: org.apache.solr.cloud.autoscaling.ComputePlanActionTest
   [junit4]   2> 356208 INFO  (SUITE-ComputePlanActionTest-seed#[90ABBFB1936023C8]-worker) [    ] o.a.s.SolrTestCaseJ4 SecureRandom sanity checks: test.solr.allowed.securerandom=null & java.security.egd=file:/dev/./urandom
   [junit4]   2> Creating dataDir: /home/jenkins/workspace/Lucene-Solr-7.x-Linux/solr/build/solr-core/test/J0/temp/solr.cloud.autoscaling.ComputePlanActionTest_90ABBFB1936023C8-001/init-core-data-001
   [junit4]   2> 356209 WARN  (SUITE-ComputePlanActionTest-seed#[90ABBFB1936023C8]-worker) [    ] o.a.s.SolrTestCaseJ4 startTrackingSearchers: numOpens=32 numCloses=32
   [junit4]   2> 356209 INFO  (SUITE-ComputePlanActionTest-seed#[90ABBFB1936023C8]-worker) [    ] o.a.s.SolrTestCaseJ4 Using PointFields (NUMERIC_POINTS_SYSPROP=true) w/NUMERIC_DOCVALUES_SYSPROP=false
   [junit4]   2> 356210 INFO  (SUITE-ComputePlanActionTest-seed#[90ABBFB1936023C8]-worker) [    ] o.a.s.SolrTestCaseJ4 Randomized ssl (false) and clientAuth (false) via: @org.apache.solr.util.RandomizeSSL(reason="", value=0.0/0.0, ssl=0.0/0.0, clientAuth=0.0/0.0)
   [junit4]   2> 356210 INFO  (SUITE-ComputePlanActionTest-seed#[90ABBFB1936023C8]-worker) [    ] o.a.s.c.MiniSolrCloudCluster Starting cluster of 1 servers in /home/jenkins/workspace/Lucene-Solr-7.x-Linux/solr/build/solr-core/test/J0/temp/solr.cloud.autoscaling.ComputePlanActionTest_90ABBFB1936023C8-001/tempDir-001
   [junit4]   2> 356210 INFO  (SUITE-ComputePlanActionTest-seed#[90ABBFB1936023C8]-worker) [    ] o.a.s.c.ZkTestServer STARTING ZK TEST SERVER
   [junit4]   2> 356210 INFO  (Thread-393) [    ] o.a.s.c.ZkTestServer client port:0.0.0.0/0.0.0.0:0
   [junit4]   2> 356210 INFO  (Thread-393) [    ] o.a.s.c.ZkTestServer Starting server
   [junit4]   2> 356211 ERROR (Thread-393) [    ] o.a.z.s.ZooKeeperServer ZKShutdownHandler is not registered, so ZooKeeper server won't take any action on ERROR or SHUTDOWN server state changes
   [junit4]   2> 356310 INFO  (SUITE-ComputePlanActionTest-seed#[90ABBFB1936023C8]-worker) [    ] o.a.s.c.ZkTestServer start zk server on port:38923
   [junit4]   2> 356312 INFO  (zkConnectionManagerCallback-445-thread-1) [    ] o.a.s.c.c.ConnectionManager zkClient has connected
   [junit4]   2> 356314 INFO  (jetty-launcher-442-thread-1) [    ] o.e.j.s.Server jetty-9.4.8.v20171121, build timestamp: 2017-11-22T01:27:37+04:00, git hash: 82b8fb23f757335bb3329d540ce37a2a2615f0a8
   [junit4]   2> 356315 INFO  (jetty-launcher-442-thread-1) [    ] o.e.j.s.session DefaultSessionIdManager workerName=node0
   [junit4]   2> 356315 INFO  (jetty-launcher-442-thread-1) [    ] o.e.j.s.session No SessionScavenger set, using defaults
   [junit4]   2> 356315 INFO  (jetty-launcher-442-thread-1) [    ] o.e.j.s.session Scavenging every 660000ms
   [junit4]   2> 356315 INFO  (jetty-launcher-442-thread-1) [    ] o.e.j.s.h.ContextHandler Started o.e.j.s.ServletContextHandler@707c1cdb{/solr,null,AVAILABLE}
   [junit4]   2> 356317 INFO  (jetty-launcher-442-thread-1) [    ] o.e.j.s.AbstractConnector Started ServerConnector@29a2d231{HTTP/1.1,[http/1.1]}{127.0.0.1:44015}
   [junit4]   2> 356317 INFO  (jetty-launcher-442-thread-1) [    ] o.e.j.s.Server Started @358023ms
   [junit4]   2> 356317 INFO  (jetty-launcher-442-thread-1) [    ] o.a.s.c.s.e.JettySolrRunner Jetty properties: {hostContext=/solr, hostPort=44015}
   [junit4]   2> 356317 ERROR (jetty-launcher-442-thread-1) [    ] o.a.s.u.StartupLoggingUtils Missing Java Option solr.log.dir. Logging may be missing or incomplete.
   [junit4]   2> 356317 INFO  (jetty-launcher-442-thread-1) [    ] o.a.s.s.SolrDispatchFilter  ___      _       Welcome to Apache Solr? version 7.3.0
   [junit4]   2> 356317 INFO  (jetty-launcher-442-thread-1) [    ] o.a.s.s.SolrDispatchFilter / __| ___| |_ _   Starting in cloud mode on port null
   [junit4]   2> 356317 INFO  (jetty-launcher-442-thread-1) [    ] o.a.s.s.SolrDispatchFilter \__ \/ _ \ | '_|  Install dir: null
   [junit4]   2> 356317 INFO  (jetty-launcher-442-thread-1) [    ] o.a.s.s.SolrDispatchFilter |___/\___/_|_|    Start time: 2018-02-05T00:15:44.714873Z
   [junit4]   2> 356324 INFO  (zkConnectionManagerCallback-447-thread-1) [    ] o.a.s.c.c.ConnectionManager zkClient has connected
   [junit4]   2> 356324 INFO  (jetty-launcher-442-thread-1) [    ] o.a.s.s.SolrDispatchFilter solr.xml found in ZooKeeper. Loading...
   [junit4]   2> 356330 INFO  (jetty-launcher-442-thread-1) [    ] o.a.s.c.ZkContainer Zookeeper client=127.0.0.1:38923/solr
   [junit4]   2> 356331 INFO  (zkConnectionManagerCallback-451-thread-1) [    ] o.a.s.c.c.ConnectionManager zkClient has connected
   [junit4]   2> 356333 INFO  (zkConnectionManagerCallback-453-thread-1-processing-n:127.0.0.1:44015_solr) [n:127.0.0.1:44015_solr    ] o.a.s.c.c.ConnectionManager zkClient has connected
   [junit4]   2> 356367 INFO  (jetty-launcher-442-thread-1) [n:127.0.0.1:44015_solr    ] o.a.s.c.Overseer Overseer (id=null) closing
   [junit4]   2> 356367 INFO  (jetty-launcher-442-thread-1) [n:127.0.0.1:44015_solr    ] o.a.s.c.OverseerElectionContext I am going to be the leader 127.0.0.1:44015_solr
   [junit4]   2> 356367 INFO  (jetty-launcher-442-thread-1) [n:127.0.0.1:44015_solr    ] o.a.s.c.Overseer Overseer (id=72093829223022595-127.0.0.1:44015_solr-n_0000000000) starting
   [junit4]   2> 356370 DEBUG (OverseerStateUpdate-72093829223022595-127.0.0.1:44015_solr-n_0000000000) [n:127.0.0.1:44015_solr    ] o.a.s.c.Overseer Starting to work on the main queue
   [junit4]   2> 356370 INFO  (jetty-launcher-442-thread-1) [n:127.0.0.1:44015_solr    ] o.a.s.c.ZkController Register node as live in ZooKeeper:/live_nodes/127.0.0.1:44015_solr
   [junit4]   2> 356370 DEBUG (OverseerAutoScalingTriggerThread-72093829223022595-127.0.0.1:44015_solr-n_0000000000) [n:127.0.0.1:44015_solr    ] o.a.s.c.a.OverseerTriggerThread Adding .autoAddReplicas trigger
   [junit4]   2> 356373 INFO  (zkCallback-452-thread-1-processing-n:127.0.0.1:44015_solr) [n:127.0.0.1:44015_solr    ] o.a.s.c.c.ZkStateReader Updated live nodes from ZooKeeper... (0) -> (1)
   [junit4]   2> 356373 DEBUG (OverseerAutoScalingTriggerThread-72093829223022595-127.0.0.1:44015_solr-n_0000000000) [n:127.0.0.1:44015_solr    ] o.a.s.c.a.OverseerTriggerThread Refreshing /autoscaling.json with znode version 1
   [junit4]   2> 356374 DEBUG (OverseerAutoScalingTriggerThread-72093829223022595-127.0.0.1:44015_solr-n_0000000000) [n:127.0.0.1:44015_solr    ] o.a.s.c.a.NodeLostTrigger Initial livenodes: [127.0.0.1:44015_solr]
   [junit4]   2> 356374 DEBUG (OverseerAutoScalingTriggerThread-72093829223022595-127.0.0.1:44015_solr-n_0000000000) [n:127.0.0.1:44015_solr    ] o.a.s.c.a.OverseerTriggerThread Current znodeVersion 1, lastZnodeVersion -1
   [junit4]   2> 356374 DEBUG (OverseerAutoScalingTriggerThread-72093829223022595-127.0.0.1:44015_solr-n_0000000000) [n:127.0.0.1:44015_solr    ] o.a.s.c.a.OverseerTriggerThread Processed trigger updates upto znodeVersion 1
   [junit4]   2> 356374 DEBUG (OverseerAutoScalingTriggerThread-72093829223022595-127.0.0.1:44015_solr-n_0000000000) [n:127.0.0.1:44015_solr    ] o.a.s.c.a.OverseerTriggerThread -- clean old nodeAdded markers
   [junit4]   2> 356374 DEBUG (OverseerAutoScalingTriggerThread-72093829223022595-127.0.0.1:44015_solr-n_0000000000) [n:127.0.0.1:44015_solr    ] o.a.s.c.a.OverseerTriggerThread Current znodeVersion 1, lastZnodeVersion 1
   [junit4]   2> 356375 DEBUG (ScheduledTrigger-979-thread-1) [n:127.0.0.1:44015_solr    ] o.a.s.c.a.NodeLostTrigger Running NodeLostTrigger: .auto_add_replicas with currently live nodes: 1
   [junit4]   2> 356411 INFO  (jetty-launcher-442-thread-1) [n:127.0.0.1:44015_solr    ] o.a.s.m.r.SolrJmxReporter JMX monitoring for 'solr_44015.solr.node' (registry 'solr.node') enabled at server: com.sun.jmx.mbeanserver.JmxMBeanServer@6a599d0d
   [junit4]   2> 356416 INFO  (jetty-launcher-442-thread-1) [n:127.0.0.1:44015_solr    ] o.a.s.m.r.SolrJmxReporter JMX monitoring for 'solr_44015.solr.jvm' (registry 'solr.jvm') enabled at server: com.sun.jmx.mbeanserver.JmxMBeanServer@6a599d0d
   [junit4]   2> 356416 INFO  (jetty-launcher-442-thread-1) [n:127.0.0.1:44015_solr    ] o.a.s.m.r.SolrJmxReporter JMX monitoring for 'solr_44015.solr.jetty' (registry 'solr.jetty') enabled at server: com.sun.jmx.mbeanserver.JmxMBeanServer@6a599d0d
   [junit4]   2> 356417 INFO  (jetty-launcher-442-thread-1) [n:127.0.0.1:44015_solr    ] o.a.s.c.CorePropertiesLocator Found 0 core definitions underneath /home/jenkins/workspace/Lucene-Solr-7.x-Linux/solr/build/solr-core/test/J0/temp/solr.cloud.autoscaling.ComputePlanActionTest_90ABBFB1936023C8-001/tempDir-001/node1/.
   [junit4]   2> 356429 INFO  (zkConnectionManagerCallback-457-thread-1) [    ] o.a.s.c.c.ConnectionManager zkClient has connected
   [junit4]   2> 356435 INFO  (zkConnectionManagerCallback-461-thread-1) [    ] o.a.s.c.c.ConnectionManager zkClient has connected
   [junit4]   2> 356436 INFO  (SUITE-ComputePlanActionTest-seed#[90ABBFB1936023C8]-worker) [    ] o.a.s.c.c.ZkStateReader Updated live nodes from ZooKeeper... (0) -> (1)
   [junit4]   2> 356436 INFO  (SUITE-ComputePlanActionTest-seed#[90ABBFB1936023C8]-worker) [    ] o.a.s.c.s.i.ZkClientClusterStateProvider Cluster at 127.0.0.1:38923/solr ready
   [junit4]   2> 356442 INFO  (TEST-ComputePlanActionTest.testSelectedCollections-seed#[90ABBFB1936023C8]) [    ] o.a.s.SolrTestCaseJ4 ###Starting testSelectedCollections
   [junit4]   2> 356442 DEBUG (zkCallback-452-thread-1-processing-n:127.0.0.1:44015_solr) [n:127.0.0.1:44015_solr    ] o.a.s.c.a.OverseerTriggerThread Refreshing /autoscaling.json with znode version 2
   [junit4]   2> 356442 DEBUG (OverseerAutoScalingTriggerThread-72093829223022595-127.0.0.1:44015_solr-n_0000000000) [n:127.0.0.1:44015_solr    ] o.a.s.c.a.OverseerTriggerThread Processed trigger updates upto znodeVersion 2
   [junit4]   2> 356444 INFO  (TEST-ComputePlanActionTest.testSelectedCollections-seed#[90ABBFB1936023C8]) [    ] o.a.s.c.c.ZkStateReader Updated live nodes from ZooKeeper... (0) -> (1)
   [junit4]   2> 356448 DEBUG (OverseerAutoScalingTriggerThread-72093829223022595-127.0.0.1:44015_solr-n_0000000000) [n:127.0.0.1:44015_solr    ] o.a.s.c.a.OverseerTriggerThread -- clean old nodeLost markers
   [junit4]   2> 356448 DEBUG (OverseerAutoScalingTriggerThread-72093829223022595-127.0.0.1:44015_solr-n_0000000000) [n:127.0.0.1:44015_solr    ] o.a.s.c.a.OverseerTriggerThread -- clean old nodeAdded markers
   [junit4]   2> 356448 DEBUG (OverseerAutoScalingTriggerThread-72093829223022595-127.0.0.1:44015_solr-n_0000000000) [n:127.0.0.1:44015_solr    ] o.a.s.c.a.OverseerTriggerThread Current znodeVersion 2, lastZnodeVersion 2
   [junit4]   2> 356456 INFO  (qtp156940769-2143) [n:127.0.0.1:44015_solr    ] o.a.s.s.HttpSolrCall [admin] webapp=null path=/admin/metrics params={prefix=CONTAINER.fs.usableSpace,CORE.coreName&wt=javabin&version=2&group=solr.node,solr.core} status=0 QTime=0
   [junit4]   2> 356457 DEBUG (qtp156940769-2137) [n:127.0.0.1:44015_solr    ] o.a.s.c.a.AutoScalingHandler Verified autoscaling configuration
   [junit4]   2> 356458 INFO  (qtp156940769-2137) [n:127.0.0.1:44015_solr    ] o.a.s.s.HttpSolrCall [admin] webapp=null path=/admin/autoscaling params={wt=javabin&version=2} status=0 QTime=11
   [junit4]   2> 356458 DEBUG (zkCallback-452-thread-1-processing-n:127.0.0.1:44015_solr) [n:127.0.0.1:44015_solr    ] o.a.s.c.a.OverseerTriggerThread Refreshing /autoscaling.json with znode version 3
   [junit4]   2> 356458 DEBUG (OverseerAutoScalingTriggerThread-72093829223022595-127.0.0.1:44015_solr-n_0000000000) [n:127.0.0.1:44015_solr    ] o.a.s.c.a.OverseerTriggerThread Processed trigger updates upto znodeVersion 3
   [junit4]   2> 356458 DEBUG (OverseerAutoScalingTriggerThread-72093829223022595-127.0.0.1:44015_solr-n_0000000000) [n:127.0.0.1:44015_solr    ] o.a.s.c.a.OverseerTriggerThread -- clean old nodeLost markers
   [junit4]   2> 356459 DEBUG (OverseerAutoScalingTriggerThread-72093829223022595-127.0.0.1:44015_solr-n_0000000000) [n:127.0.0.1:44015_solr    ] o.a.s.c.a.OverseerTriggerThread -- clean old nodeAdded markers
   [junit4]   2> 356459 DEBUG (OverseerAutoScalingTriggerThread-72093829223022595-127.0.0.1:44015_solr-n_0000000000) [n:127.0.0.1:44015_solr    ] o.a.s.c.a.OverseerTriggerThread Current znodeVersion 3, lastZnodeVersion 3
   [junit4]   2> 356462 INFO  (qtp156940769-2142) [n:127.0.0.1:44015_solr    ] o.a.s.s.HttpSolrCall [admin] webapp=null path=/admin/metrics params={prefix=CONTAINER.fs.usableSpace,CORE.coreName&wt=javabin&version=2&group=solr.node,solr.core} status=0 QTime=0
   [junit4]   2> 356462 DEBUG (qtp156940769-2141) [n:127.0.0.1:44015_solr    ] o.a.s.c.a.AutoScalingHandler Verified autoscaling configuration
   [junit4]   2> 356463 INFO  (qtp156940769-2141) [n:127.0.0.1:44015_solr    ] o.a.s.s.HttpSolrCall [admin] webapp=null path=/admin/autoscaling params={wt=javabin&version=2} status=0 QTime=4
   [junit4]   2> 356463 DEBUG (zkCallback-452-thread-1-processing-n:127.0.0.1:44015_solr) [n:127.0.0.1:44015_solr    ] o.a.s.c.a.OverseerTriggerThread Refreshing /autoscaling.json with znode version 4
   [junit4]   2> 356463 DEBUG (OverseerAutoScalingTriggerThread-72093829223022595-127.0.0.1:44015_solr-n_0000000000) [n:127.0.0.1:44015_solr    ] o.a.s.c.a.OverseerTriggerThread Processed trigger updates upto znodeVersion 4
   [junit4]   2> 356463 DEBUG (OverseerAutoScalingTriggerThread-72093829223022595-127.0.0.1:44015_solr-n_0000000000) [n:127.0.0.1:44015_solr    ] o.a.s.c.a.OverseerTriggerThread -- clean old nodeLost markers
   [junit4]   2> 356463 DEBUG (OverseerAutoScalingTriggerThread-72093829223022595-127.0.0.1:44015_solr-n_0000000000) [n:127.0.0.1:44015_solr    ] o.a.s.c.a.OverseerTriggerThread -- clean old nodeAdded markers
   [junit4]   2> 356463 DEBUG (OverseerAutoScalingTriggerThread-72093829223022595-127.0.0.1:44015_solr-n_0000000000) [n:127.0.0.1:44015_solr    ] o.a.s.c.a.OverseerTriggerThread Current znodeVersion 4, lastZnodeVersion 4
   [junit4]   2> 356464 INFO  (TEST-ComputePlanActionTest.testSelectedCollections-seed#[90ABBFB1936023C8]) [    ] o.e.j.s.Server jetty-9.4.8.v20171121, build timestamp: 2017-11-22T01:27:37+04:00, git hash: 82b8fb23f757335bb3329d540ce37a2a2615f0a8
   [junit4]   2> 356464 INFO  (TEST-ComputePlanActionTest.testSelectedCollections-seed#[90ABBFB1936023C8]) [    ] o.e.j.s.session DefaultSessionIdManager workerName=node0
   [junit4]   2> 356464 INFO  (TEST-ComputePlanActionTest.testSelectedCollections-seed#[90ABBFB1936023C8]) [    ] o.e.j.s.session No SessionScavenger set, using defaults
   [junit4]   2> 356464 INFO  (TEST-ComputePlanActionTest.testSelectedCollections-seed#[90ABBFB1936023C8]) [    ] o.e.j.s.session Scavenging every 600000ms
   [junit4]   2> 356465 INFO  (TEST-ComputePlanActionTest.testSelectedCollections-seed#[90ABBFB1936023C8]) [    ] o.e.j.s.h.ContextHandler Started o.e.j.s.ServletContextHandler@7a6af1a{/solr,null,AVAILABLE}
   [junit4]   2> 356465 INFO  (TEST-ComputePlanActionTest.testSelectedCollections-seed#[90ABBFB1936023C8]) [    ] o.e.j.s.AbstractConnector Started ServerConnector@42f37a75{HTTP/1.1,[http/1.1]}{127.0.0.1:38521}
   [junit4]   2> 356465 INFO  (TEST-ComputePlanActionTest.testSelectedCollections-seed#[90ABBFB1936023C8]) [    ] o.e.j.s.Server Started @358171ms
   [junit4]   2> 356465 INFO  (TEST-ComputePlanActionTest.testSelectedCollections-seed#[90ABBFB1936023C8]) [    ] o.a.s.c.s.e.JettySolrRunner Jetty properties: {hostContext=/solr, hostPort=38521}
   [junit4]   2> 356465 ERROR (TEST-ComputePlanActionTest.testSelectedCollections-seed#[90ABBFB1936023C8]) [    ] o.a.s.u.StartupLoggingUtils Missing Java Option solr.log.dir. Logging may be missing or incomplete.
   [junit4]   2> 356466 INFO  (TEST-ComputePlanActionTest.testSelectedCollections-seed#[90ABBFB1936023C8]) [    ] o.a.s.s.SolrDispatchFilter  ___      _       Welcome to Apache Solr? version 7.3.0
   [junit4]   2> 356466 INFO  (TEST-ComputePlanActionTest.testSelectedCollections-seed#[90ABBFB1936023C8]) [    ] o.a.s.s.SolrDispatchFilter / __| ___| |_ _   Starting in cloud mode on port null
   [junit4]   2> 356466 INFO  (TEST-ComputePlanActionTest.testSelectedCollections-seed#[90ABBFB1936023C8]) [    ] o.a.s.s.SolrDispatchFilter \__ \/ _ \ | '_|  Install dir: null
   [junit4]   2> 356466 INFO  (TEST-ComputePlanActionTest.testSelectedCollections-seed#[90ABBFB1936023C8]) [    ] o.a.s.s.SolrDispatchFilter |___/\___/_|_|    Start time: 2018-02-05T00:15:44.863144Z
   [junit4]   2> 356473 INFO  (zkConnectionManagerCallback-464-thread-1) [    ] o.a.s.c.c.ConnectionManager zkClient has connected
   [junit4]   2> 356474 INFO  (TEST-ComputePlanActionTest.testSelectedCollections-seed#[90ABBFB1936023C8]) [    ] o.a.s.s.SolrDispatchFilter solr.xml found in ZooKeeper. Loading...
   [junit4]   2> 356479 INFO  (TEST-ComputePlanActionTest.testSelectedCollections-seed#[90ABBFB1936023C8]) [    ] o.a.s.c.ZkContainer Zookeeper client=127.0.0.1:38923/solr
   [junit4]   2> 356480 INFO  (zkConnectionManagerCallback-468-thread-1) [    ] o.a.s.c.c.ConnectionManager zkClient has connected
   [junit4]   2> 356483 INFO  (zkConnectionManagerCallback-470-thread-1-processing-n:127.0.0.1:38521_solr) [n:127.0.0.1:38521_solr    ] o.a.s.c.c.ConnectionManager zkClient has connected
   [junit4]   2> 356485 INFO  (TEST-ComputePlanActionTest.testSelectedCollections-seed#[90ABBFB1936023C8]) [n:127.0.0.1:38521_solr    ] o.a.s.c.c.ZkStateReader Updated live nodes from ZooKeeper... (0) -> (1)
   [junit4]   2> 356486 INFO  (TEST-ComputePlanActionTest.testSelectedCollections-seed#[90ABBFB1936023C8]) [n:127.0.0.1:38521_solr    ] o.a.s.c.Overseer Overseer (id=null) closing
   [junit4]   2> 356486 INFO  (TEST-ComputePlanActionTest.testSelectedCollections-seed#[90ABBFB1936023C8]) [n:127.0.0.1:38521_solr    ] o.a.s.c.ZkController Register node as live in ZooKeeper:/live_nodes/127.0.0.1:38521_solr
   [junit4]   2> 356487 DEBUG (OverseerStateUpdate-72093829223022595-127.0.0.1:44015_solr-n_0000000000) [n:127.0.0.1:44015_solr    ] o.a.s.c.Overseer processMessage: queueSize: 1, message = {
   [junit4]   2>   "operation":"downnode",
   [junit4]   2>   "node_name":"127.0.0.1:38521_solr"} current state version: 0
   [junit4]   2> 356487 DEBUG (OverseerStateUpdate-72093829223022595-127.0.0.1:44015_solr-n_0000000000) [n:127.0.0.1:44015_solr    ] o.a.s.c.o.NodeMutator DownNode state invoked for node: 127.0.0.1:38521_solr
   [junit4]   2> 356487 INFO  (zkCallback-452-thread-1-processing-n:127.0.0.1:44015_solr) [n:127.0.0.1:44015_solr    ] o.a.s.c.c.ZkStateReader Updated live nodes from ZooKeeper... (1) -> (2)
   [junit4]   2> 356495 INFO  (zkCallback-469-thread-1-processing-n:127.0.0.1:38521_solr) [n:127.0.0.1:38521_solr    ] o.a.s.c.c.ZkStateReader Updated live nodes from ZooKeeper... (1) -> (2)
   [junit4]   2> 356496 INFO  (zkCallback-460-thread-1) [    ] o.a.s.c.c.ZkStateReader Updated live nodes from ZooKeeper... (1) -> (2)
   [junit4]   2> 356496 INFO  (zkCallback-460-thread-2) [    ] o.a.s.c.c.ZkStateReader Updated live nodes from ZooKeeper... (1) -> (2)
   [junit4]   2> 356528 INFO  (TEST-ComputePlanActionTest.testSelectedCollections-seed#[90ABBFB1936023C8]) [n:127.0.0.1:38521_solr    ] o.a.s.m.r.SolrJmxReporter JMX monitoring for 'solr_38521.solr.node' (registry 'solr.node') enabled at server: com.sun.jmx.mbeanserver.JmxMBeanServer@6a599d0d
   [junit4]   2> 356534 INFO  (TEST-ComputePlanActionTest.testSelectedCollections-seed#[90ABBFB1936023C8]) [n:127.0.0.1:38521_solr    ] o.a.s.m.r.SolrJmxReporter JMX monitoring for 'solr_38521.solr.jvm' (registry 'solr.jvm') enabled at server: com.sun.jmx.mbeanserver.JmxMBeanServer@6a599d0d
   [junit4]   2> 356534 INFO  (TEST-ComputePlanActionTest.testSelectedCollections-seed#[90ABBFB1936023C8]) [n:127.0.0.1:38521_solr    ] o.a.s.m.r.SolrJmxReporter JMX monitoring for 'solr_38521.solr.jetty' (registry 'solr.jetty') enabled at server: com.sun.jmx.mbeanserver.JmxMBeanServer@6a599d0d
   [junit4]   2> 356535 INFO  (TEST-ComputePlanActionTest.testSelectedCollections-seed#[90ABBFB1936023C8]) [n:127.0.0.1:38521_solr    ] o.a.s.c.CorePropertiesLocator Found 0 core definitions underneath /home/jenkins/workspace/Lucene-Solr-7.x-Linux/solr/build/solr-core/test/J0/temp/solr.cloud.autoscaling.ComputePlanActionTest_90ABBFB1936023C8-001/tempDir-001/node2/.
   [junit4]   2> 356551 INFO  (TEST-ComputePlanActionTest.testSelectedCollections-seed#[90ABBFB1936023C8]) [    ] o.e.j.s.Server jetty-9.4.8.v20171121, build timestamp: 2017-11-22T01:27:37+04:00, git hash: 82b8fb23f757335bb3329d540ce37a2a2615f0a8
   [junit4]   2> 356551 INFO  (TEST-ComputePlanActionTest.testSelectedCollections-seed#[90ABBFB1936023C8]) [    ] o.e.j.s.session DefaultSessionIdManager workerName=node0
   [junit4]   2> 356551 INFO  (TEST-ComputePlanActionTest.testSelectedCollections-seed#[90ABBFB1936023C8]) [    ] o.e.j.s.session No SessionScavenger set, using defaults
   [junit4]   2> 356551 INFO  (TEST-ComputePlanActionTest.testSelectedCollections-seed#[90ABBFB1936023C8]) [    ] o.e.j.s.session Scavenging every 660000ms
   [junit4]   2> 356551 INFO  (TEST-ComputePlanActionTest.testSelectedCollections-seed#[90ABBFB1936023C8]) [    ] o.e.j.s.h.ContextHandler Started o.e.j.s.ServletContextHandler@55d76c56{/solr,null,AVAILABLE}
   [junit4]   2> 356552 INFO  (TEST-ComputePlanActionTest.testSelectedCollections-seed#[90ABBFB1936023C8]) [    ] o.e.j.s.AbstractConnector Started ServerConnector@6432d055{HTTP/1.1,[http/1.1]}{127.0.0.1:41669}
   [junit4]   2> 356552 INFO  (TEST-ComputePlanActionTest.testSelectedCollections-seed#[90ABBFB1936023C8]) [    ] o.e.j.s.Server Started @358257ms
   [junit4]   2> 356552 INFO  (TEST-ComputePlanActionTest.testSelectedCollections-seed#[90ABBFB1936023C8]) [    ] o.a.s.c.s.e.JettySolrRunner Jetty properties: {hostContext=/solr, hostPort=41669}
   [junit4]   2> 356552 ERROR (TEST-ComputePlanActionTest.testSelectedCollections-seed#[90ABBFB1936023C8]) [    ] o.a.s.u.StartupLoggingUtils Missing Java Option solr.log.dir. Logging may be missing or incomplete.
   [junit4]   2> 356552 INFO  (TEST-ComputePlanActionTest.testSelectedCollections-seed#[90ABBFB1936023C8]) [    ] o.a.s.s.SolrDispatchFilter  ___      _       Welcome to Apache Solr? version 7.3.0
   [junit4]   2> 356552 INFO  (TEST-ComputePlanActionTest.testSelectedCollections-seed#[90ABBFB1936023C8]) [    ] o.a.s.s.SolrDispatchFilter / __| ___| |_ _   Starting in cloud mode on port null
   [junit4]   2> 356552 INFO  (TEST-ComputePlanActionTest.testSelectedCollections-seed#[90ABBFB1936023C8]) [    ] o.a.s.s.SolrDispatchFilter \__ \/ _ \ | '_|  Install dir: null
   [junit4]   2> 356552 INFO  (TEST-ComputePlanActionTest.testSelectedCollections-seed#[90ABBFB1936023C8]) [    ] o.a.s.s.SolrDispatchFilter |___/\___/_|_|    Start time: 2018-02-05T00:15:44.949617Z
   [junit4]   2> 356554 INFO  (zkConnectionManagerCallback-474-thread-1) [    ] o.a.s.c.c.ConnectionManager zkClient has connected
   [junit4]   2> 356555 INFO  (TEST-ComputePlanActionTest.testSelectedCollections-seed#[90ABBFB1936023C8]) [    ] o.a.s.s.SolrDispatchFilter solr.xml found in ZooKeeper. Loading...
   [junit4]   2> 356562 INFO  (TEST-ComputePlanActionTest.testSelectedCollections-seed#[90ABBFB1936023C8]) [    ] o.a.s.c.ZkContainer Zookeeper client=127.0.0.1:38923/solr
   [junit4]   2> 356565 INFO  (zkConnectionManagerCallback-478-thread-1) [    ] o.a.s.c.c.ConnectionManager zkClient has connected
   [junit4]   2> 356577 INFO  (zkConnectionManagerCallback-480-thread-1-processing-n:127.0.0.1:41669_solr) [n:127.0.0.1:41669_solr    ] o.a.s.c.c.ConnectionManager zkClient has connected
   [junit4]   2> 356580 INFO  (TEST-ComputePlanActionTest.testSelectedCollections-seed#[90ABBFB1936023C8]) [n:127.0.0.1:41669_solr    ] o.a.s.c.c.ZkStateReader Updated live nodes from ZooKeeper... (0) -> (2)
   [junit4]   2> 356581 INFO  (TEST-ComputePlanActionTest.testSelectedCollections-seed#[90ABBFB1936023C8]) [n:127.0.0.1:41669_solr    ] o.a.s.c.Overseer Overseer (id=null) closing
   [junit4]   2> 356582 INFO  (TEST-ComputePlanActionTest.testSelectedCollections-seed#[90ABBFB1936023C8]) [n:127.0.0.1:41669_solr    ] o.a.s.c.ZkController Register node as live in ZooKeeper:/live_nodes/127.0.0.1:41669_solr
   [junit4]   2> 356582 DEBUG (OverseerStateUpdate-72093829223022595-127.0.0.1:44015_solr-n_0000000000) [n:127.0.0.1:44015_solr    ] o.a.s.c.Overseer processMessage: queueSize: 2, message = {
   [junit4]   2>   "operation":"downnode",
   [junit4]   2>   "node_name":"127.0.0.1:41669_solr"} current state version: 0
   [junit4]   2> 356582 DEBUG (OverseerStateUpdate-72093829223022595-127.0.0.1:44015_solr-n_0000000000) [n:127.0.0.1:44015_solr    ] o.a.s.c.o.NodeMutator DownNode state invoked for node: 127.0.0.1:41669_solr
   [junit4]   2> 356582 INFO  (zkCallback-469-thread-1-processing-n:127.0.0.1:38521_solr) [n:127.0.0.1:38521_solr    ] o.a.s.c.c.ZkStateReader Updated live nodes from ZooKeeper... (2) -> (3)
   [junit4]   2> 356582 INFO  (zkCallback-460-thread-1) [    ] o.a.s.c.c.ZkStateReader Updated live nodes from ZooKeeper... (2) -> (3)
   [junit4]   2> 356582 INFO  (zkCallback-452-thread-1-processing-n:127.0.0.1:44015_solr) [n:127.0.0.1:44015_solr    ] o.a.s.c.c.ZkStateReader Updated live nodes from ZooKeeper... (2) -> (3)
   [junit4]   2> 356582 INFO  (zkCallback-460-thread-2) [    ] o.a.s.c.c.ZkStateReader Updated live nodes from ZooKeeper... (2) -> (3)
   [junit4]   2> 356586 INFO  (zkCallback-479-thread-1-processing-n:127.0.0.1:41669_solr) [n:127.0.0.1:41669_solr    ] o.a.s.c.c.ZkStateReader Updated live nodes from ZooKeeper... (2) -> (3)
   [junit4]   2> 356606 INFO  (TEST-ComputePlanActionTest.testSelectedCollections-seed#[90ABBFB1936023C8]) [n:127.0.0.1:41669_solr    ] o.a.s.m.r.SolrJmxReporter JMX monitoring for 'solr_41669.solr.node' (registry 'solr.node') enabled at server: com.sun.jmx.mbeanserver.JmxMBeanServer@6a599d0d
   [junit4]   2> 356612 INFO  (TEST-ComputePlanActionTest.testSelectedCollections-seed#[90ABBFB1936023C8]) [n:127.0.0.1:41669_solr    ] o.a.s.m.r.SolrJmxReporter JMX monitoring for 'solr_41669.solr.jvm' (registry 'solr.jvm') enabled at server: com.sun.jmx.mbeanserver.JmxMBeanServer@6a599d0d
   [junit4]   2> 356612 INFO  (TEST-ComputePlanActionTest.testSelectedCollections-seed#[90ABBFB1936023C8]) [n:127.0.0.1:41669_solr    ] o.a.s.m.r.SolrJmxReporter JMX monitoring for 'solr_41669.solr.jetty' (registry 'solr.jetty') enabled at server: com.sun.jmx.mbeanserver.JmxMBeanServer@6a599d0d
   [junit4]   2> 356613 INFO  (TEST-ComputePlanActionTest.testSelectedCollections-seed#[90ABBFB1936023C8]) [n:127.0.0.1:41669_solr    ] o.a.s.c.CorePropertiesLocator Found 0 core definitions underneath /home/jenkins/workspace/Lucene-Solr-7.x-Linux/solr/build/solr-core/test/J0/temp/solr.cloud.autoscaling.ComputePlanActionTest_90ABBFB1936023C8-001/tempDir-001/node3/.
   [junit4]   2> 356635 INFO  (TEST-ComputePlanActionTest.testSelectedCollections-seed#[90ABBFB1936023C8]) [    ] o.e.j.s.Server jetty-9.4.8.v20171121, build timestamp: 2017-11-22T01:27:37+04:00, git hash: 82b8fb23f757335bb3329d540ce37a2a2615f0a8
   [junit4]   2> 356635 INFO  (TEST-ComputePlanActionTest.testSelectedCollections-seed#[90ABBFB1936023C8]) [    ] o.e.j.s.session DefaultSessionIdManager workerName=node0
   [junit4]   2> 356635 INFO  (TEST-ComputePlanActionTest.testSelectedCollections-seed#[90ABBFB1936023C8]) [    ] o.e.j.s.session No SessionScavenger set, using defaults
   [junit4]   2> 356635 INFO  (TEST-ComputePlanActionTest.testSelectedCollections-seed#[90ABBFB1936023C8]) [    ] o.e.j.s.session Scavenging every 660000ms
   [junit4]   2> 356635 INFO  (TEST-ComputePlanActionTest.testSelectedCollections-seed#[90ABBFB1936023C8]) [    ] o.e.j.s.h.ContextHandler Started o.e.j.s.ServletContextHandler@67419d48{/solr,null,AVAILABLE}
   [junit4]   2> 356636 INFO  (TEST-ComputePlanActionTest.testSelectedCollections-seed#[90ABBFB1936023C8]) [    ] o.e.j.s.AbstractConnector Started ServerConnector@5416db3d{HTTP/1.1,[http/1.1]}{127.0.0.1:44201}
   [junit4]   2> 356636 INFO  (TEST-ComputePlanActionTest.testSelectedCollections-seed#[90ABBFB1936023C8]) [    ] o.e.j.s.Server Started @358342ms
   [junit4]   2> 356636 INFO  (TEST-ComputePlanActionTest.testSelectedCollections-seed#[90ABBFB1936023C8]) [    ] o.a.s.c.s.e.JettySolrRunner Jetty properties: {hostContext=/solr, hostPort=44201}
   [junit4]   2> 356636 ERROR (TEST-ComputePlanActionTest.testSelectedCollections-seed#[90ABBFB1936023C8]) [    ] o.a.s.u.StartupLoggingUtils Missing Java Option solr.log.dir. Logging may be missing or incomplete.
   [junit4]   2> 356636 INFO  (TEST-ComputePlanActionTest.testSelectedCollections-seed#[90ABBFB1936023C8]) [    ] o.a.s.s.SolrDispatchFilter  ___      _       Welcome to Apache Solr? version 7.3.0
   [junit4]   2> 356636 INFO  (TEST-ComputePlanActionTest.testSelectedCollections-seed#[90ABBFB1936023C8]) [    ] o.a.s.s.SolrDispatchFilter / __| ___| |_ _   Starting in cloud mode on port null
   [junit4]   2> 356636 INFO  (TEST-ComputePlanActionTest.testSelectedCollections-seed#[90ABBFB1936023C8]) [    ] o.a.s.s.SolrDispatchFilter \__ \/ _ \ | '_|  Install dir: null
   [junit4]   2> 356636 INFO  (TEST-ComputePlanActionTest.testSelectedCollections-seed#[90ABBFB1936023C8]) [    ] o.a.s.s.SolrDispatchFilter |___/\___/_|_|    Start time: 2018-02-05T00:15:45.033746Z
   [junit4]   2> 356638 INFO  (zkConnectionManagerCallback-484-thread-1) [    ] o.a.s.c.c.ConnectionManager zkClient has connected
   [junit4]   2> 356638 INFO  (TEST-ComputePlanActionTest.testSelectedCollections-seed#[90ABBFB1936023C8]) [    ] o.a.s.s.SolrDispatchFilter solr.xml found in ZooKeeper. Loading...
   [junit4]   2> 356642 INFO  (TEST-ComputePlanActionTest.testSelectedCollections-seed#[90ABBFB1936023C8]) [    ] o.a.s.c.ZkContainer Zookeeper client=127.0.0.1:38923/solr
   [junit4]   2> 356644 INFO  (zkConnectionManagerCallback-488-thread-1) [    ] o.a.s.c.c.ConnectionManager zkClient has connected
   [junit4]   2> 356647 INFO  (zkConnectionManagerCallback-490-thread-1-processing-n:127.0.0.1:44201_solr) [n:127.0.0.1:44201_solr    ] o.a.s.c.c.ConnectionManager zkClient has connected
   [junit4]   2> 356650 INFO  (TEST-ComputePlanActionTest.testSelectedCollections-seed#[90ABBFB1936023C8]) [n:127.0.0.1:44201_solr    ] o.a.s.c.c.ZkStateReader Updated live nodes from ZooKeeper... (0) -> (3)
   [junit4]   2> 356651 INFO  (TEST-ComputePlanActionTest.testSelectedCollections-seed#[90ABBFB1936023C8]) [n:127.0.0.1:44201_solr    ] o.a.s.c.Overseer Overseer (id=null) closing
   [junit4]   2> 356652 INFO  (TEST-ComputePlanActionTest.testSelectedCollections-seed#[90ABBFB1936023C8]) [n:127.0.0.1:44201_solr    ] o.a.s.c.ZkController Register node as live in ZooKeeper:/live_nodes/127.0.0.1:44201_solr
   [junit4]   2> 356652 DEBUG (OverseerStateUpdate-72093829223022595-127.0.0.1:44015_solr-n_0000000000) [n:127.0.0.1:44015_solr    ] o.a.s.c.Overseer processMessage: queueSize: 3, message = {
   [junit4]   2>   "operation":"downnode",
   [junit4]   2>   "node_name":"127.0.0.1:44201_solr"} current state version: 0
   [junit4]   2> 356652 INFO  (zkCallback-479-thread-1-processing-n:127.0.0.1:41669_solr) [n:127.0.0.1:41669_solr    ] o.a.s.c.c.ZkStateReader Updated live nodes from ZooKeeper... (3) -> (4)
   [junit4]   2> 356652 DEBUG (OverseerStateUpdate-72093829223022595-127.0.0.1:44015_solr-n_0000000000) [n:127.0.0.1:44015_solr    ] o.a.s.c.o.NodeMutator DownNode state invoked for node: 127.0.0.1:44201_solr
   [junit4]   2> 356652 INFO  (zkCallback-460-thread-1) [    ] o.a.s.c.c.ZkStateReader Updated live nodes from ZooKeeper... (3) -> (4)
   [junit4]   2> 356652 INFO  (zkCallback-452-thread-1-processing-n:127.0.0.1:44015_solr) [n:127.0.0.1:44015_solr    ] o.a.s.c.c.ZkStateReader Updated live nodes from ZooKeeper... (3) -> (4)
   [junit4]   2> 356652 INFO  (zkCallback-460-thread-2) [    ] o.a.s.c.c.ZkStateReader Updated live nodes from ZooKeeper... (3) -> (4)
   [junit4]   2> 356652 INFO  (zkCallback-469-thread-1-processing-n:127.0.0.1:38521_solr) [n:127.0.0.1:38521_solr    ] o.a.s.c.c.ZkStateReader Updated live nodes from ZooKeeper... (3) -> (4)
   [junit4]   2> 356653 INFO  (zkCallback-489-thread-1-processing-n:127.0.0.1:44201_solr) [n:127.0.0.1:44201_solr    ] o.a.s.c.c.ZkStateReader Updated live nodes from ZooKeeper... (3) -> (4)
   [junit4]   2> 356683 INFO  (TEST-ComputePlanActionTest.testSelectedCollections-seed#[90ABBFB1936023C8]) [n:127.0.0.1:44201_solr    ] o.a.s.m.r.SolrJmxReporter JMX monitoring for 'solr_44201.solr.node' (registry 'solr.node') enabled at server: com.sun.jmx.mbeanserver.JmxMBeanServer@6a599d0d
   [junit4]   2> 356690 INFO  (TEST-ComputePlanActionTest.testSelectedCollections-seed#[90ABBFB1936023C8]) [n:127.0.0.1:44201_solr    ] o.a.s.m.r.SolrJmxReporter JMX monitoring for 'solr_44201.solr.jvm' (registry 'solr.jvm') enabled at server: com.sun.jmx.mbeanserver.JmxMBeanServer@6a599d0d
   [junit4]   2> 356690 INFO  (TEST-ComputePlanActionTest.testSelectedCollections-seed#[90ABBFB1936023C8]) [n:127.0.0.1:44201_solr    ] o.a.s.m.r.SolrJmxReporter JMX monitoring for 'solr_44201.solr.jetty' (registry 'solr.jetty') enabled at server: com.sun.jmx.mbeanserver.JmxMBeanServer@6a599d0d
   [junit4]   2> 356691 INFO  (TEST-ComputePlanActionTest.testSelectedCollections-seed#[90ABBFB1936023C8]) [n:127.0.0.1:44201_solr    ] o.a.s.c.CorePropertiesLocator Found 0 core definitions underneath /home/jenkins/workspace/Lucene-Solr-7.x-Linux/solr/build/solr-core/test/J0/temp/solr.cloud.autoscaling.ComputePlanActionTest_90ABBFB1936023C8-001/tempDir-001/node4/.
   [junit4]   2> 356718 INFO  (zkConnectionManagerCallback-494-thread-1) [    ] o.a.s.c.c.ConnectionManager zkClient has connected
   [junit4]   2> 356725 INFO  (qtp109380388-2177) [n:127.0.0.1:38521_solr    ] o.a.s.s.HttpSolrCall [admin] webapp=null path=/admin/metrics params={prefix=CONTAINER.fs.usableSpace,CORE.coreName&wt=javabin&version=2&group=solr.node,solr.core} status=0 QTime=0
   [junit4]   2> 356727 INFO  (qtp549382124-2203) [n:127.0.0.1:41669_solr    ] o.a.s.s.HttpSolrCall [admin] webapp=null path=/admin/metrics params={prefix=CONTAINER.fs.usableSpace,CORE.coreName&wt=javabin&version=2&group=solr.node,solr.core} status=0 QTime=0
   [junit4]   2> 356728 INFO  (qtp156940769-2141) [n:127.0.0.1:44015_solr    ] o.a.s.s.HttpSolrCall [admin] webapp=null path=/admin/metrics params={prefix=CONTAINER.fs.usableSpace,CORE.coreName&wt=javabin&version=2&group=solr.node,solr.core} status=0 QTime=0
   [junit4]   2> 356730 INFO  (qtp1928939751-2233) [n:127.0.0.1:44201_solr    ] o.a.s.s.HttpSolrCall [admin] webapp=null path=/admin/metrics params={prefix=CONTAINER.fs.usableSpace,CORE.coreName&wt=javabin&version=2&group=solr.node,solr.core} status=0 QTime=0
   [junit4]   2> 356730 DEBUG (qtp1928939751-2227) [n:127.0.0.1:44201_solr    ] o.a.s.c.a.AutoScalingHandler Verified autoscaling configuration
   [junit4]   2> 356731 INFO  (qtp1928939751-2227) [n:127.0.0.1:44201_solr    ] o.a.s.s.HttpSolrCall [admin] webapp=null path=/cluster/autoscaling params={wt=javabin&version=2} status=0 QTime=9
   [junit4]   2> 356731 DEBUG (zkCallback-452-thread-1-processing-n:127.0.0.1:44015_solr) [n:127.0.0.1:44015_solr    ] o.a.s.c.a.OverseerTriggerThread Refreshing /autoscaling.json with znode version 5
   [junit4]   2> 356732 DEBUG (zkCallback-452-thread-1-processing-n:127.0.0.1:44015_solr) [n:127.0.0.1:44015_solr    ] o.a.s.c.a.NodeLostTrigger Initial livenodes: [127.0.0.1:41669_solr, 127.0.0.1:44201_solr, 127.0.0.1:38521_solr, 127.0.0.1:44015_solr]
   [junit4]   2> 356732 DEBUG (OverseerAutoScalingTriggerThread-72093829223022595-127.0.0.1:44015_solr-n_0000000000) [n:127.0.0.1:44015_solr    ] o.a.s.c.a.OverseerTriggerThread Processed trigger updates upto znodeVersion 5
   [junit4]   2> 356733 INFO  (qtp109380388-2183) [n:127.0.0.1:38521_solr    ] o.a.s.h.a.CollectionsHandler Invoked Collection Action :create with params replicationFactor=2&collection.configName=conf&name=testSelected1&nrtReplicas=2&action=CREATE&numShards=2&wt=javabin&version=2 and sendToOCPQueue=true
   [junit4]   2> 356733 DEBUG (OverseerAutoScalingTriggerThread-72093829223022595-127.0.0.1:44015_solr-n_0000000000) [n:127.0.0.1:44015_solr    ] o.a.s.c.a.OverseerTriggerThread -- clean old nodeAdded markers
   [junit4]   2> 356733 DEBUG (OverseerAutoScalingTriggerThread-72093829223022595-127.0.0.1:44015_solr-n_0000000000) [n:127.0.0.1:44015_solr    ] o.a.s.c.a.OverseerTriggerThread Current znodeVersion 5, lastZnodeVersion 5
   [junit4]   2> 356733 DEBUG (ScheduledTrigger-979-thread-1) [n:127.0.0.1:44015_solr    ] o.a.s.c.a.NodeLostTrigger Running NodeLostTrigger: node_lost_trigger with currently live nodes: 4
   [junit4]   2> 356734 INFO  (OverseerThreadFactory-981-thread-1-processing-n:127.0.0.1:44015_solr) [n:127.0.0.1:44015_solr    ] o.a.s.c.a.c.CreateCollectionCmd Create collection testSelected1
   [junit4]   2> 356738 INFO  (qtp109380388-2177) [n:127.0.0.1:38521_solr    ] o.a.s.s.HttpSolrCall [admin] webapp=null path=/admin/metrics params={prefix=CONTAINER.fs.usableSpace,CORE.coreName&wt=javabin&version=2&group=solr.node,solr.core} status=0 QTime=0
   [junit4]   2> 356740 INFO  (qtp549382124-2209) [n:127.0.0.1:41669_solr    ] o.a.s.s.HttpSolrCall [admin] webapp=null path=/admin/metrics params={prefix=CONTAINER.fs.usableSpace,CORE.coreName&wt=javabin&version=2&group=solr.node,solr.core} status=0 QTime=0
   [junit4]   2> 356740 INFO  (qtp156940769-2138) [n:127.0.0.1:44015_solr    ] o.a.s.s.HttpSolrCall [admin] webapp=null path=/admin/metrics params={prefix=CONTAINER.fs.usableSpace,CORE.coreName&wt=javabin&version=2&group=solr.node,solr.core} status=0 QTime=0
   [junit4]   2> 356742 INFO  (qtp1928939751-2233) [n:127.0.0.1:44201_solr    ] o.a.s.s.HttpSolrCall [admin] webapp=null path=/admin/metrics params={prefix=CONTAINER.fs.usableSpace,CORE.coreName&wt=javabin&version=2&group=solr.node,solr.core} status=0 QTime=0
   [junit4]   2> 356752 INFO  (OverseerThreadFactory-981-thread-1-processing-n:127.0.0.1:44015_solr) [n:127.0.0.1:44015_solr    ] o.a.s.c.s.c.a.PolicyHelper returnSession, curr-time 552905586 sessionWrapper.createTime 552905576722892, this.sessionWrapper.createTime 552905576722892 
   [junit4]   2> 356754 DEBUG (OverseerStateUpdate-72093829223022595-127.0.0.1:44015_solr-n_0000000000) [n:127.0.0.1:44015_solr    ] o.a.s.c.Overseer processMessage: queueSize: 1, message = {
   [junit4]   2>   "name":"testSelected1",
   [junit4]   2>   "fromApi":"true",
   [junit4]   2>   "replicationFactor":"2",
   [junit4]   2>   "collection.configName":"conf",
   [junit4]   2>   "numShards":"2",
   [junit4]   2>   "nrtReplicas":"2",
   [junit4]   2>   "stateFormat":"2",
   [junit4]   2>   "operation":"create"} current state version: 0
   [junit4]   2> 356754 DEBUG (OverseerStateUpdate-72093829223022595-127.0.0.1:44015_solr-n_0000000000) [n:127.0.0.1:44015_solr    ] o.a.s.c.o.ClusterStateMutator building a new cName: testSelected1
   [junit4]   2> 356754 DEBUG (OverseerStateUpdate-72093829223022595-127.0.0.1:44015_solr-n_0000000000) [n:127.0.0.1:44015_solr    ] o.a.s.c.o.ZkStateWriter going to create_collection /collections/testSelected1/state.json
   [junit4]   2> 356856 DEBUG (OverseerStateUpdate-72093829223022595-127.0.0.1:44015_solr-n_0000000000) [n:127.0.0.1:44015_solr    ] o.a.s.c.Overseer processMessage: queueSize: 1, message = {
   [junit4]   2>   "operation":"ADDREPLICA",
   [junit4]   2>   "collection":"testSelected1",
   [junit4]   2>   "shard":"shard1",
   [junit4]   2>   "core":"testSelected1_shard1_replica_n1",
   [junit4]   2>   "state":"down",
   [junit4]   2>   "base_url":"http://127.0.0.1:44201/solr",
   [junit4]   2>   "type":"NRT",
   [junit4]   2>   "waitForFinalState":"false"} current state version: 0
   [junit4]   2> 356856 INFO  (OverseerStateUpdate-72093829223022595-127.0.0.1:44015_solr-n_0000000000) [n:127.0.0.1:44015_solr    ] o.a.s.c.o.SliceMutator createReplica() {
   [junit4]   2>   "operation":"ADDREPLICA",
   [junit4]   2>   "collection":"testSelected1",
   [junit4]   2>   "shard":"shard1",
   [junit4]   2>   "core":"testSelected1_shard1_replica_n1",
   [junit4]   2>   "state":"down",
   [junit4]   2>   "base_url":"http://127.0.0.1:44201

[...truncated too long message...]

  [junit4] <<< JVM J2: EOF ----

[...truncated 3 lines...]
   [junit4] JVM J0: stderr was not empty, see: /home/jenkins/workspace/Lucene-Solr-7.x-Linux/solr/build/contrib/solr-analytics/test/temp/junit4-J0-20180205_003352_1062674780302070379023.syserr
   [junit4] >>> JVM J0 emitted unexpected output (verbatim) ----
   [junit4] Java HotSpot(TM) 64-Bit Server VM warning: Option UseConcMarkSweepGC was deprecated in version 9.0 and will likely be removed in a future release.
   [junit4] <<< JVM J0: EOF ----

[...truncated 553 lines...]
   [junit4] JVM J2: stderr was not empty, see: /home/jenkins/workspace/Lucene-Solr-7.x-Linux/solr/build/contrib/solr-clustering/test/temp/junit4-J2-20180205_003446_54911015137907494519185.syserr
   [junit4] >>> JVM J2 emitted unexpected output (verbatim) ----
   [junit4] Java HotSpot(TM) 64-Bit Server VM warning: Option UseConcMarkSweepGC was deprecated in version 9.0 and will likely be removed in a future release.
   [junit4] <<< JVM J2: EOF ----

[...truncated 3 lines...]
   [junit4] JVM J1: stderr was not empty, see: /home/jenkins/workspace/Lucene-Solr-7.x-Linux/solr/build/contrib/solr-clustering/test/temp/junit4-J1-20180205_003446_5496762570290321518748.syserr
   [junit4] >>> JVM J1 emitted unexpected output (verbatim) ----
   [junit4] Java HotSpot(TM) 64-Bit Server VM warning: Option UseConcMarkSweepGC was deprecated in version 9.0 and will likely be removed in a future release.
   [junit4] <<< JVM J1: EOF ----

[...truncated 3 lines...]
   [junit4] JVM J0: stderr was not empty, see: /home/jenkins/workspace/Lucene-Solr-7.x-Linux/solr/build/contrib/solr-clustering/test/temp/junit4-J0-20180205_003446_5493620841516270605229.syserr
   [junit4] >>> JVM J0 emitted unexpected output (verbatim) ----
   [junit4] Java HotSpot(TM) 64-Bit Server VM warning: Option UseConcMarkSweepGC was deprecated in version 9.0 and will likely be removed in a future release.
   [junit4] <<< JVM J0: EOF ----

[...truncated 1260 lines...]
   [junit4] JVM J1: stderr was not empty, see: /home/jenkins/workspace/Lucene-Solr-7.x-Linux/solr/build/contrib/solr-dataimporthandler-extras/test/temp/junit4-J1-20180205_003500_7342710181844598286813.syserr
   [junit4] >>> JVM J1 emitted unexpected output (verbatim) ----
   [junit4] Java HotSpot(TM) 64-Bit Server VM warning: Option UseConcMarkSweepGC was deprecated in version 9.0 and will likely be removed in a future release.
   [junit4] <<< JVM J1: EOF ----

[...truncated 3 lines...]
   [junit4] JVM J0: stderr was not empty, see: /home/jenkins/workspace/Lucene-Solr-7.x-Linux/solr/build/contrib/solr-dataimporthandler-extras/test/temp/junit4-J0-20180205_003500_73414821617227706833849.syserr
   [junit4] >>> JVM J0 emitted unexpected output (verbatim) ----
   [junit4] Java HotSpot(TM) 64-Bit Server VM warning: Option UseConcMarkSweepGC was deprecated in version 9.0 and will likely be removed in a future release.
   [junit4] <<< JVM J0: EOF ----

[...truncated 650 lines...]
   [junit4] JVM J1: stderr was not empty, see: /home/jenkins/workspace/Lucene-Solr-7.x-Linux/solr/build/contrib/solr-dataimporthandler/test/temp/junit4-J1-20180205_003507_19012774535316326902469.syserr
   [junit4] >>> JVM J1 emitted unexpected output (verbatim) ----
   [junit4] Java HotSpot(TM) 64-Bit Server VM warning: Option UseConcMarkSweepGC was deprecated in version 9.0 and will likely be removed in a future release.
   [junit4] <<< JVM J1: EOF ----

   [junit4] JVM J0: stderr was not empty, see: /home/jenkins/workspace/Lucene-Solr-7.x-Linux/solr/build/contrib/solr-dataimporthandler/test/temp/junit4-J0-20180205_003507_1905717276682499242263.syserr
   [junit4] >>> JVM J0 emitted unexpected output (verbatim) ----
   [junit4] Java HotSpot(TM) 64-Bit Server VM warning: Option UseConcMarkSweepGC was deprecated in version 9.0 and will likely be removed in a future release.
   [junit4] <<< JVM J0: EOF ----

   [junit4] JVM J2: stderr was not empty, see: /home/jenkins/workspace/Lucene-Solr-7.x-Linux/solr/build/contrib/solr-dataimporthandler/test/temp/junit4-J2-20180205_003507_1909256791080120480086.syserr
   [junit4] >>> JVM J2 emitted unexpected output (verbatim) ----
   [junit4] Java HotSpot(TM) 64-Bit Server VM warning: Option UseConcMarkSweepGC was deprecated in version 9.0 and will likely be removed in a future release.
   [junit4] <<< JVM J2: EOF ----

[...truncated 558 lines...]
   [junit4] JVM J0: stderr was not empty, see: /home/jenkins/workspace/Lucene-Solr-7.x-Linux/solr/build/contrib/solr-cell/test/temp/junit4-J0-20180205_003526_2595082998667125827358.syserr
   [junit4] >>> JVM J0 emitted unexpected output (verbatim) ----
   [junit4] Java HotSpot(TM) 64-Bit Server VM warning: Option UseConcMarkSweepGC was deprecated in version 9.0 and will likely be removed in a future release.
   [junit4] <<< JVM J0: EOF ----

[...truncated 3 lines...]
   [junit4] JVM J2: stderr was not empty, see: /home/jenkins/workspace/Lucene-Solr-7.x-Linux/solr/build/contrib/solr-cell/test/temp/junit4-J2-20180205_003526_259647206730660055485.syserr
   [junit4] >>> JVM J2 emitted unexpected output (verbatim) ----
   [junit4] Java HotSpot(TM) 64-Bit Server VM warning: Option UseConcMarkSweepGC was deprecated in version 9.0 and will likely be removed in a future release.
   [junit4] <<< JVM J2: EOF ----

[...truncated 3 lines...]
   [junit4] JVM J1: stderr was not empty, see: /home/jenkins/workspace/Lucene-Solr-7.x-Linux/solr/build/contrib/solr-cell/test/temp/junit4-J1-20180205_003526_25910455184869408981193.syserr
   [junit4] >>> JVM J1 emitted unexpected output (verbatim) ----
   [junit4] Java HotSpot(TM) 64-Bit Server VM warning: Option UseConcMarkSweepGC was deprecated in version 9.0 and will likely be removed in a future release.
   [junit4] <<< JVM J1: EOF ----

[...truncated 567 lines...]
   [junit4] JVM J0: stderr was not empty, see: /home/jenkins/workspace/Lucene-Solr-7.x-Linux/solr/build/contrib/solr-langid/test/temp/junit4-J0-20180205_003535_799818958802930932509.syserr
   [junit4] >>> JVM J0 emitted unexpected output (verbatim) ----
   [junit4] Java HotSpot(TM) 64-Bit Server VM warning: Option UseConcMarkSweepGC was deprecated in version 9.0 and will likely be removed in a future release.
   [junit4] <<< JVM J0: EOF ----

   [junit4] JVM J1: stderr was not empty, see: /home/jenkins/workspace/Lucene-Solr-7.x-Linux/solr/build/contrib/solr-langid/test/temp/junit4-J1-20180205_003535_7997619763618720093499.syserr
   [junit4] >>> JVM J1 emitted unexpected output (verbatim) ----
   [junit4] Java HotSpot(TM) 64-Bit Server VM warning: Option UseConcMarkSweepGC was deprecated in version 9.0 and will likely be removed in a future release.
   [junit4] <<< JVM J1: EOF ----

   [junit4] JVM J2: stderr was not empty, see: /home/jenkins/workspace/Lucene-Solr-7.x-Linux/solr/build/contrib/solr-langid/test/temp/junit4-J2-20180205_003535_7999362170113746156281.syserr
   [junit4] >>> JVM J2 emitted unexpected output (verbatim) ----
   [junit4] Java HotSpot(TM) 64-Bit Server VM warning: Option UseConcMarkSweepGC was deprecated in version 9.0 and will likely be removed in a future release.
   [junit4] <<< JVM J2: EOF ----

[...truncated 659 lines...]
   [junit4] JVM J1: stderr was not empty, see: /home/jenkins/workspace/Lucene-Solr-7.x-Linux/solr/build/contrib/solr-ltr/test/temp/junit4-J1-20180205_003542_9571420710590341634241.syserr
   [junit4] >>> JVM J1 emitted unexpected output (verbatim) ----
   [junit4] Java HotSpot(TM) 64-Bit Server VM warning: Option UseConcMarkSweepGC was deprecated in version 9.0 and will likely be removed in a future release.
   [junit4] <<< JVM J1: EOF ----

[...truncated 3 lines...]
   [junit4] JVM J2: stderr was not empty, see: /home/jenkins/workspace/Lucene-Solr-7.x-Linux/solr/build/contrib/solr-ltr/test/temp/junit4-J2-20180205_003542_95713852167705352137471.syserr
   [junit4] >>> JVM J2 emitted unexpected output (verbatim) ----
   [junit4] Java HotSpot(TM) 64-Bit Server VM warning: Option UseConcMarkSweepGC was deprecated in version 9.0 and will likely be removed in a future release.
   [junit4] <<< JVM J2: EOF ----

[...truncated 3 lines...]
   [junit4] JVM J0: stderr was not empty, see: /home/jenkins/workspace/Lucene-Solr-7.x-Linux/solr/build/contrib/solr-ltr/test/temp/junit4-J0-20180205_003542_9576831268719847851772.syserr
   [junit4] >>> JVM J0 emitted unexpected output (verbatim) ----
   [junit4] Java HotSpot(TM) 64-Bit Server VM warning: Option UseConcMarkSweepGC was deprecated in version 9.0 and will likely be removed in a future release.
   [junit4] <<< JVM J0: EOF ----

[...truncated 596 lines...]
   [junit4] JVM J1: stderr was not empty, see: /home/jenkins/workspace/Lucene-Solr-7.x-Linux/solr/build/contrib/solr-uima/test/temp/junit4-J1-20180205_003606_85513013514367555536254.syserr
   [junit4] >>> JVM J1 emitted unexpected output (verbatim) ----
   [junit4] Java HotSpot(TM) 64-Bit Server VM warning: Option UseConcMarkSweepGC was deprecated in version 9.0 and will likely be removed in a future release.
   [junit4] <<< JVM J1: EOF ----

[...truncated 3 lines...]
   [junit4] JVM J0: stderr was not empty, see: /home/jenkins/workspace/Lucene-Solr-7.x-Linux/solr/build/contrib/solr-uima/test/temp/junit4-J0-20180205_003606_8554117612528603027206.syserr
   [junit4] >>> JVM J0 emitted unexpected output (verbatim) ----
   [junit4] Java HotSpot(TM) 64-Bit Server VM warning: Option UseConcMarkSweepGC was deprecated in version 9.0 and will likely be removed in a future release.
   [junit4] <<< JVM J0: EOF ----

[...truncated 548 lines...]
   [junit4] JVM J0: stderr was not empty, see: /home/jenkins/workspace/Lucene-Solr-7.x-Linux/solr/build/contrib/solr-velocity/test/temp/junit4-J0-20180205_003617_0197013654318192976406.syserr
   [junit4] >>> JVM J0 emitted unexpected output (verbatim) ----
   [junit4] Java HotSpot(TM) 64-Bit Server VM warning: Option UseConcMarkSweepGC was deprecated in version 9.0 and will likely be removed in a future release.
   [junit4] <<< JVM J0: EOF ----

[...truncated 32334 lines...]

[JENKINS] Lucene-Solr-7.x-Linux (64bit/jdk1.8.0_162) - Build # 1300 - Still Unstable!

Posted by Policeman Jenkins Server <je...@thetaphi.de>.
Build: https://jenkins.thetaphi.de/job/Lucene-Solr-7.x-Linux/1300/
Java: 64bit/jdk1.8.0_162 -XX:+UseCompressedOops -XX:+UseSerialGC

1 tests failed.
FAILED:  org.apache.solr.handler.admin.AutoscalingHistoryHandlerTest.testHistory

Error Message:
expected:<5> but was:<0>

Stack Trace:
java.lang.AssertionError: expected:<5> but was:<0>
	at __randomizedtesting.SeedInfo.seed([3D2E790E81B5F13A:50D2DDF33BFD0E3D]:0)
	at org.junit.Assert.fail(Assert.java:93)
	at org.junit.Assert.failNotEquals(Assert.java:647)
	at org.junit.Assert.assertEquals(Assert.java:128)
	at org.junit.Assert.assertEquals(Assert.java:472)
	at org.junit.Assert.assertEquals(Assert.java:456)
	at org.apache.solr.handler.admin.AutoscalingHistoryHandlerTest.testHistory(AutoscalingHistoryHandlerTest.java:241)
	at sun.reflect.NativeMethodAccessorImpl.invoke0(Native Method)
	at sun.reflect.NativeMethodAccessorImpl.invoke(NativeMethodAccessorImpl.java:62)
	at sun.reflect.DelegatingMethodAccessorImpl.invoke(DelegatingMethodAccessorImpl.java:43)
	at java.lang.reflect.Method.invoke(Method.java:498)
	at com.carrotsearch.randomizedtesting.RandomizedRunner.invoke(RandomizedRunner.java:1737)
	at com.carrotsearch.randomizedtesting.RandomizedRunner$8.evaluate(RandomizedRunner.java:934)
	at com.carrotsearch.randomizedtesting.RandomizedRunner$9.evaluate(RandomizedRunner.java:970)
	at com.carrotsearch.randomizedtesting.RandomizedRunner$10.evaluate(RandomizedRunner.java:984)
	at com.carrotsearch.randomizedtesting.rules.SystemPropertiesRestoreRule$1.evaluate(SystemPropertiesRestoreRule.java:57)
	at org.apache.lucene.util.TestRuleSetupTeardownChained$1.evaluate(TestRuleSetupTeardownChained.java:49)
	at org.apache.lucene.util.AbstractBeforeAfterRule$1.evaluate(AbstractBeforeAfterRule.java:45)
	at org.apache.lucene.util.TestRuleThreadAndTestName$1.evaluate(TestRuleThreadAndTestName.java:48)
	at org.apache.lucene.util.TestRuleIgnoreAfterMaxFailures$1.evaluate(TestRuleIgnoreAfterMaxFailures.java:64)
	at org.apache.lucene.util.TestRuleMarkFailure$1.evaluate(TestRuleMarkFailure.java:47)
	at com.carrotsearch.randomizedtesting.rules.StatementAdapter.evaluate(StatementAdapter.java:36)
	at com.carrotsearch.randomizedtesting.ThreadLeakControl$StatementRunner.run(ThreadLeakControl.java:368)
	at com.carrotsearch.randomizedtesting.ThreadLeakControl.forkTimeoutingTask(ThreadLeakControl.java:817)
	at com.carrotsearch.randomizedtesting.ThreadLeakControl$3.evaluate(ThreadLeakControl.java:468)
	at com.carrotsearch.randomizedtesting.RandomizedRunner.runSingleTest(RandomizedRunner.java:943)
	at com.carrotsearch.randomizedtesting.RandomizedRunner$5.evaluate(RandomizedRunner.java:829)
	at com.carrotsearch.randomizedtesting.RandomizedRunner$6.evaluate(RandomizedRunner.java:879)
	at com.carrotsearch.randomizedtesting.RandomizedRunner$7.evaluate(RandomizedRunner.java:890)
	at com.carrotsearch.randomizedtesting.rules.StatementAdapter.evaluate(StatementAdapter.java:36)
	at com.carrotsearch.randomizedtesting.rules.SystemPropertiesRestoreRule$1.evaluate(SystemPropertiesRestoreRule.java:57)
	at org.apache.lucene.util.AbstractBeforeAfterRule$1.evaluate(AbstractBeforeAfterRule.java:45)
	at com.carrotsearch.randomizedtesting.rules.StatementAdapter.evaluate(StatementAdapter.java:36)
	at org.apache.lucene.util.TestRuleStoreClassName$1.evaluate(TestRuleStoreClassName.java:41)
	at com.carrotsearch.randomizedtesting.rules.NoShadowingOrOverridesOnMethodsRule$1.evaluate(NoShadowingOrOverridesOnMethodsRule.java:40)
	at com.carrotsearch.randomizedtesting.rules.NoShadowingOrOverridesOnMethodsRule$1.evaluate(NoShadowingOrOverridesOnMethodsRule.java:40)
	at com.carrotsearch.randomizedtesting.rules.StatementAdapter.evaluate(StatementAdapter.java:36)
	at com.carrotsearch.randomizedtesting.rules.StatementAdapter.evaluate(StatementAdapter.java:36)
	at com.carrotsearch.randomizedtesting.rules.StatementAdapter.evaluate(StatementAdapter.java:36)
	at org.apache.lucene.util.TestRuleAssertionsRequired$1.evaluate(TestRuleAssertionsRequired.java:53)
	at org.apache.lucene.util.TestRuleMarkFailure$1.evaluate(TestRuleMarkFailure.java:47)
	at org.apache.lucene.util.TestRuleIgnoreAfterMaxFailures$1.evaluate(TestRuleIgnoreAfterMaxFailures.java:64)
	at org.apache.lucene.util.TestRuleIgnoreTestSuites$1.evaluate(TestRuleIgnoreTestSuites.java:54)
	at com.carrotsearch.randomizedtesting.rules.StatementAdapter.evaluate(StatementAdapter.java:36)
	at com.carrotsearch.randomizedtesting.ThreadLeakControl$StatementRunner.run(ThreadLeakControl.java:368)
	at java.lang.Thread.run(Thread.java:748)




Build Log:
[...truncated 12647 lines...]
   [junit4] Suite: org.apache.solr.handler.admin.AutoscalingHistoryHandlerTest
   [junit4]   2> 859049 INFO  (SUITE-AutoscalingHistoryHandlerTest-seed#[3D2E790E81B5F13A]-worker) [    ] o.a.s.SolrTestCaseJ4 SecureRandom sanity checks: test.solr.allowed.securerandom=null & java.security.egd=file:/dev/./urandom
   [junit4]   2> Creating dataDir: /home/jenkins/workspace/Lucene-Solr-7.x-Linux/solr/build/solr-core/test/J1/temp/solr.handler.admin.AutoscalingHistoryHandlerTest_3D2E790E81B5F13A-001/init-core-data-001
   [junit4]   2> 859050 WARN  (SUITE-AutoscalingHistoryHandlerTest-seed#[3D2E790E81B5F13A]-worker) [    ] o.a.s.SolrTestCaseJ4 startTrackingSearchers: numOpens=6 numCloses=6
   [junit4]   2> 859050 INFO  (SUITE-AutoscalingHistoryHandlerTest-seed#[3D2E790E81B5F13A]-worker) [    ] o.a.s.SolrTestCaseJ4 Using PointFields (NUMERIC_POINTS_SYSPROP=true) w/NUMERIC_DOCVALUES_SYSPROP=false
   [junit4]   2> 859051 INFO  (SUITE-AutoscalingHistoryHandlerTest-seed#[3D2E790E81B5F13A]-worker) [    ] o.a.s.SolrTestCaseJ4 Randomized ssl (false) and clientAuth (true) via: @org.apache.solr.util.RandomizeSSL(reason=, ssl=NaN, value=NaN, clientAuth=NaN)
   [junit4]   2> 859051 INFO  (SUITE-AutoscalingHistoryHandlerTest-seed#[3D2E790E81B5F13A]-worker) [    ] o.a.s.c.MiniSolrCloudCluster Starting cluster of 3 servers in /home/jenkins/workspace/Lucene-Solr-7.x-Linux/solr/build/solr-core/test/J1/temp/solr.handler.admin.AutoscalingHistoryHandlerTest_3D2E790E81B5F13A-001/tempDir-001
   [junit4]   2> 859051 INFO  (SUITE-AutoscalingHistoryHandlerTest-seed#[3D2E790E81B5F13A]-worker) [    ] o.a.s.c.ZkTestServer STARTING ZK TEST SERVER
   [junit4]   2> 859051 INFO  (Thread-3394) [    ] o.a.s.c.ZkTestServer client port:0.0.0.0/0.0.0.0:0
   [junit4]   2> 859051 INFO  (Thread-3394) [    ] o.a.s.c.ZkTestServer Starting server
   [junit4]   2> 859053 ERROR (Thread-3394) [    ] o.a.z.s.ZooKeeperServer ZKShutdownHandler is not registered, so ZooKeeper server won't take any action on ERROR or SHUTDOWN server state changes
   [junit4]   2> 859151 INFO  (SUITE-AutoscalingHistoryHandlerTest-seed#[3D2E790E81B5F13A]-worker) [    ] o.a.s.c.ZkTestServer start zk server on port:37737
   [junit4]   2> 859153 INFO  (zkConnectionManagerCallback-6293-thread-1) [    ] o.a.s.c.c.ConnectionManager zkClient has connected
   [junit4]   2> 859156 INFO  (jetty-launcher-6290-thread-3) [    ] o.e.j.s.Server jetty-9.4.8.v20171121, build timestamp: 2017-11-21T16:27:37-05:00, git hash: 82b8fb23f757335bb3329d540ce37a2a2615f0a8
   [junit4]   2> 859156 INFO  (jetty-launcher-6290-thread-2) [    ] o.e.j.s.Server jetty-9.4.8.v20171121, build timestamp: 2017-11-21T16:27:37-05:00, git hash: 82b8fb23f757335bb3329d540ce37a2a2615f0a8
   [junit4]   2> 859156 INFO  (jetty-launcher-6290-thread-1) [    ] o.e.j.s.Server jetty-9.4.8.v20171121, build timestamp: 2017-11-21T16:27:37-05:00, git hash: 82b8fb23f757335bb3329d540ce37a2a2615f0a8
   [junit4]   2> 859157 INFO  (jetty-launcher-6290-thread-1) [    ] o.e.j.s.session DefaultSessionIdManager workerName=node0
   [junit4]   2> 859157 INFO  (jetty-launcher-6290-thread-1) [    ] o.e.j.s.session No SessionScavenger set, using defaults
   [junit4]   2> 859157 INFO  (jetty-launcher-6290-thread-1) [    ] o.e.j.s.session Scavenging every 660000ms
   [junit4]   2> 859157 INFO  (jetty-launcher-6290-thread-3) [    ] o.e.j.s.session DefaultSessionIdManager workerName=node0
   [junit4]   2> 859157 INFO  (jetty-launcher-6290-thread-3) [    ] o.e.j.s.session No SessionScavenger set, using defaults
   [junit4]   2> 859157 INFO  (jetty-launcher-6290-thread-2) [    ] o.e.j.s.session DefaultSessionIdManager workerName=node0
   [junit4]   2> 859157 INFO  (jetty-launcher-6290-thread-3) [    ] o.e.j.s.session Scavenging every 660000ms
   [junit4]   2> 859157 INFO  (jetty-launcher-6290-thread-1) [    ] o.e.j.s.h.ContextHandler Started o.e.j.s.ServletContextHandler@4bac2936{/solr,null,AVAILABLE}
   [junit4]   2> 859157 INFO  (jetty-launcher-6290-thread-2) [    ] o.e.j.s.session No SessionScavenger set, using defaults
   [junit4]   2> 859157 INFO  (jetty-launcher-6290-thread-2) [    ] o.e.j.s.session Scavenging every 660000ms
   [junit4]   2> 859157 INFO  (jetty-launcher-6290-thread-3) [    ] o.e.j.s.h.ContextHandler Started o.e.j.s.ServletContextHandler@21a41b07{/solr,null,AVAILABLE}
   [junit4]   2> 859158 INFO  (jetty-launcher-6290-thread-2) [    ] o.e.j.s.h.ContextHandler Started o.e.j.s.ServletContextHandler@46c11a69{/solr,null,AVAILABLE}
   [junit4]   2> 859158 INFO  (jetty-launcher-6290-thread-3) [    ] o.e.j.s.AbstractConnector Started ServerConnector@10cf53f6{HTTP/1.1,[http/1.1]}{127.0.0.1:34875}
   [junit4]   2> 859158 INFO  (jetty-launcher-6290-thread-1) [    ] o.e.j.s.AbstractConnector Started ServerConnector@51e678e2{HTTP/1.1,[http/1.1]}{127.0.0.1:43299}
   [junit4]   2> 859158 INFO  (jetty-launcher-6290-thread-3) [    ] o.e.j.s.Server Started @860613ms
   [junit4]   2> 859158 INFO  (jetty-launcher-6290-thread-1) [    ] o.e.j.s.Server Started @860613ms
   [junit4]   2> 859158 INFO  (jetty-launcher-6290-thread-3) [    ] o.a.s.c.s.e.JettySolrRunner Jetty properties: {hostContext=/solr, hostPort=34875}
   [junit4]   2> 859158 INFO  (jetty-launcher-6290-thread-1) [    ] o.a.s.c.s.e.JettySolrRunner Jetty properties: {hostContext=/solr, hostPort=43299}
   [junit4]   2> 859158 INFO  (jetty-launcher-6290-thread-2) [    ] o.e.j.s.AbstractConnector Started ServerConnector@4c73b330{HTTP/1.1,[http/1.1]}{127.0.0.1:32943}
   [junit4]   2> 859158 INFO  (jetty-launcher-6290-thread-2) [    ] o.e.j.s.Server Started @860614ms
   [junit4]   2> 859158 INFO  (jetty-launcher-6290-thread-2) [    ] o.a.s.c.s.e.JettySolrRunner Jetty properties: {hostContext=/solr, hostPort=32943}
   [junit4]   2> 859158 ERROR (jetty-launcher-6290-thread-3) [    ] o.a.s.u.StartupLoggingUtils Missing Java Option solr.log.dir. Logging may be missing or incomplete.
   [junit4]   2> 859158 ERROR (jetty-launcher-6290-thread-1) [    ] o.a.s.u.StartupLoggingUtils Missing Java Option solr.log.dir. Logging may be missing or incomplete.
   [junit4]   2> 859158 INFO  (jetty-launcher-6290-thread-3) [    ] o.a.s.s.SolrDispatchFilter  ___      _       Welcome to Apache Solr? version 7.3.0
   [junit4]   2> 859158 INFO  (jetty-launcher-6290-thread-1) [    ] o.a.s.s.SolrDispatchFilter  ___      _       Welcome to Apache Solr? version 7.3.0
   [junit4]   2> 859159 INFO  (jetty-launcher-6290-thread-3) [    ] o.a.s.s.SolrDispatchFilter / __| ___| |_ _   Starting in cloud mode on port null
   [junit4]   2> 859159 INFO  (jetty-launcher-6290-thread-1) [    ] o.a.s.s.SolrDispatchFilter / __| ___| |_ _   Starting in cloud mode on port null
   [junit4]   2> 859159 INFO  (jetty-launcher-6290-thread-3) [    ] o.a.s.s.SolrDispatchFilter \__ \/ _ \ | '_|  Install dir: null
   [junit4]   2> 859159 INFO  (jetty-launcher-6290-thread-1) [    ] o.a.s.s.SolrDispatchFilter \__ \/ _ \ | '_|  Install dir: null
   [junit4]   2> 859159 INFO  (jetty-launcher-6290-thread-3) [    ] o.a.s.s.SolrDispatchFilter |___/\___/_|_|    Start time: 2018-02-05T03:18:05.032Z
   [junit4]   2> 859159 INFO  (jetty-launcher-6290-thread-1) [    ] o.a.s.s.SolrDispatchFilter |___/\___/_|_|    Start time: 2018-02-05T03:18:05.032Z
   [junit4]   2> 859158 ERROR (jetty-launcher-6290-thread-2) [    ] o.a.s.u.StartupLoggingUtils Missing Java Option solr.log.dir. Logging may be missing or incomplete.
   [junit4]   2> 859159 INFO  (jetty-launcher-6290-thread-2) [    ] o.a.s.s.SolrDispatchFilter  ___      _       Welcome to Apache Solr? version 7.3.0
   [junit4]   2> 859159 INFO  (jetty-launcher-6290-thread-2) [    ] o.a.s.s.SolrDispatchFilter / __| ___| |_ _   Starting in cloud mode on port null
   [junit4]   2> 859159 INFO  (jetty-launcher-6290-thread-2) [    ] o.a.s.s.SolrDispatchFilter \__ \/ _ \ | '_|  Install dir: null
   [junit4]   2> 859159 INFO  (jetty-launcher-6290-thread-2) [    ] o.a.s.s.SolrDispatchFilter |___/\___/_|_|    Start time: 2018-02-05T03:18:05.032Z
   [junit4]   2> 859160 INFO  (zkConnectionManagerCallback-6296-thread-1) [    ] o.a.s.c.c.ConnectionManager zkClient has connected
   [junit4]   2> 859160 INFO  (zkConnectionManagerCallback-6297-thread-1) [    ] o.a.s.c.c.ConnectionManager zkClient has connected
   [junit4]   2> 859160 INFO  (zkConnectionManagerCallback-6299-thread-1) [    ] o.a.s.c.c.ConnectionManager zkClient has connected
   [junit4]   2> 859160 INFO  (jetty-launcher-6290-thread-3) [    ] o.a.s.s.SolrDispatchFilter solr.xml found in ZooKeeper. Loading...
   [junit4]   2> 859160 INFO  (jetty-launcher-6290-thread-1) [    ] o.a.s.s.SolrDispatchFilter solr.xml found in ZooKeeper. Loading...
   [junit4]   2> 859160 INFO  (jetty-launcher-6290-thread-2) [    ] o.a.s.s.SolrDispatchFilter solr.xml found in ZooKeeper. Loading...
   [junit4]   2> 859163 WARN  (NIOServerCxn.Factory:0.0.0.0/0.0.0.0:0) [    ] o.a.z.s.NIOServerCnxn Unable to read additional data from client sessionid 0x100219b98f30003, likely client has closed socket
   [junit4]   2> 859163 WARN  (NIOServerCxn.Factory:0.0.0.0/0.0.0.0:0) [    ] o.a.z.s.NIOServerCnxn Unable to read additional data from client sessionid 0x100219b98f30001, likely client has closed socket
   [junit4]   2> 859165 INFO  (jetty-launcher-6290-thread-1) [    ] o.a.s.c.ZkContainer Zookeeper client=127.0.0.1:37737/solr
   [junit4]   2> 859165 INFO  (jetty-launcher-6290-thread-2) [    ] o.a.s.c.ZkContainer Zookeeper client=127.0.0.1:37737/solr
   [junit4]   2> 859166 INFO  (jetty-launcher-6290-thread-3) [    ] o.a.s.c.ZkContainer Zookeeper client=127.0.0.1:37737/solr
   [junit4]   2> 859168 INFO  (zkConnectionManagerCallback-6306-thread-1) [    ] o.a.s.c.c.ConnectionManager zkClient has connected
   [junit4]   2> 859169 INFO  (zkConnectionManagerCallback-6311-thread-1) [    ] o.a.s.c.c.ConnectionManager zkClient has connected
   [junit4]   2> 859169 INFO  (zkConnectionManagerCallback-6308-thread-1) [    ] o.a.s.c.c.ConnectionManager zkClient has connected
   [junit4]   2> 859175 INFO  (zkConnectionManagerCallback-6313-thread-1-processing-n:127.0.0.1:43299_solr) [n:127.0.0.1:43299_solr    ] o.a.s.c.c.ConnectionManager zkClient has connected
   [junit4]   2> 859177 INFO  (zkConnectionManagerCallback-6316-thread-1-processing-n:127.0.0.1:34875_solr) [n:127.0.0.1:34875_solr    ] o.a.s.c.c.ConnectionManager zkClient has connected
   [junit4]   2> 859177 INFO  (zkConnectionManagerCallback-6317-thread-1-processing-n:127.0.0.1:32943_solr) [n:127.0.0.1:32943_solr    ] o.a.s.c.c.ConnectionManager zkClient has connected
   [junit4]   2> 859203 INFO  (jetty-launcher-6290-thread-1) [n:127.0.0.1:43299_solr    ] o.a.s.c.Overseer Overseer (id=null) closing
   [junit4]   2> 859203 INFO  (jetty-launcher-6290-thread-2) [n:127.0.0.1:32943_solr    ] o.a.s.c.Overseer Overseer (id=null) closing
   [junit4]   2> 859203 INFO  (jetty-launcher-6290-thread-3) [n:127.0.0.1:34875_solr    ] o.a.s.c.Overseer Overseer (id=null) closing
   [junit4]   2> 859203 INFO  (jetty-launcher-6290-thread-1) [n:127.0.0.1:43299_solr    ] o.a.s.c.OverseerElectionContext I am going to be the leader 127.0.0.1:43299_solr
   [junit4]   2> 859203 INFO  (jetty-launcher-6290-thread-2) [n:127.0.0.1:32943_solr    ] o.a.s.c.ZkController Register node as live in ZooKeeper:/live_nodes/127.0.0.1:32943_solr
   [junit4]   2> 859203 INFO  (jetty-launcher-6290-thread-3) [n:127.0.0.1:34875_solr    ] o.a.s.c.ZkController Register node as live in ZooKeeper:/live_nodes/127.0.0.1:34875_solr
   [junit4]   2> 859203 INFO  (jetty-launcher-6290-thread-1) [n:127.0.0.1:43299_solr    ] o.a.s.c.Overseer Overseer (id=72094546207637511-127.0.0.1:43299_solr-n_0000000000) starting
   [junit4]   2> 859206 INFO  (zkCallback-6314-thread-1-processing-n:127.0.0.1:34875_solr) [n:127.0.0.1:34875_solr    ] o.a.s.c.c.ZkStateReader Updated live nodes from ZooKeeper... (0) -> (2)
   [junit4]   2> 859206 INFO  (zkCallback-6315-thread-1-processing-n:127.0.0.1:32943_solr) [n:127.0.0.1:32943_solr    ] o.a.s.c.c.ZkStateReader Updated live nodes from ZooKeeper... (0) -> (2)
   [junit4]   2> 859206 INFO  (zkCallback-6312-thread-1-processing-n:127.0.0.1:43299_solr) [n:127.0.0.1:43299_solr    ] o.a.s.c.c.ZkStateReader Updated live nodes from ZooKeeper... (0) -> (2)
   [junit4]   2> 859208 DEBUG (OverseerStateUpdate-72094546207637511-127.0.0.1:43299_solr-n_0000000000) [n:127.0.0.1:43299_solr    ] o.a.s.c.Overseer Starting to work on the main queue
   [junit4]   2> 859208 DEBUG (OverseerAutoScalingTriggerThread-72094546207637511-127.0.0.1:43299_solr-n_0000000000) [n:127.0.0.1:43299_solr    ] o.a.s.c.a.OverseerTriggerThread Adding .autoAddReplicas trigger
   [junit4]   2> 859209 DEBUG (OverseerAutoScalingTriggerThread-72094546207637511-127.0.0.1:43299_solr-n_0000000000) [n:127.0.0.1:43299_solr    ] o.a.s.c.a.OverseerTriggerThread Refreshing /autoscaling.json with znode version 1
   [junit4]   2> 859209 INFO  (jetty-launcher-6290-thread-1) [n:127.0.0.1:43299_solr    ] o.a.s.c.ZkController Register node as live in ZooKeeper:/live_nodes/127.0.0.1:43299_solr
   [junit4]   2> 859209 DEBUG (OverseerAutoScalingTriggerThread-72094546207637511-127.0.0.1:43299_solr-n_0000000000) [n:127.0.0.1:43299_solr    ] o.a.s.c.a.NodeLostTrigger Initial livenodes: [127.0.0.1:32943_solr, 127.0.0.1:34875_solr]
   [junit4]   2> 859209 DEBUG (OverseerAutoScalingTriggerThread-72094546207637511-127.0.0.1:43299_solr-n_0000000000) [n:127.0.0.1:43299_solr    ] o.a.s.c.a.OverseerTriggerThread Current znodeVersion 1, lastZnodeVersion -1
   [junit4]   2> 859209 DEBUG (OverseerStateUpdate-72094546207637511-127.0.0.1:43299_solr-n_0000000000) [n:127.0.0.1:43299_solr    ] o.a.s.c.Overseer processMessage: queueSize: 1, message = {
   [junit4]   2>   "operation":"downnode",
   [junit4]   2>   "node_name":"127.0.0.1:43299_solr"} current state version: 0
   [junit4]   2> 859209 DEBUG (OverseerStateUpdate-72094546207637511-127.0.0.1:43299_solr-n_0000000000) [n:127.0.0.1:43299_solr    ] o.a.s.c.o.NodeMutator DownNode state invoked for node: 127.0.0.1:43299_solr
   [junit4]   2> 859209 DEBUG (OverseerAutoScalingTriggerThread-72094546207637511-127.0.0.1:43299_solr-n_0000000000) [n:127.0.0.1:43299_solr    ] o.a.s.c.a.OverseerTriggerThread Processed trigger updates upto znodeVersion 1
   [junit4]   2> 859209 INFO  (zkCallback-6314-thread-1-processing-n:127.0.0.1:34875_solr) [n:127.0.0.1:34875_solr    ] o.a.s.c.c.ZkStateReader Updated live nodes from ZooKeeper... (2) -> (3)
   [junit4]   2> 859209 INFO  (zkCallback-6312-thread-1-processing-n:127.0.0.1:43299_solr) [n:127.0.0.1:43299_solr    ] o.a.s.c.c.ZkStateReader Updated live nodes from ZooKeeper... (2) -> (3)
   [junit4]   2> 859210 DEBUG (OverseerAutoScalingTriggerThread-72094546207637511-127.0.0.1:43299_solr-n_0000000000) [n:127.0.0.1:43299_solr    ] o.a.s.c.a.OverseerTriggerThread -- clean old nodeAdded markers
   [junit4]   2> 859210 DEBUG (OverseerAutoScalingTriggerThread-72094546207637511-127.0.0.1:43299_solr-n_0000000000) [n:127.0.0.1:43299_solr    ] o.a.s.c.a.OverseerTriggerThread Current znodeVersion 1, lastZnodeVersion 1
   [junit4]   2> 859210 DEBUG (ScheduledTrigger-4637-thread-1) [n:127.0.0.1:43299_solr    ] o.a.s.c.a.NodeLostTrigger Running NodeLostTrigger: .auto_add_replicas with currently live nodes: 3
   [junit4]   2> 859213 INFO  (zkCallback-6315-thread-1-processing-n:127.0.0.1:32943_solr) [n:127.0.0.1:32943_solr    ] o.a.s.c.c.ZkStateReader Updated live nodes from ZooKeeper... (2) -> (3)
   [junit4]   2> 859251 INFO  (jetty-launcher-6290-thread-1) [n:127.0.0.1:43299_solr    ] o.a.s.m.r.SolrJmxReporter JMX monitoring for 'solr_43299.solr.node' (registry 'solr.node') enabled at server: com.sun.jmx.mbeanserver.JmxMBeanServer@7b4c3c
   [junit4]   2> 859251 INFO  (jetty-launcher-6290-thread-3) [n:127.0.0.1:34875_solr    ] o.a.s.m.r.SolrJmxReporter JMX monitoring for 'solr_34875.solr.node' (registry 'solr.node') enabled at server: com.sun.jmx.mbeanserver.JmxMBeanServer@7b4c3c
   [junit4]   2> 859256 INFO  (jetty-launcher-6290-thread-1) [n:127.0.0.1:43299_solr    ] o.a.s.m.r.SolrJmxReporter JMX monitoring for 'solr_43299.solr.jvm' (registry 'solr.jvm') enabled at server: com.sun.jmx.mbeanserver.JmxMBeanServer@7b4c3c
   [junit4]   2> 859256 INFO  (jetty-launcher-6290-thread-1) [n:127.0.0.1:43299_solr    ] o.a.s.m.r.SolrJmxReporter JMX monitoring for 'solr_43299.solr.jetty' (registry 'solr.jetty') enabled at server: com.sun.jmx.mbeanserver.JmxMBeanServer@7b4c3c
   [junit4]   2> 859256 INFO  (jetty-launcher-6290-thread-3) [n:127.0.0.1:34875_solr    ] o.a.s.m.r.SolrJmxReporter JMX monitoring for 'solr_34875.solr.jvm' (registry 'solr.jvm') enabled at server: com.sun.jmx.mbeanserver.JmxMBeanServer@7b4c3c
   [junit4]   2> 859256 INFO  (jetty-launcher-6290-thread-3) [n:127.0.0.1:34875_solr    ] o.a.s.m.r.SolrJmxReporter JMX monitoring for 'solr_34875.solr.jetty' (registry 'solr.jetty') enabled at server: com.sun.jmx.mbeanserver.JmxMBeanServer@7b4c3c
   [junit4]   2> 859257 INFO  (jetty-launcher-6290-thread-3) [n:127.0.0.1:34875_solr    ] o.a.s.c.CorePropertiesLocator Found 0 core definitions underneath /home/jenkins/workspace/Lucene-Solr-7.x-Linux/solr/build/solr-core/test/J1/temp/solr.handler.admin.AutoscalingHistoryHandlerTest_3D2E790E81B5F13A-001/tempDir-001/node3/.
   [junit4]   2> 859257 INFO  (jetty-launcher-6290-thread-1) [n:127.0.0.1:43299_solr    ] o.a.s.c.CorePropertiesLocator Found 0 core definitions underneath /home/jenkins/workspace/Lucene-Solr-7.x-Linux/solr/build/solr-core/test/J1/temp/solr.handler.admin.AutoscalingHistoryHandlerTest_3D2E790E81B5F13A-001/tempDir-001/node1/.
   [junit4]   2> 859262 INFO  (jetty-launcher-6290-thread-2) [n:127.0.0.1:32943_solr    ] o.a.s.m.r.SolrJmxReporter JMX monitoring for 'solr_32943.solr.node' (registry 'solr.node') enabled at server: com.sun.jmx.mbeanserver.JmxMBeanServer@7b4c3c
   [junit4]   2> 859282 INFO  (jetty-launcher-6290-thread-2) [n:127.0.0.1:32943_solr    ] o.a.s.m.r.SolrJmxReporter JMX monitoring for 'solr_32943.solr.jvm' (registry 'solr.jvm') enabled at server: com.sun.jmx.mbeanserver.JmxMBeanServer@7b4c3c
   [junit4]   2> 859282 INFO  (jetty-launcher-6290-thread-2) [n:127.0.0.1:32943_solr    ] o.a.s.m.r.SolrJmxReporter JMX monitoring for 'solr_32943.solr.jetty' (registry 'solr.jetty') enabled at server: com.sun.jmx.mbeanserver.JmxMBeanServer@7b4c3c
   [junit4]   2> 859283 INFO  (jetty-launcher-6290-thread-2) [n:127.0.0.1:32943_solr    ] o.a.s.c.CorePropertiesLocator Found 0 core definitions underneath /home/jenkins/workspace/Lucene-Solr-7.x-Linux/solr/build/solr-core/test/J1/temp/solr.handler.admin.AutoscalingHistoryHandlerTest_3D2E790E81B5F13A-001/tempDir-001/node2/.
   [junit4]   2> 859333 INFO  (zkConnectionManagerCallback-6325-thread-1) [    ] o.a.s.c.c.ConnectionManager zkClient has connected
   [junit4]   2> 859335 INFO  (zkConnectionManagerCallback-6329-thread-1) [    ] o.a.s.c.c.ConnectionManager zkClient has connected
   [junit4]   2> 859337 INFO  (SUITE-AutoscalingHistoryHandlerTest-seed#[3D2E790E81B5F13A]-worker) [    ] o.a.s.c.c.ZkStateReader Updated live nodes from ZooKeeper... (0) -> (3)
   [junit4]   2> 859337 INFO  (SUITE-AutoscalingHistoryHandlerTest-seed#[3D2E790E81B5F13A]-worker) [    ] o.a.s.c.s.i.ZkClientClusterStateProvider Cluster at 127.0.0.1:37737/solr ready
   [junit4]   2> 859339 INFO  (qtp70290453-18793) [n:127.0.0.1:32943_solr    ] o.a.s.h.a.CollectionsHandler Invoked Collection Action :create with params replicationFactor=3&name=AutoscalingHistoryHandlerTest_collection&nrtReplicas=3&action=CREATE&numShards=1&wt=javabin&version=2 and sendToOCPQueue=true
   [junit4]   2> 859340 INFO  (OverseerThreadFactory-4639-thread-1-processing-n:127.0.0.1:43299_solr) [n:127.0.0.1:43299_solr    ] o.a.s.c.a.c.CreateCollectionCmd Create collection AutoscalingHistoryHandlerTest_collection
   [junit4]   2> 859340 INFO  (OverseerThreadFactory-4639-thread-1-processing-n:127.0.0.1:43299_solr) [n:127.0.0.1:43299_solr    ] o.a.s.c.c.ZkConfigManager Copying zk node /configs/_default/protwords.txt to /configs/AutoscalingHistoryHandlerTest_collection.AUTOCREATED/protwords.txt
   [junit4]   2> 859341 INFO  (OverseerThreadFactory-4639-thread-1-processing-n:127.0.0.1:43299_solr) [n:127.0.0.1:43299_solr    ] o.a.s.c.c.ZkConfigManager Copying zk node /configs/_default/managed-schema to /configs/AutoscalingHistoryHandlerTest_collection.AUTOCREATED/managed-schema
   [junit4]   2> 859341 INFO  (OverseerThreadFactory-4639-thread-1-processing-n:127.0.0.1:43299_solr) [n:127.0.0.1:43299_solr    ] o.a.s.c.c.ZkConfigManager Copying zk node /configs/_default/solrconfig.xml to /configs/AutoscalingHistoryHandlerTest_collection.AUTOCREATED/solrconfig.xml
   [junit4]   2> 859342 INFO  (OverseerThreadFactory-4639-thread-1-processing-n:127.0.0.1:43299_solr) [n:127.0.0.1:43299_solr    ] o.a.s.c.c.ZkConfigManager Copying zk node /configs/_default/synonyms.txt to /configs/AutoscalingHistoryHandlerTest_collection.AUTOCREATED/synonyms.txt
   [junit4]   2> 859343 INFO  (OverseerThreadFactory-4639-thread-1-processing-n:127.0.0.1:43299_solr) [n:127.0.0.1:43299_solr    ] o.a.s.c.c.ZkConfigManager Copying zk node /configs/_default/stopwords.txt to /configs/AutoscalingHistoryHandlerTest_collection.AUTOCREATED/stopwords.txt
   [junit4]   2> 859343 INFO  (OverseerThreadFactory-4639-thread-1-processing-n:127.0.0.1:43299_solr) [n:127.0.0.1:43299_solr    ] o.a.s.c.c.ZkConfigManager Copying zk node /configs/_default/lang/contractions_it.txt to /configs/AutoscalingHistoryHandlerTest_collection.AUTOCREATED/lang/contractions_it.txt
   [junit4]   2> 859344 INFO  (OverseerThreadFactory-4639-thread-1-processing-n:127.0.0.1:43299_solr) [n:127.0.0.1:43299_solr    ] o.a.s.c.c.ZkConfigManager Copying zk node /configs/_default/lang/stemdict_nl.txt to /configs/AutoscalingHistoryHandlerTest_collection.AUTOCREATED/lang/stemdict_nl.txt
   [junit4]   2> 859344 INFO  (OverseerThreadFactory-4639-thread-1-processing-n:127.0.0.1:43299_solr) [n:127.0.0.1:43299_solr    ] o.a.s.c.c.ZkConfigManager Copying zk node /configs/_default/lang/stopwords_hy.txt to /configs/AutoscalingHistoryHandlerTest_collection.AUTOCREATED/lang/stopwords_hy.txt
   [junit4]   2> 859344 INFO  (OverseerThreadFactory-4639-thread-1-processing-n:127.0.0.1:43299_solr) [n:127.0.0.1:43299_solr    ] o.a.s.c.c.ZkConfigManager Copying zk node /configs/_default/lang/stopwords_no.txt to /configs/AutoscalingHistoryHandlerTest_collection.AUTOCREATED/lang/stopwords_no.txt
   [junit4]   2> 859345 INFO  (OverseerThreadFactory-4639-thread-1-processing-n:127.0.0.1:43299_solr) [n:127.0.0.1:43299_solr    ] o.a.s.c.c.ZkConfigManager Copying zk node /configs/_default/lang/contractions_ca.txt to /configs/AutoscalingHistoryHandlerTest_collection.AUTOCREATED/lang/contractions_ca.txt
   [junit4]   2> 859345 INFO  (OverseerThreadFactory-4639-thread-1-processing-n:127.0.0.1:43299_solr) [n:127.0.0.1:43299_solr    ] o.a.s.c.c.ZkConfigManager Copying zk node /configs/_default/lang/stopwords_id.txt to /configs/AutoscalingHistoryHandlerTest_collection.AUTOCREATED/lang/stopwords_id.txt
   [junit4]   2> 859346 INFO  (OverseerThreadFactory-4639-thread-1-processing-n:127.0.0.1:43299_solr) [n:127.0.0.1:43299_solr    ] o.a.s.c.c.ZkConfigManager Copying zk node /configs/_default/lang/stopwords_ga.txt to /configs/AutoscalingHistoryHandlerTest_collection.AUTOCREATED/lang/stopwords_ga.txt
   [junit4]   2> 859346 INFO  (OverseerThreadFactory-4639-thread-1-processing-n:127.0.0.1:43299_solr) [n:127.0.0.1:43299_solr    ] o.a.s.c.c.ZkConfigManager Copying zk node /configs/_default/lang/stopwords_hi.txt to /configs/AutoscalingHistoryHandlerTest_collection.AUTOCREATED/lang/stopwords_hi.txt
   [junit4]   2> 859347 INFO  (OverseerThreadFactory-4639-thread-1-processing-n:127.0.0.1:43299_solr) [n:127.0.0.1:43299_solr    ] o.a.s.c.c.ZkConfigManager Copying zk node /configs/_default/lang/stopwords_da.txt to /configs/AutoscalingHistoryHandlerTest_collection.AUTOCREATED/lang/stopwords_da.txt
   [junit4]   2> 859347 INFO  (OverseerThreadFactory-4639-thread-1-processing-n:127.0.0.1:43299_solr) [n:127.0.0.1:43299_solr    ] o.a.s.c.c.ZkConfigManager Copying zk node /configs/_default/lang/stopwords_ja.txt to /configs/AutoscalingHistoryHandlerTest_collection.AUTOCREATED/lang/stopwords_ja.txt
   [junit4]   2> 859348 INFO  (OverseerThreadFactory-4639-thread-1-processing-n:127.0.0.1:43299_solr) [n:127.0.0.1:43299_solr    ] o.a.s.c.c.ZkConfigManager Copying zk node /configs/_default/lang/stopwords_pt.txt to /configs/AutoscalingHistoryHandlerTest_collection.AUTOCREATED/lang/stopwords_pt.txt
   [junit4]   2> 859348 INFO  (OverseerThreadFactory-4639-thread-1-processing-n:127.0.0.1:43299_solr) [n:127.0.0.1:43299_solr    ] o.a.s.c.c.ZkConfigManager Copying zk node /configs/_default/lang/stopwords_hu.txt to /configs/AutoscalingHistoryHandlerTest_collection.AUTOCREATED/lang/stopwords_hu.txt
   [junit4]   2> 859348 INFO  (OverseerThreadFactory-4639-thread-1-processing-n:127.0.0.1:43299_solr) [n:127.0.0.1:43299_solr    ] o.a.s.c.c.ZkConfigManager Copying zk node /configs/_default/lang/stopwords_el.txt to /configs/AutoscalingHistoryHandlerTest_collection.AUTOCREATED/lang/stopwords_el.txt
   [junit4]   2> 859349 INFO  (OverseerThreadFactory-4639-thread-1-processing-n:127.0.0.1:43299_solr) [n:127.0.0.1:43299_solr    ] o.a.s.c.c.ZkConfigManager Copying zk node /configs/_default/lang/stopwords_ru.txt to /configs/AutoscalingHistoryHandlerTest_collection.AUTOCREATED/lang/stopwords_ru.txt
   [junit4]   2> 859349 INFO  (OverseerThreadFactory-4639-thread-1-processing-n:127.0.0.1:43299_solr) [n:127.0.0.1:43299_solr    ] o.a.s.c.c.ZkConfigManager Copying zk node /configs/_default/lang/stopwords_tr.txt to /configs/AutoscalingHistoryHandlerTest_collection.AUTOCREATED/lang/stopwords_tr.txt
   [junit4]   2> 859350 INFO  (OverseerThreadFactory-4639-thread-1-processing-n:127.0.0.1:43299_solr) [n:127.0.0.1:43299_solr    ] o.a.s.c.c.ZkConfigManager Copying zk node /configs/_default/lang/stopwords_ar.txt to /configs/AutoscalingHistoryHandlerTest_collection.AUTOCREATED/lang/stopwords_ar.txt
   [junit4]   2> 859350 INFO  (OverseerThreadFactory-4639-thread-1-processing-n:127.0.0.1:43299_solr) [n:127.0.0.1:43299_solr    ] o.a.s.c.c.ZkConfigManager Copying zk node /configs/_default/lang/userdict_ja.txt to /configs/AutoscalingHistoryHandlerTest_collection.AUTOCREATED/lang/userdict_ja.txt
   [junit4]   2> 859351 INFO  (OverseerThreadFactory-4639-thread-1-processing-n:127.0.0.1:43299_solr) [n:127.0.0.1:43299_solr    ] o.a.s.c.c.ZkConfigManager Copying zk node /configs/_default/lang/stopwords_eu.txt to /configs/AutoscalingHistoryHandlerTest_collection.AUTOCREATED/lang/stopwords_eu.txt
   [junit4]   2> 859351 INFO  (OverseerThreadFactory-4639-thread-1-processing-n:127.0.0.1:43299_solr) [n:127.0.0.1:43299_solr    ] o.a.s.c.c.ZkConfigManager Copying zk node /configs/_default/lang/stopwords_it.txt to /configs/AutoscalingHistoryHandlerTest_collection.AUTOCREATED/lang/stopwords_it.txt
   [junit4]   2> 859352 INFO  (OverseerThreadFactory-4639-thread-1-processing-n:127.0.0.1:43299_solr) [n:127.0.0.1:43299_solr    ] o.a.s.c.c.ZkConfigManager Copying zk node /configs/_default/lang/stopwords_cz.txt to /configs/AutoscalingHistoryHandlerTest_collection.AUTOCREATED/lang/stopwords_cz.txt
   [junit4]   2> 859352 INFO  (OverseerThreadFactory-4639-thread-1-processing-n:127.0.0.1:43299_solr) [n:127.0.0.1:43299_solr    ] o.a.s.c.c.ZkConfigManager Copying zk node /configs/_default/lang/stoptags_ja.txt to /configs/AutoscalingHistoryHandlerTest_collection.AUTOCREATED/lang/stoptags_ja.txt
   [junit4]   2> 859353 INFO  (OverseerThreadFactory-4639-thread-1-processing-n:127.0.0.1:43299_solr) [n:127.0.0.1:43299_solr    ] o.a.s.c.c.ZkConfigManager Copying zk node /configs/_default/lang/contractions_fr.txt to /configs/AutoscalingHistoryHandlerTest_collection.AUTOCREATED/lang/contractions_fr.txt
   [junit4]   2> 859353 INFO  (OverseerThreadFactory-4639-thread-1-processing-n:127.0.0.1:43299_solr) [n:127.0.0.1:43299_solr    ] o.a.s.c.c.ZkConfigManager Copying zk node /configs/_default/lang/stopwords_de.txt to /configs/AutoscalingHistoryHandlerTest_collection.AUTOCREATED/lang/stopwords_de.txt
   [junit4]   2> 859354 INFO  (OverseerThreadFactory-4639-thread-1-processing-n:127.0.0.1:43299_solr) [n:127.0.0.1:43299_solr    ] o.a.s.c.c.ZkConfigManager Copying zk node /configs/_default/lang/stopwords_fa.txt to /configs/AutoscalingHistoryHandlerTest_collection.AUTOCREATED/lang/stopwords_fa.txt
   [junit4]   2> 859354 INFO  (OverseerThreadFactory-4639-thread-1-processing-n:127.0.0.1:43299_solr) [n:127.0.0.1:43299_solr    ] o.a.s.c.c.ZkConfigManager Copying zk node /configs/_default/lang/contractions_ga.txt to /configs/AutoscalingHistoryHandlerTest_collection.AUTOCREATED/lang/contractions_ga.txt
   [junit4]   2> 859355 INFO  (OverseerThreadFactory-4639-thread-1-processing-n:127.0.0.1:43299_solr) [n:127.0.0.1:43299_solr    ] o.a.s.c.c.ZkConfigManager Copying zk node /configs/_default/lang/stopwords_ca.txt to /configs/AutoscalingHistoryHandlerTest_collection.AUTOCREATED/lang/stopwords_ca.txt
   [junit4]   2> 859355 INFO  (OverseerThreadFactory-4639-thread-1-processing-n:127.0.0.1:43299_solr) [n:127.0.0.1:43299_solr    ] o.a.s.c.c.ZkConfigManager Copying zk node /configs/_default/lang/stopwords_nl.txt to /configs/AutoscalingHistoryHandlerTest_collection.AUTOCREATED/lang/stopwords_nl.txt
   [junit4]   2> 859356 INFO  (OverseerThreadFactory-4639-thread-1-processing-n:127.0.0.1:43299_solr) [n:127.0.0.1:43299_solr    ] o.a.s.c.c.ZkConfigManager Copying zk node /configs/_default/lang/stopwords_bg.txt to /configs/AutoscalingHistoryHandlerTest_collection.AUTOCREATED/lang/stopwords_bg.txt
   [junit4]   2> 859356 INFO  (OverseerThreadFactory-4639-thread-1-processing-n:127.0.0.1:43299_solr) [n:127.0.0.1:43299_solr    ] o.a.s.c.c.ZkConfigManager Copying zk node /configs/_default/lang/stopwords_lv.txt to /configs/AutoscalingHistoryHandlerTest_collection.AUTOCREATED/lang/stopwords_lv.txt
   [junit4]   2> 859357 INFO  (OverseerThreadFactory-4639-thread-1-processing-n:127.0.0.1:43299_solr) [n:127.0.0.1:43299_solr    ] o.a.s.c.c.ZkConfigManager Copying zk node /configs/_default/lang/stopwords_en.txt to /configs/AutoscalingHistoryHandlerTest_collection.AUTOCREATED/lang/stopwords_en.txt
   [junit4]   2> 859357 INFO  (OverseerThreadFactory-4639-thread-1-processing-n:127.0.0.1:43299_solr) [n:127.0.0.1:43299_solr    ] o.a.s.c.c.ZkConfigManager Copying zk node /configs/_default/lang/stopwords_es.txt to /configs/AutoscalingHistoryHandlerTest_collection.AUTOCREATED/lang/stopwords_es.txt
   [junit4]   2> 859358 INFO  (OverseerThreadFactory-4639-thread-1-processing-n:127.0.0.1:43299_solr) [n:127.0.0.1:43299_solr    ] o.a.s.c.c.ZkConfigManager Copying zk node /configs/_default/lang/stopwords_th.txt to /configs/AutoscalingHistoryHandlerTest_collection.AUTOCREATED/lang/stopwords_th.txt
   [junit4]   2> 859358 INFO  (OverseerThreadFactory-4639-thread-1-processing-n:127.0.0.1:43299_solr) [n:127.0.0.1:43299_solr    ] o.a.s.c.c.ZkConfigManager Copying zk node /configs/_default/lang/stopwords_ro.txt to /configs/AutoscalingHistoryHandlerTest_collection.AUTOCREATED/lang/stopwords_ro.txt
   [junit4]   2> 859359 INFO  (OverseerThreadFactory-4639-thread-1-processing-n:127.0.0.1:43299_solr) [n:127.0.0.1:43299_solr    ] o.a.s.c.c.ZkConfigManager Copying zk node /configs/_default/lang/stopwords_fr.txt to /configs/AutoscalingHistoryHandlerTest_collection.AUTOCREATED/lang/stopwords_fr.txt
   [junit4]   2> 859359 INFO  (OverseerThreadFactory-4639-thread-1-processing-n:127.0.0.1:43299_solr) [n:127.0.0.1:43299_solr    ] o.a.s.c.c.ZkConfigManager Copying zk node /configs/_default/lang/stopwords_sv.txt to /configs/AutoscalingHistoryHandlerTest_collection.AUTOCREATED/lang/stopwords_sv.txt
   [junit4]   2> 859359 INFO  (OverseerThreadFactory-4639-thread-1-processing-n:127.0.0.1:43299_solr) [n:127.0.0.1:43299_solr    ] o.a.s.c.c.ZkConfigManager Copying zk node /configs/_default/lang/stopwords_fi.txt to /configs/AutoscalingHistoryHandlerTest_collection.AUTOCREATED/lang/stopwords_fi.txt
   [junit4]   2> 859360 INFO  (OverseerThreadFactory-4639-thread-1-processing-n:127.0.0.1:43299_solr) [n:127.0.0.1:43299_solr    ] o.a.s.c.c.ZkConfigManager Copying zk node /configs/_default/lang/hyphenations_ga.txt to /configs/AutoscalingHistoryHandlerTest_collection.AUTOCREATED/lang/hyphenations_ga.txt
   [junit4]   2> 859360 INFO  (OverseerThreadFactory-4639-thread-1-processing-n:127.0.0.1:43299_solr) [n:127.0.0.1:43299_solr    ] o.a.s.c.c.ZkConfigManager Copying zk node /configs/_default/lang/stopwords_gl.txt to /configs/AutoscalingHistoryHandlerTest_collection.AUTOCREATED/lang/stopwords_gl.txt
   [junit4]   2> 859361 INFO  (OverseerThreadFactory-4639-thread-1-processing-n:127.0.0.1:43299_solr) [n:127.0.0.1:43299_solr    ] o.a.s.c.c.ZkConfigManager Copying zk node /configs/_default/params.json to /configs/AutoscalingHistoryHandlerTest_collection.AUTOCREATED/params.json
   [junit4]   2> 859363 DEBUG (OverseerStateUpdate-72094546207637511-127.0.0.1:43299_solr-n_0000000000) [n:127.0.0.1:43299_solr    ] o.a.s.c.Overseer processMessage: queueSize: 1, message = {
   [junit4]   2>   "name":"AutoscalingHistoryHandlerTest_collection",
   [junit4]   2>   "fromApi":"true",
   [junit4]   2>   "replicationFactor":"3",
   [junit4]   2>   "numShards":"1",
   [junit4]   2>   "nrtReplicas":"3",
   [junit4]   2>   "stateFormat":"2",
   [junit4]   2>   "operation":"create"} current state version: 0
   [junit4]   2> 859363 DEBUG (OverseerStateUpdate-72094546207637511-127.0.0.1:43299_solr-n_0000000000) [n:127.0.0.1:43299_solr    ] o.a.s.c.o.ClusterStateMutator building a new cName: AutoscalingHistoryHandlerTest_collection
   [junit4]   2> 859363 DEBUG (OverseerStateUpdate-72094546207637511-127.0.0.1:43299_solr-n_0000000000) [n:127.0.0.1:43299_solr    ] o.a.s.c.o.ZkStateWriter going to create_collection /collections/AutoscalingHistoryHandlerTest_collection/state.json
   [junit4]   2> 859467 DEBUG (OverseerStateUpdate-72094546207637511-127.0.0.1:43299_solr-n_0000000000) [n:127.0.0.1:43299_solr    ] o.a.s.c.Overseer processMessage: queueSize: 1, message = {
   [junit4]   2>   "operation":"ADDREPLICA",
   [junit4]   2>   "collection":"AutoscalingHistoryHandlerTest_collection",
   [junit4]   2>   "shard":"shard1",
   [junit4]   2>   "core":"AutoscalingHistoryHandlerTest_collection_shard1_replica_n1",
   [junit4]   2>   "state":"down",
   [junit4]   2>   "base_url":"http://127.0.0.1:34875/solr",
   [junit4]   2>   "type":"NRT",
   [junit4]   2>   "waitForFinalState":"false"} current state version: 0
   [junit4]   2> 859467 INFO  (OverseerStateUpdate-72094546207637511-127.0.0.1:43299_solr-n_0000000000) [n:127.0.0.1:43299_solr    ] o.a.s.c.o.SliceMutator createReplica() {
   [junit4]   2>   "operation":"ADDREPLICA",
   [junit4]   2>   "collection":"AutoscalingHistoryHandlerTest_collection",
   [junit4]   2>   "shard":"shard1",
   [junit4]   2>   "core":"AutoscalingHistoryHandlerTest_collection_shard1_replica_n1",
   [junit4]   2>   "state":"down",
   [junit4]   2>   "base_url":"http://127.0.0.1:34875/solr",
   [junit4]   2>   "type":"NRT",
   [junit4]   2>   "waitForFinalState":"false"} 
   [junit4]   2> 859468 DEBUG (OverseerStateUpdate-72094546207637511-127.0.0.1:43299_solr-n_0000000000) [n:127.0.0.1:43299_solr    ] o.a.s.c.o.SliceMutator Old Slice: shard1:{
   [junit4]   2>   "range":"80000000-7fffffff",
   [junit4]   2>   "state":"active",
   [junit4]   2>   "replicas":{}}
   [junit4]   2> 859468 DEBUG (OverseerStateUpdate-72094546207637511-127.0.0.1:43299_solr-n_0000000000) [n:127.0.0.1:43299_solr    ] o.a.s.c.o.SliceMutator New Slice: shard1:{
   [junit4]   2>   "range":"80000000-7fffffff",
   [junit4]   2>   "state":"active",
   [junit4]   2>   "replicas":{"core_node3":{
   [junit4]   2>       "core":"AutoscalingHistoryHandlerTest_collection_shard1_replica_n1",
   [junit4]   2>       "base_url":"http://127.0.0.1:34875/solr",
   [junit4]   2>       "state":"down",
   [junit4]   2>       "node_name":null,
   [junit4]   2>       "type":"NRT"}}}
   [junit4]   2> 859468 DEBUG (OverseerStateUpdate-72094546207637511-127.0.0.1:43299_solr-n_0000000000) [n:127.0.0.1:43299_solr    ] o.a.s.c.Overseer processMessage: queueSize: 2, message = {
   [junit4]   2>   "operation":"ADDREPLICA",
   [junit4]   2>   "collection":"AutoscalingHistoryHandlerTest_collection",
   [junit4]   2>   "shard":"shard1",
   [junit4]   2>   "core":"AutoscalingHistoryHandlerTest_collection_shard1_replica_n2",
   [junit4]   2>   "state":"down",
   [junit4]   2>   "base_url":"http://127.0.0.1:43299/solr",
   [junit4]   2>   "type":"NRT",
   [junit4]   2>   "waitForFinalState":"false"} current state version: 0
   [junit4]   2> 859468 INFO  (OverseerStateUpdate-72094546207637511-127.0.0.1:43299_solr-n_0000000000) [n:127.0.0.1:43299_solr    ] o.a.s.c.o.SliceMutator createReplica() {
   [junit4]   2>   "operation":"ADDREPLICA",
   [junit4]   2>   "collection":"AutoscalingHistoryHandlerTest_collection",
   [junit4]   2>   "shard":"shard1",
   [junit4]   2>   "core":"AutoscalingHistoryHandlerTest_collection_shard1_replica_n2",
   [junit4]   2>   "state":"down",
   [junit4]   2>   "base_url":"http://127.0.0.1:43299/solr",
   [junit4]   2>   "type":"NRT",
   [junit4]   2>   "waitForFinalState":"false"} 
   [junit4]   2> 859469 DEBUG (OverseerStateUpdate-72094546207637511-127.0.0.1:43299_solr-n_0000000000) [n:127.0.0.1:43299_solr    ] o.a.s.c.o.SliceMutator Old Slice: shard1:{
   [junit4]   2>   "range":"80000000-7fffffff",
   [junit4]   2>   "state":"active",
   [junit4]   2>   "replicas":{"core_node3":{
   [junit4]   2>       "core":"AutoscalingHistoryHandlerTest_collection_shard1_replica_n1",
   [junit4]   2>       "base_url":"http://127.0.0.1:34875/solr",
   [junit4]   2>       "state":"down",
   [junit4]   2>       "node_name":null,
   [junit4]   2>       "type":"NRT"}}}
   [junit4]   2> 859469 DEBUG (OverseerStateUpdate-72094546207637511-127.0.0.1:43299_solr-n_0000000000) [n:127.0.0.1:43299_solr    ] o.a.s.c.o.SliceMutator New Slice: shard1:{
   [junit4]   2>   "range":"80000000-7fffffff",
   [junit4]   2>   "state":"active",
   [junit4]   2>   "replicas":{
   [junit4]   2>     "core_node3":{
   [junit4]   2>       "core":"AutoscalingHistoryHandlerTest_collection_shard1_replica_n1",
   [junit4]   2>       "base_url":"http://127.0.0.1:34875/solr",
   [junit4]   2>       "state":"down",
   [junit4]   2>       "node_name":null,
   [junit4]   2>       "type":"NRT"},
   [junit4]   2>     "core_node5":{
   [junit4]   2>       "core":"AutoscalingHistoryHandlerTest_collection_shard1_replica_n2",
   [junit4]   2>       "base_url":"http://127.0.0.1:43299/solr",
   [junit4]   2>       "state":"down",
   [junit4]   2>       "node_name":null,
   [junit4]   2>       "type":"NRT"}}}
   [junit4]   2> 859469 DEBUG (OverseerStateUpdate-72094546207637511-127.0.0.1:43299_solr-n_0000000000) [n:127.0.0.1:43299_solr    ] o.a.s.c.Overseer processMessage: queueSize: 3, message = {
   [junit4]   2>   "operation":"ADDREPLICA",
   [junit4]   2>   "collection":"AutoscalingHistoryHandlerTest_collection",
   [junit4]   2>   "shard":"shard1",
   [junit4]   2>   "core":"AutoscalingHistoryHandlerTest_collection_shard1_replica_n4",
   [junit4]   2>   "state":"down",
   [junit4]   2>   "base_url":"http://127.0.0.1:32943/solr",
   [junit4]   2>   "type":"NRT",
   [junit4]   2>   "waitForFinalState":"false"} current state version: 0
   [junit4]   2> 859469 INFO  (OverseerStateUpdate-72094546207637511-127.0.0.1:43299_solr-n_0000000000) [n:127.0.0.1:43299_solr    ] o.a.s.c.o.SliceMutator createReplica() {
   [junit4]   2>   "operation":"ADDREPLICA",
   [junit4]   2>   "collection":"AutoscalingHistoryHandlerTest_collection",
   [junit4]   2>   "shard":"shard1",
   [junit4]   2>   "core":"AutoscalingHistoryHandlerTest_collection_shard1_replica_n4",
   [junit4]   2>   "state":"down",
   [junit4]   2>   "base_url":"http://127.0.0.1:32943/solr",
   [junit4]   2>   "type":"NRT",
   [junit4]   2>   "waitForFinalState":"false"} 
   [junit4]   2> 859469 DEBUG (OverseerStateUpdate-72094546207637511-127.0.0.1:43299_solr-n_0000000000) [n:127.0.0.1:43299_solr    ] o.a.s.c.o.SliceMutator Old Slice: shard1:{
   [junit4]   2>   "range":"80000000-7fffffff",
   [junit4]   2>   "state":"active",
   [junit4]   2>   "replicas":{
   [junit4]   2>     "core_node3":{
   [junit4]   2>       "core":"AutoscalingHistoryHandlerTest_collection_shard1_replica_n1",
   [junit4]   2>       "base_url":"http://127.0.0.1:34875/solr",
   [junit4]   2>       "state":"down",
   [junit4]   2>       "node_name":null,
   [junit4]   2>       "type":"NRT"},
   [junit4]   2>     "core_node5":{
   [junit4]   2>       "core":"AutoscalingHistoryHandlerTest_collection_shard1_replica_n2",
   [junit4]   2>       "base_url":"http://127.0.0.1:43299/solr",
   [junit4]   2>       "state":"down",
   [junit4]   2>       "node_name":null,
   [junit4]   2>       "type":"NRT"}}}
   [junit4]   2> 859469 DEBUG (OverseerStateUpdate-72094546207637511-127.0.0.1:43299_solr-n_0000000000) [n:127.0.0.1:43299_solr    ] o.a.s.c.o.SliceMutator New Slice: shard1:{
   [junit4]   2>   "range":"80000000-7fffffff",
   [junit4]   2>   "state":"active",
   [junit4]   2>   "replicas":{
   [junit4]   2>     "core_node3":{
   [junit4]   2>       "core":"AutoscalingHistoryHandlerTest_collection_shard1_replica_n1",
   [junit4]   2>       "base_url":"http://127.0.0.1:34875/solr",
   [junit4]   2>       "state":"down",
   [junit4]   2>       "node_name":null,
   [junit4]   2>       "type":"NRT"},
   [junit4]   2>     "core_node5":{
   [junit4]   2>       "core":"AutoscalingHistoryHandlerTest_collection_shard1_replica_n2",
   [junit4]   2>       "base_url":"http://127.0.0.1:43299/solr",
   [junit4]   2>       "state":"down",
   [junit4]   2>       "node_name":null,
   [junit4]   2>       "type":"NRT"},
   [junit4]   2>     "core_node6":{
   [junit4]   2>       "core":"AutoscalingHistoryHandlerTest_collection_shard1_replica_n4",
   [junit4]   2>       "base_url":"http://127.0.0.1:32943/solr",
   [junit4]   2>       "state":"down",
   [junit4]   2>       "node_name":null,
   [junit4]   2>       "type":"NRT"}}}
   [junit4]   2> 859570 DEBUG (OverseerStateUpdate-72094546207637511-127.0.0.1:43299_solr-n_0000000000) [n:127.0.0.1:43299_solr    ] o.a.s.c.o.ZkStateWriter going to update_collection /collections/AutoscalingHistoryHandlerTest_collection/state.json version: 0
   [junit4]   2> 859671 INFO  (qtp70290453-18814) [n:127.0.0.1:32943_solr    ] o.a.s.h.a.CoreAdminOperation core create command qt=/admin/cores&coreNodeName=core_node6&collection.configName=AutoscalingHistoryHandlerTest_collection.AUTOCREATED&newCollection=true&name=AutoscalingHistoryHandlerTest_collection_shard1_replica_n4&action=CREATE&numShards=1&collection=AutoscalingHistoryHandlerTest_collection&shard=shard1&wt=javabin&version=2&replicaType=NRT
   [junit4]   2> 859671 INFO  (qtp1879398340-18794) [n:127.0.0.1:43299_solr    ] o.a.s.h.a.CoreAdminOperation core create command qt=/admin/cores&coreNodeName=core_node5&collection.configName=AutoscalingHistoryHandlerTest_collection.AUTOCREATED&newCollection=true&name=AutoscalingHistoryHandlerTest_collection_shard1_replica_n2&action=CREATE&numShards=1&collection=AutoscalingHistoryHandlerTest_collection&shard=shard1&wt=javabin&version=2&replicaType=NRT
   [junit4]   2> 859671 INFO  (qtp72739325-18797) [n:127.0.0.1:34875_solr    ] o.a.s.h.a.CoreAdminOperation core create command qt=/admin/cores&coreNodeName=core_node3&collection.configName=AutoscalingHistoryHandlerTest_collection.AUTOCREATED&newCollection=true&name=AutoscalingHistoryHandlerTest_collection_shard1_replica_n1&action=CREATE&numShards=1&collection=AutoscalingHistoryHandlerTest_collection&shard=shard1&wt=javabin&version=2&replicaType=NRT
   [junit4]   2> 859671 INFO  (qtp70290453-18814) [n:127.0.0.1:32943_solr    ] o.a.s.c.TransientSolrCoreCacheDefault Allocating transient cache for 2147483647 transient cores
   [junit4]   2> 859672 INFO  (qtp1879398340-18794) [n:127.0.0.1:43299_solr    ] o.a.s.c.TransientSolrCoreCacheDefault Allocating transient cache for 2147483647 transient cores
   [junit4]   2> 859672 INFO  (qtp72739325-18797) [n:127.0.0.1:34875_solr    ] o.a.s.c.TransientSolrCoreCacheDefault Allocating transient cache for 2147483647 transient cores
   [junit4]   2> 859673 DEBUG (OverseerStateUpdate-72094546207637511-127.0.0.1:43299_solr-n_0000000000) [n:127.0.0.1:43299_solr    ] o.a.s.c.Overseer processMessage: queueSize: 2, message = {
   [junit4]   2>   "core":"AutoscalingHistoryHandlerTest_collection_shard1_replica_n4",
   [junit4]   2>   "core_node_name":"core_node6",
   [junit4]   2>   "roles":null,
   [junit4]   2>   "base_url":"http://127.0.0.1:32943/solr",
   [junit4]   2>   "node_name":"127.0.0.1:32943_solr",
   [junit4]   2>   "numShards":"1",
   [junit4]   2>   "state":"down",
   [junit4]   2>   "shard":"shard1",
   [junit4]   2>   "collection":"AutoscalingHistoryHandlerTest_collection",
   [junit4]   2>   "type":"NRT",
   [junit4]   2>   "operation":"state"} current state version: 0
   [junit4]   2> 859673 DEBUG (OverseerStateUpdate-72094546207637511-127.0.0.1:43299_solr-n_0000000000) [n:127.0.0.1:43299_solr    ] o.a.s.c.o.ReplicaMutator Update state numShards=1 message={
   [junit4]   2>   "core":"AutoscalingHistoryHandlerTest_collection_shard1_replica_n4",
   [junit4]   2>   "core_node_name":"core_node6",
   [junit4]   2>   "roles":null,
   [junit4]   2>   "base_url":"http://127.0.0.1:32943/solr",
   [junit4]   2>   "node_name":"127.0.0.1:32943_solr",
   [junit4]   2>   "numShards":"1",
   [junit4]   2>   "state":"down",
   [junit4]   2>   "shard":"shard1",
   [junit4]   2>   "collection":"AutoscalingHistoryHandlerTest_collection",
   [junit4]   2>   "type":"NRT",
   [junit4]   2>   "operation":"state"}
   [junit4]   2> 859673 DEBUG (OverseerStateUpdate-72094546207637511-127.0.0.1:43299_solr-n_0000000000) [n:127.0.0.1:43299_solr    ] o.a.s.c.o.ReplicaMutator Will update state for replica: core_node6:{"core":"AutoscalingHistoryHandlerTest_collection_shard1_replica_n4","base_url":"http://127.0.0.1:32943/solr","node_name":"127.0.0.1:32943_solr","state":"down","type":"NRT"}
   [junit4]   2> 859673 DEBUG (OverseerStateUpdate-72094546207637511-127.0.0.1:43299_solr-n_0000000000) [n:127.0.0.1:43299_solr    ] o.a.s.c.o.ReplicaMutator Collection is now: DocCollection(AutoscalingHistoryHandlerTest_collection//collections/AutoscalingHistoryHandlerTest_collection/state.json/1)={
   [junit4]   2>   "pullReplicas":"0",
   [junit4]   2>   "replicationFactor":"3",
   [junit4]   2>   "router":{"name":"compositeId"},
   [junit4]   2>   "maxShardsPerNode":"1",
   [junit4]   2>   "autoAddReplicas":"false",
   [junit4]   2>   "nrtReplicas":"3",
   [junit4]   2>   "tlogReplicas":"0",
   [junit4]   2>   "shards":{"shard1":{
   [junit4]   2>       "range":"80000000-7fffffff",
   [junit4]   2>       "state":"active",
   [junit4]   2>       "replicas":{
   [junit4]   2>         "core_node3":{
   [junit4]   2>           "core":"AutoscalingHistoryHandlerTest_collection_shard1_replica_n1",
   [junit4]   2>           "base_url":"http://127.0.0.1:34875/solr",
   [junit4]   2>           "state":"down",
   [junit4]   2>           "node_name":null,
   [junit4]   2>           "type":"NRT"},
   [junit4]   2>         "core_node5":{
   [junit4]   2>           "core":"AutoscalingHistoryHandlerTest_collection_shard1_replica_n2",
   [junit4]   2>           "base_url":"http://127.0.0.1:43299/solr",
   [junit4]   2>           "state":"down",
   [junit4]   2>           "node_name":null,
   [junit4]   2>           "type":"NRT"},
   [junit4]   2>         "core_node6":{
   [junit4]   2>           "core":"AutoscalingHistoryHandlerTest_collection_shard1_replica_n4",
   [junit4]   2>           "base_url":"http://127.0.0.1:32943/solr",
   [junit4]   2>           "node_name":"127.0.0.1:32943_solr",
   [junit4]   2>           "state":"down",
   [junit4]   2>           "type":"NRT"}}}}}
   [junit4]   2> 859673 DEBUG (OverseerStateUpdate-72094546207637511-127.0.0.1:43299_solr-n_0000000000) [n:127.0.0.1:43299_solr    ] o.a.s.c.Overseer processMessage: queueSize: 2, message = {
   [junit4]   2>   "core":"AutoscalingHistoryHandlerTest_collection_shard1_replica_n2",
   [junit4]   2>   "core_node_name":"core_node5",
   [junit4]   2>   "roles":null,
   [junit4]   2>   "base_url":"http://127.0.0.1:43299/solr",
   [junit4]   2>   "node_name":"127.0.0.1:43299_solr",
   [junit4]   2>   "numShards":"1",
   [junit4]   2>   "state":"down",
   [junit4]   2>   "shard":"shard1",
   [junit4]   2>   "collection":"AutoscalingHistoryHandlerTest_collection",
   [junit4]   2>   "type":"NRT",
   [junit4]   2>   "operation":"state"} current state version: 0
   [junit4]   2> 859674 DEBUG (OverseerStateUpdate-72094546207637511-127.0.0.1:43299_solr-n_0000000000) [n:127.0.0.1:43299_solr    ] o.a.s.c.o.ReplicaMutator Update state numShards=1 message={
   [junit4]   2>   "core":"AutoscalingHistoryHandlerTest_collection_shard1_replica_n2",
   [junit4]   2>   "core_node_name":"core_node5",
   [junit4]   2>   "roles":null,
   [junit4]   2>   "base_url":"http://127.0.0.1:43299/solr",
   [junit4]   2>   "node_name":"127.0.0.1:43299_solr",
   [junit4]   2>   "numShards":"1",
   [junit4]   2>   "state":"down",
   [junit4]   2>   "shard":"shard1",
   [junit4]   2>   "collection":"AutoscalingHistoryHandlerTest_collection",
   [junit4]   2>   "type":"NRT",
   [junit4]   2>   "operation":"state"}
   [junit4]   2> 859674 DEBUG (OverseerStateUpdate-72094546207637511-127.0.0.1:43299_solr-n_0000000000) [n:127.0.0.1:43299_solr    ] o.a.s.c.o.ReplicaMutator Will update state for replica: core_node5:{"core":"AutoscalingHistoryHandlerTest_collection_shard1_replica_n2","base_url":"http://127.0.0.1:43299/solr","node_name":"127.0.0.1:43299_solr","state":"down","type":"NRT"}
   [junit4]   2> 859674 DEBUG (OverseerStateUpdate-72094546207637511-127.0.0.1:43299_solr-n_0000000000) [n:127.0.0.1:43299_solr    ] o.a.s.c.o.ReplicaMutator Collection is now: DocCollection(AutoscalingHistoryHandlerTest_collection//collections/AutoscalingHistoryHandlerTest_collection/state.json/1)={
   [junit4]   2>   "pullReplicas":"0",
   [junit4]   2>   "replicationFactor":"3",
   [junit4]   2>   "router":{"name":"compositeId"},
   [junit4]   2>   "maxShardsPerNode":"1",
   [junit4]   2>   "autoAddReplicas":"false",
   [junit4]   2>   "nrtReplicas":"3",
   [junit4]   2>   "tlogReplicas":"0",
   [junit4]   2>   "shards":{"shard1":{
   [junit4]   2>       "range":"80000000-7fffffff",
   [junit4]   2>       "state":"active",
   [junit4]   2>       "replicas":{
   [junit4]   2>         "core_node3":{
   [junit4]   2>           "core":"AutoscalingHistoryHandlerTest_collection_shard1_replica_n1",
   [junit4]   2>           "base_url":"http://127.0.0.1:34875/solr",
   [junit4]   2>           "state":"down",
   [junit4]   2>           "node_name":null,
   [junit4]   2>           "type":"NRT"},
   [junit4]   2>         "core_node5":{
   [junit4]   2>           "core":"AutoscalingHistoryHandlerTest_collection_shard1_replica_n2",
   [junit4]   2>           "base_url":"http://127.0.0.1:43299/solr",
   [junit4]   2>           "node_name":"127.0.0.1:43299_solr",
   [junit4]   2>           "state":"down",
   [junit4]   2>           "type":"NRT"},
   [junit4]   2>         "core_node6":{
   [junit4]   2>           "core":"AutoscalingHistoryHandlerTest_collection_shard1_replica_n4",
   [junit4]   2>           "base_url":"http://127.0.0.1:32943/solr",
   [junit4]   2>           "node_name":"127.0.0.1:32943_solr",
   [junit4]   2>           "state":"down",
   [junit4]   2>           "type":"NRT"}}}}}
   [junit4]   2> 859674 DEBUG (OverseerStateUpdate-72094546207637511-127.0.0.1:43299_solr-n_0000000000) [n:127.0.0.1:43299_solr    ] o.a.s.c.Overseer processMessage: queueSize: 3, message = {
   [junit4]   2>   "core":"AutoscalingHistoryHandlerTest_collection_shard1_replica_n1",
   [junit4]   2>   "core_node_name":"core_node3",
   [junit4]   2>   "roles":null,
   [junit4]   2>   "base_url":"http://127.0.0.1:34875/solr",
   [junit4]   2>   "node_name":"127.0.0.1:34875_solr",
   [junit4]   2>   "numShards":"1",
   [junit4]   2>   "state":"down",
   [junit4]   2>   "shard":"shard1",
   [junit4]   2>   "collection":"AutoscalingHistoryHandlerTest_collection",
   [junit4]   2>   "type":"NRT",
   [junit4]   2>   "operation":"state"} current state version: 0
   [junit4]   2> 859674 DEBUG (OverseerStateUpdate-72094546207637511-127.0.0.1:43299_solr-n_0000000000) [n:127.0.0.1:43299_solr    ] o.a.s.c.o.ReplicaMutator Update state numShards=1 message={
   [junit4]   2>   "core":"AutoscalingHistoryHandlerTest_collection_shard1_replica_n1",
   [junit4]   2>   "core_node_name":"core_node3",
   [junit4]   2>   "roles":null,
   [junit4]   2>   "base_url":"http://127.0.0.1:34875/solr",
   [junit4]   2>   "node_name":"127.0.0.1:34875_solr",
   [junit4]   2>   "numShards":"1",
   [junit4]   2>   "state":"down",
   [junit4]   2>   "shard":"shard1",
   [junit4]   2>   "collection":"AutoscalingHistoryHandlerTest_collection",
   [junit4]   2>   "type":"NRT",
   [junit4]   2>   "operation":"state"}
   [junit4]   2> 859674 DEBUG (OverseerStateUpdate-72094546207637511-127.0.0.1:43299_solr-n_0000000000) [n:127.0.0.1:43299_solr    ] o.a.s.c.o.ReplicaMutator Will update state for replica: core_node3:{"core":"AutoscalingHistoryHandlerTest_collection_shard1_replica_n1","base_url":"http://127.0.0.1:34875/solr","node_name":"127.0.0.1:34875_solr","state":"down","type":"NRT"}
   [junit4]   2> 859674 DEBUG (OverseerStateUpdate-72094546207637511-127.0.0.1:43299_solr-n_0000000000) [n:127.0.0.1:43299_solr    ] o.a.s.c.o.ReplicaMutator Collection is now: DocCollection(AutoscalingHistoryHandlerTest_collection//collections/AutoscalingHistoryHandlerTest_collection/state.json/1)={
   [junit4]   2>   "pullReplicas":"0",
   [junit4]   2>   "replicationFactor":"3",
   [junit4]   2>   "router":{"name":"compositeId"},
   [junit4]   2>   "maxShardsPerNode":"1",
   [junit4]   2>   "autoAddReplicas":"false",
   [junit4]   2>   "nrtReplicas":"3",
   [junit4]   2>   "tlogReplicas":"0",
   [junit4]   2>   "shards":{"shard1":{
   [junit4]   2>       "range":"80000000-7fffffff",
   [junit4]   2>       "state":"active",
   [junit4]   2>       "replicas":{
   [junit4]   2>         "core_node3":{
   [junit4]   2>           "core":"AutoscalingHistoryHandlerTest_collection_shard1_replica_n1",
   [junit4]   2>           "base_url":"http://127.0.0.1:34875/solr",
   [junit4]   2>           "node_name":"127.0.0.1:34875_solr",
   [junit4]   2>           "state":"down",
   [junit4]   2>           "type":"NRT"},
   [junit4]   2>         "core_node5":{
   [junit4]   2>           "core":"AutoscalingHistoryHandlerTest_collection_shard1_replica_n2",
   [junit4]   2>           "base_url":"http://127.0.0.1:43299/solr",
   [junit4]   2>           "node_name":"127.0.0.1:43299_solr",
   [junit4]   2>           "state":"down",
   [junit4]   2>           "type":"NRT"},
   [junit4]   2>         "core_node6":{
   [junit4]   2>           "core":"AutoscalingHistoryHandlerTest_collection_shard1_replica_n4",
   [junit4]   2>           "base_url":"http://127.0.0.1:32943/solr",
   [junit4]   2>           "node_name":"127.0.0.1:32943_solr",
   [junit4]   2>           "state":"down",
   [junit4]   2>           "type":"NRT"}}}}}
   [junit4]   2> 859775 DEBUG (OverseerStateUpdate-72094546207637511-127.0.0.1:43299_solr-n_0000000000) [n:127.0.0.1:43299_solr    ] o.a.s.c.o.ZkStateWriter going to update_collection /collections/AutoscalingHistoryHandlerTest_collection/state.json version: 1
   [junit4]   2> 859775 INFO  (zkCallback-6312-thread-1-processing-n:127.0.0.1:43299_solr) [n:127.0.0.1:43299_solr    ] o.a.s.c.c.ZkStateReader A cluster state change: [WatchedEvent state:SyncConnected type:NodeDataChanged path:/collections/AutoscalingHistoryHandlerTest_collection/state.json] for collection [AutoscalingHistoryHandlerTest_collection] has occurred - updating... (live nodes size: [3])
   [junit4]   2> 859775 INFO  (zkCallback-6315-thread-1-processing-n:127.0.0.1:32943_solr) [n:127.0.0.1:32943_solr    ] o.a.s.c.c.ZkStateReader A cluster state change: [WatchedEvent state:SyncConnected type:NodeDataChanged path:/collections/AutoscalingHistoryHandlerTest_collection/state.json] for collection [AutoscalingHistoryHandlerTest_collection] has occurred - updating... (live nodes size: [3])
   [junit4]   2> 859775 INFO  (zkCallback-6312-thread-2-processing-n:127.0.0.1:43299_solr) [n:127.0.0.1:43299_solr    ] o.a.s.c.c.ZkStateReader A cluster state change: [WatchedEvent state:SyncConnected type:NodeDataChanged path:/collections/AutoscalingHistoryHandlerTest_collection/state.json] for collection [AutoscalingHistoryHandlerTest_collection] has occurred - updating... (live nodes size: [3])
   [junit4]   2> 859775 INFO  (zkCallback-6314-thread-1-processing-n:127.0.0.1:34875_solr) [n:127.0.0.1:34875_solr    ] o.a.s.c.c.ZkStateReader A cluster state change: [WatchedEvent state:SyncConnected type:NodeDataChanged path:/collections/AutoscalingHistoryHandlerTest_collection/state.json] for collection [AutoscalingHistoryHandlerTest_collection] has occurred - updating... (live nodes size: [3])
   [junit4]   2> 859776 INFO  (zkCallback-6314-thread-2-processing-n:127.0.0.1:34875_solr) [n:127.0.0.1:34875_solr    ] o.a.s.c.c.ZkStateReader A cluster state change: [WatchedEvent state:SyncConnected type:NodeDataChanged path:/collections/AutoscalingHistoryHandlerTest_collection/state.json] for collection [AutoscalingHistoryHandlerTest_collection] has occurred - updating... (live nodes size: [3])
   [junit4]   2> 859776 INFO  (zkCallback-6315-thread-2-processing-n:127.0.0.1:32943_solr) [n:127.0.0.1:32943_solr    ] o.a.s.c.c.ZkStateReader A cluster state change: [WatchedEvent state:SyncConnected type:NodeDataChanged path:/collections/AutoscalingHistoryHandlerTest_collection/state.json] for collection [AutoscalingHistoryHandlerTest_collection] has occurred - updating... (live nodes size: [3])
   [junit4]   2> 860210 DEBUG (ScheduledTrigger-4637-thread-1) [n:127.0.0.1:43299_solr    ] o.a.s.c.a.NodeLostTrigger Running NodeLostTrigger: .auto_add_replicas with currently live nodes: 3
   [junit4]   2> 860678 INFO  (qtp1879398340-18794) [n:127.0.0.1:43299_solr c:AutoscalingHistoryHandlerTest_collection s:shard1 r:core_node5 x:AutoscalingHistoryHandlerTest_collection_shard1_replica_n2] o.a.s.c.RequestParams conf resource params.json loaded . version : 0 
   [junit4]   2> 860678 INFO  (qtp72739325-18797) [n:127.0.0.1:34875_solr c:AutoscalingHistoryHandlerTest_collection s:shard1 r:core_node3 x:AutoscalingHistoryHandlerTest_collection_shard1_replica_n1] o.a.s.c.RequestParams conf resource params.json loaded . version : 0 
   [junit4]   2> 860678 INFO  (qtp70290453-18814) [n:127.0.0.1:32943_solr c:AutoscalingHistoryHandlerTest_collection s:shard1 r:core_node6 x:AutoscalingHistoryHandlerTest_collection_shard1_replica_n4] o.a.s.c.RequestParams conf resource params.json loaded . version : 0 
   [junit4]   2> 860678 INFO  (qtp1879398340-18794) [n:127.0.0.1:43299_solr c:AutoscalingHistoryHandlerTest_collection s:shard1 r:core_node5 x:AutoscalingHistoryHandlerTest_collection_shard1_replica_n2] o.a.s.c.RequestParams request params refreshed to version 0
   [junit4]   2> 860679 INFO  (qtp72739325-18797) [n:127.0.0.1:34875_solr c:AutoscalingHistoryHandlerTest_collection s:shard1 r:core_node3 x:AutoscalingHistoryHandlerTest_collection_shard1_replica_n1] o.a.s.c.RequestParams request params refreshed to version 0
   [junit4]   2> 860679 INFO  (qtp70290453-18814) [n:127.0.0.1:32943_solr c:AutoscalingHistoryHandlerTest_collection s:shard1 r:core_node6 x:AutoscalingHistoryHandlerTest_collection_shard1_replica_n4] o.a.s.c.RequestParams request params refreshed to version 0
   [junit4]   2> 860679 WARN  (qtp1879398340-18794) [n:127.0.0.1:43299_solr c:AutoscalingHistoryHandlerTest_collection s:shard1 r:core_node5 x:AutoscalingHistoryHandlerTest_collection_shard1_replica_n2] o.a.s.c.SolrConfig Couldn't add files from /home/jenkins/workspace/Lucene-Solr-7.x-Linux/solr/build/solr-core/test/J1/temp/solr.handler.admin.AutoscalingHistoryHandlerTest_3D2E790E81B5F13A-001/tempDir-001/node1/AutoscalingHistoryHandlerTest_collection_shard1_replica_n2/../../../../contrib/extraction/lib filtered by .*\.jar to classpath: /home/jenkins/workspace/Lucene-Solr-7.x-Linux/solr/build/solr-core/test/J1/temp/solr.handler.admin.AutoscalingHistoryHandlerTest_3D2E790E81B5F13A-001/tempDir-001/node1/AutoscalingHistoryHandlerTest_collection_shard1_replica_n2/../../../../contrib/extraction/lib
   [junit4]   2> 860679 WARN  (qtp72739325-18797) [n:127.0.0.1:34875_solr c:AutoscalingHistoryHandlerTest_collection s:shard1 r:core_node3 x:AutoscalingHistoryHandlerTest_collection_shard1_replica_n1] o.a.s.c.SolrConfig Couldn't add files from /home/jenkins/workspace/Lucene-Solr-7.x-Linux/solr/build/solr-core/test/J1/temp/solr.handler.admin.AutoscalingHistoryHandlerTest_3D2E790E81B5F13A-001/tempDir-001/node3/AutoscalingHistoryHandlerTest_collection_shard1_replica_n1/../../../../contrib/extraction/lib filtered by .*\.jar to classpath: /home/jenkins/workspace/Lucene-Solr-7.x-Linux/solr/build/solr-core/test/J1/temp/solr.handler.admin.AutoscalingHistoryHandlerTest_3D2E790E81B5F13A-001/tempDir-001/node3/AutoscalingHistoryHandlerTest_collection_shard1_replica_n1/../../../../contrib/extraction/lib
   [junit4]   2> 860679 WARN  (qtp70290453-18814) [n:127.0.0.1:32943_solr c:AutoscalingHistoryHandlerTest_collection s:shard1 r:core_node6 x:AutoscalingHistoryHandlerTest_collection_shard1_replica_n4] o.a.s.c.SolrConfig Couldn't add files from /home/jenkins/workspace/Lucene-Solr-7.x-Linux/solr/build/solr-core/test/J1/temp/solr.handler.admin.AutoscalingHistoryHandlerTest_3D2E790E81B5F13A-001/tempDir-001/node2/AutoscalingHistoryHandlerTest_collection_shard1_replica_n4/../../../../contrib/extraction/lib filtered by .*\.jar to classpath: /home/jenkins/workspace/Lucene-Solr-7.x-Linux/solr/build/solr-core/test/J1/temp/solr.handler.admin.AutoscalingHistoryHandlerTest_3D2E790E81B5F13A-001/tempDir-001/node2/AutoscalingHistoryHandlerTest_collection_shard1_replica_n4/../../../../contrib/extraction/lib
   [junit4]   2> 860679 WARN  (qtp1879398340-18794) [n:127.0.0.1:43299_solr c:AutoscalingHistoryHandlerTest_collection s:shard1 r:core_node5 x:AutoscalingHistoryHandlerTest_collection_shard1_replica_n2] o.a.s.c.SolrConfig Couldn't add files from /home/jenkins/workspace/Lucene-Solr-7.x-Linux/solr/build/solr-core/test/J1/temp/solr.handler.admin.AutoscalingHistoryHandlerTest_3D2E790E81B5F13A-001/tempDir-001/node1/AutoscalingHistoryHandlerTest_collection_shard1_replica_n2/../../../../dist filtered by solr-cell-\d.*\.jar to classpath: /home/jenkins/workspace/Lucene-Solr-7.x-Linux/solr/build/solr-core/test/J1/temp/solr.handler.admin.AutoscalingHistoryHandlerTest_3D2E790E81B5F13A-001/tempDir-001/node1/AutoscalingHistoryHandlerTest_collection_shard1_replica_n2/../../../../dist
   [junit4]   2> 860679 WARN  (qtp70290453-18814) [n:127.0.0.1:32943_solr c:AutoscalingHistoryHandlerTest_collection s:shard1 r:core_node6 x:AutoscalingHistoryHandlerTest_collection_shard1_replica_n4] o.a.s.c.SolrConfig Couldn't add files from /home/jenkins/workspace/Lucene-Solr-7.x-Linux/solr/build/solr-core/test/J1/temp/solr.handler.admin.AutoscalingHistoryHandlerTest_3D2E790E81B5F13A-001/tempDir-001/node2/AutoscalingHistoryHandlerTest_collection_shard1_replica_n4/../../../../dist filtered by solr-cell-\d.*\.jar to classpath: /home/jenkins/workspace/Lucene-Solr-7.x-Linux/solr/build/solr-core/test/J1/temp/solr.handler.admin.AutoscalingHistoryHandlerTest_3D2E790E81B5F13A-001/tempDir-001/node2/AutoscalingHistoryHandlerTest_collection_shard1_replica_n4/../../../../dist
   [junit4]   2> 860679 WARN  (qtp72739325-18797) [n:127.0.0.1:34875_solr c:AutoscalingHistoryHandlerTest_collection s:shard1 r:core_node3 x:AutoscalingHistoryHandlerTest_collection_shard1_replica_n1] o.a.s.c.SolrConfig Couldn't add files from /home/jenkins/workspace/Lucene-Solr-7.x-Linux/solr/build/solr-core/test/J1/temp/solr.handler.admin.AutoscalingHistoryHandlerTest_3D2E790E81B5F13A-001/tempDir-001/node3/AutoscalingHistoryHandlerTest_collection_shard1_replica_n1/../../../../dist filtered by solr-cell-\d.*\.jar to classpath: /home/jenkins/workspace/Lucene-Solr-7.x-Linux/solr/build/solr-core/test/J1/temp/solr.handler.admin.AutoscalingHistoryHandlerTest_3D2E790E81B5F13A-001/tempDir-001/node3/AutoscalingHistoryHandlerTest_collection_shard1_replica_n1/../../../../dist
   [junit4]   2> 860679 WARN  (qtp1879398340-18794) [n:127.0.0.1:43299_solr c:AutoscalingHistoryHandlerTest_collection s:shard1 r:core_node5 x:AutoscalingHistoryHandlerTest_collection_shard1_replica_n2] o.a.s.c.SolrConfig Couldn't add files from /home/jenkins/workspace/Lucene-Solr-7.x-Linux/solr/build/solr-core/test/J1/temp/solr.handler.admin.AutoscalingHistoryHandlerTest_3D2E790E81B5F13A-001/tempDir-001/node1/AutoscalingHistoryHandlerTest_collection_shard1_replica_n2/../../../../contrib/clustering/lib filtered by .*\.jar to classpath: /home/jenkins/workspace/Lucene-Solr-7.x-Linux/solr/build/solr-core/test/J1/temp/solr.handler.admin.AutoscalingHistoryHandlerTest_3D2E790E81B5F13A-001/tempDir-001/node1/AutoscalingHistoryHandlerTest_collection_shard1_replica_n2/../../../../contrib/clustering/lib
   [junit4]   2> 860679 WARN  (qtp70290453-18814) [n:127.0.0.1:32943_solr c:AutoscalingHistoryHandlerTest_collection s:shard1 r:core_node6 x:AutoscalingHistoryHandlerTest_collection_shard1_replica_n4] o.a.s.c.SolrConfig Couldn't add files from /home/jenkins/workspace/Lucene-Solr-7.x-Linux/solr/build/solr-core/test/J1/temp/solr.handler.admin.AutoscalingHistoryHandlerTest_3D2E790E81B5F13A-001/tempDir-001/node2/AutoscalingHistoryHandlerTest_collection_shard1_replica_n4/../../../../contrib/clustering/lib filtered by .*\.jar to classpath: /home/jenkins/workspace/Lucene-Solr-7.x-Linux/solr/build/solr-core/test/J1/temp/solr.handler.admin.AutoscalingHistoryHandlerTest_3D2E790E81B5F13A-001/tempDir-001/node2/AutoscalingHistoryHandlerTest_collection_shard1_replica_n4/../../../../contrib/clustering/lib
   [junit4]   2> 860679 WARN  (qtp72739325-18797) [n:127.0.0.1:34875_solr c:AutoscalingHistoryHandlerTest_collection s:shard1 r:core_node3 x:AutoscalingHistoryHandlerTest_collection_shard1_replica_n1] o.a.s.c.SolrConfig Couldn't add files from /home/jenkins/workspace/Lucene-Solr-7.x-Linux/solr/build/solr-core/test/J1/temp/solr.handler.admin.AutoscalingHistoryHandlerTest_3D2E790E81B5F13A-001/tempDir-001/node3/AutoscalingHistoryHandlerTest_collection_shard1_replica_n1/../../../../contrib/clustering/lib filtered by .*\.jar to classpath: /home/jenkins/workspace/Lucene-Solr-7.x-Linux/solr/build/solr-core/test/J1/temp/solr.handler.admin.AutoscalingHistoryHandlerTest_3D2E790E81B5F13A-001/tempDir-001/node3/AutoscalingHistoryHandlerTest_collection_shard1_replica_n1/../../../../contrib/clustering/lib
   [junit4]   2> 860679 WARN  (qtp70290453-18814) [n:127.0.0.1:32943_solr c:AutoscalingHistoryHandlerTest_collection s:shard1 r:core_node6 x:AutoscalingHistoryHandlerTest_collection_shard1_replica_n4] o.a.s.c.SolrConfig Couldn't add files from /home/jenkins/workspace/Lucene-Solr-7.x-Linux/solr/build/solr-core/test/J1/temp/solr.handler.admin.AutoscalingHistoryHandlerTest_3D2E790E81B5F13A-001/tempDir-001/node2/AutoscalingHistoryHandlerTest_collection_shard1_replica_n4/../../../../dist filtered by solr-clustering-\d.*\.jar to classpath: /home/jenkins/workspace/Lucene-Solr-7.x-Linux/solr/build/solr-core/test/J1/temp/solr.handler.admin.AutoscalingHistoryHandlerTest_3D2E790E81B5F13A-001/tempDir-001/node2/AutoscalingHistoryHandlerTest_collection_shard1_replica_n4/../../../../dist
   [junit4]   2> 860679 WARN  (qtp72739325-18797) [n:127.0.0.1:34875_solr c:AutoscalingHistoryHandlerTest_collection s:shard1 r:core_node3 x:AutoscalingHistoryHandlerTest_collection_shard1_replica_n1] o.a.s.c.SolrConfig Couldn't add files from /home/jenkins/workspace/Lucene-Solr-7.x-Linux/solr/build/solr-core/test/J1/temp/solr.handler.admin.AutoscalingHistoryHandlerTest_3D2E790E81B5F13A-001/tempDir-001/node3/AutoscalingHistoryHandlerTest_collection_shard1_replica_n1/../../../../dist filtered by solr-clustering-\d.*\.jar to classpath: /home/jenkins/workspace/Lucene-Solr-7.x-Linux/solr/build/solr-core/test/J1/temp/solr.handler.admin.AutoscalingHistoryHandlerTest_3D2E790E81B5F13A-001/tempDir-001/node3/AutoscalingHistoryHandlerTest_collection_shard1_replica_n1/../../../../dist
   [junit4]   2> 860679 WARN  (qtp1879398340-18794) [n:127.0.0.1:43299_solr c:AutoscalingHistoryHandlerTest_collection s:shard1 r:core_node5 x:AutoscalingHistoryHandlerTest_collection_shard1_replica_n2] o.a.s.c.SolrConfig Couldn't add files from /home/jenkins/workspace/Lucene-Solr-7.x-Linux/solr/build/solr-core/test/J1/temp/solr.handler.admin.AutoscalingHistoryHandlerTest_3D2E790E81B5F13A-001/tempDir-001/node1/AutoscalingHistoryHandlerTest_collection_shard1_replica_n2/../../../../dist filtered by solr-clustering-\d.*\.jar to classpath: /home/jenkins/workspace/Lucene-Solr-7.x-Linux/solr/build/solr-core/test/J1/temp/solr.handler.admin.AutoscalingHistoryHandlerTest_3D2E790E81B5F13A-001/tempDir-001/node1/AutoscalingHistoryHandlerTest_collection_shard1_replica_n2/../../../../dist
   [junit4]   2> 860680 WARN  (qtp72739325-18797) [n:127.0.0.1:34875_solr c:AutoscalingHistoryHandlerTest_collection s:shard1 r:core_node3 x:AutoscalingHistoryHandlerTest_collection_shard1_replica_n1] o.a.s.c.SolrConfig Couldn't add files from /home/jenkins/workspace/Lucene-Solr-7.x-Linux/solr/build/solr-core/test/J1/temp/solr.handler.admin.AutoscalingHistoryHandlerTest_3D2E790E81B5F13A-001/tempDir-001/node3/AutoscalingHistoryHandlerTest_collection_shard1_replica_n1/../../../../contrib/langid/lib filtered by .*\.jar to classpath: /home/jenkins/workspace/Lucene-Solr-7.x-Linux/solr/build/solr-core/test/J1/temp/solr.handler.admin.AutoscalingHistoryHandlerTest_3D2E790E81B5F13A-001/tempDir-001/node3/AutoscalingHistoryHandlerTest_collection_shard1_replica_n1/../../../../contrib/langid/lib
   [junit4]   2> 860680 WARN  (qtp70290453-18814) [n:127.0.0.1:32943_solr c:AutoscalingHistoryHandlerTest_collection s:shard1 r:core_node6 x:AutoscalingHistoryHandlerTest_collection_shard1_replica_n4] o.a.s.c.SolrConfig Couldn't add files from /home/jenkins/workspace/Lucene-Solr-7.x-Linux/solr/build/solr-core/test/J1/temp/solr.handler.admin.AutoscalingHistoryHandlerTest_3D2E790E81B5F13A-001/tempDir-001/node2/AutoscalingHistoryHandlerTest_collection_shard1_replica_n4/../../../../contrib/langid/lib filtered by .*\.jar to classpath: /home/jenkins/workspace/Lucene-Solr-7.x-Linux/solr/build/solr-core/test/J1/temp/solr.handler.admin.AutoscalingHistoryHandlerTest_3D2E790E81B5F13A-001/tempDir-001/node2/AutoscalingHistoryHandlerTest_collection_shard1_replica_n4/../../../../contrib/langid/lib
   [junit4]   2> 860680 WARN  (qtp1879398340-18794) [n:127.0.0.1:43299_solr c:AutoscalingHistoryHandlerTest_collection s:shard1 r:core_node5 x:AutoscalingHistoryHandlerTest_collection_shard1_replica_n2] o.a.s.c.SolrConfig Couldn't add files from /home/jenkins/workspace/Lucene-Solr-7.x-Linux/solr/build/solr-core/test/J1/temp/solr.handler.admin.AutoscalingHistoryHandlerTest_3D2E790E81B5F13A-001/tempDir-001/node1/AutoscalingHistoryHandlerTest_collection_shard1_replica_n2/../../../../contrib/langid/lib filtered by .*\.jar to classpath: /home/jenkins/workspace/Lucene-Solr-7.x-Linux/solr/build/solr-core/test/J1/temp/solr.handler.admin.AutoscalingHistoryHandlerTest_3D2E790E81B5F13A-001/tempDir-001/node1/AutoscalingHistoryHandlerTest_collection_shard1_replica_n2/../../../../contrib/langid/lib
   [junit4]   2> 860680 WARN  (qtp70290453-18814) [n:127.0.0.1:32943_solr c:AutoscalingHistoryHandlerTest_collection s:shard1 r:core_node6 x:AutoscalingHistoryHandlerTest_collection_shard1_replica_n4] o.a.s.c.SolrConfig Couldn't add files from /home/jenkins/workspace/Lucene-Solr-7.x-Linux/solr/build/solr-core/test/J1/temp/solr.handler.admin.AutoscalingHistoryHandlerTest_3D2E790E81B5F13A-001/tempDir-001/node2/AutoscalingHistoryHandlerTest_collection_shard1_replica_n4/../../../../dist filtered by solr-langid-\d.*\.jar to classpath: /home/jenkins/workspace/Lucene-Solr-7.x-Linux/solr/build/solr-core/test/J1/temp/solr.handler.admin.AutoscalingHistoryHandlerTest_3D2E790E81B5F13A-001/tempDir-001/node2/AutoscalingHistoryHandlerTest_collection_shard1_replica_n4/../../../../dist
   [junit4]   2> 860680 WARN  (qtp1879398340-18794) [n:127.0.0.1:43299_solr c:AutoscalingHistoryHandlerTest_collection s:shard1 r:core_node5 x:AutoscalingHistoryHandlerTest_collection_shard1_replica_n2] o.a.s.c.SolrConfig Couldn't add files from /home/jenkins/workspace/Lucene-Solr-7.x-Linux/solr/build/solr-core/test/J1/temp/solr.handler.admin.AutoscalingHistoryHandlerTest_3D2E790E81B5F13A-001/tempDir-001/node1/AutoscalingHistoryHandlerTest_collection_shard1_replica_n2/../../../../dist filtered by solr-langid-\d.*\.jar to classpath: /home/jenkins/workspace/Lucene-Solr-7.x-Linux/solr/build/solr-core/test/J1/temp/solr.handler.admin.AutoscalingHistoryHandlerTest_3D2E790E81B5F13A-001/tempDir-001/node1/AutoscalingHistoryHandlerTest_collection_shard1_replica_n2/../../../../dist
   [junit4]   2> 860680 WARN  (qtp72739325-18797) [n:127.0.0.1:34875_solr c:AutoscalingHistoryHandlerTest_collection s:shard1 r:core_node3 x:AutoscalingHistoryHandlerTest_collection_shard1_replica_n1] o.a.s.c.SolrConfig Couldn't add files from /home/jenkins/workspace/Lucene-Solr-7.x-Linux/solr/build/solr-core/test/J1/temp/solr.handler.admin.AutoscalingHistoryHandlerTest_3D2E790E81B5F13A-001/tempDir-001/node3/AutoscalingHistoryHandlerTest_collection_shard1_replica_n1/../../../../dist filtered by solr-langid-\d.*\.jar to classpath: /home/jenkins/workspace/Lucene-Solr-7.x-Linux/solr/build/solr-core/test/J1/temp/solr.handler.admin.AutoscalingHistoryHandlerTest_3D2E790E81B5F13A-001/tempDir-001/node3/AutoscalingHistoryHandlerTest_collection_shard1_replica_n1/../../../../dist
   [junit4]   2> 860680 WARN  (qtp70290453-18814) [n:127.0.0.1:32943_solr c:AutoscalingHistoryHandlerTest_collection s:shard1 r:core_node6 x:AutoscalingHistoryHandlerTest_collection_shard1_replica_n4] o.a.s.c.SolrConfig Couldn't add files from /home/jenkins/workspace/Lucene-Solr-7.x-Linux/solr/build/solr-core/test/J1/temp/solr.handler.admin.AutoscalingHistoryHandlerTest_3D2E790E81B5F13A-001/tempDir-001/node2/AutoscalingHistoryHandlerTest_collection_shard1_replica_n4/../../../../contrib/velocity/lib filtered by .*\.jar to classpath: /home/jenkins/workspace/Lucene-Solr-7.x-Linux/solr/build/solr-core/test/J1/temp/solr.handler.admin.AutoscalingHistoryHandlerTest_3D2E790E81B5F13A-001/tempDir-001/node2/AutoscalingHistoryHandlerTest_collection_shard1_replica_n4/../../../../contrib/velocity/lib
   [junit4]   2> 860680 WARN  (qtp1879398340-18794) [n:127.0.0.1:43299_solr c:AutoscalingHistoryHandlerTest_collection s:shard1 r:core_node5 x:AutoscalingHistoryHandlerTest_collection_shard1_replica_n2] o.a.s.c.SolrConfig Couldn't add files from /home/jenkins/workspace/Lucene-Solr-7.x-Linux/solr/build/solr-core/test/J1/temp/solr.handler.admin.AutoscalingHistoryHandlerTest_3D2E790E81B5F13A-001/tempDir-001/node1/AutoscalingHistoryHandlerTest_collection_shard1_replica_n2/../../../../contrib/velocity/lib filtered by .*\.jar to classpath: /home/jenkins/workspace/Lucene-Solr-7.x-Linux/solr/build/solr-core/test/J1/temp/solr.handler.admin.AutoscalingHistoryHandlerTest_3D2E790E81B5F13A-001/tempDir-001/node1/AutoscalingHistoryHandlerTest_collection_shard1_replica_n2/../../../../contrib/velocity/lib
   [junit4]   2> 860680 WARN  (qtp72739325-18797) [n:127.0.0.1:34875_solr c:AutoscalingHistoryHandlerTest_collection s:shard1 r:core_node3 x:AutoscalingHistoryHandlerTest_collection_shard1_replica_n1] o.a.s.c.SolrConfig Couldn't add files from /home/jenkins/workspace/Lucene-Solr-7.x-Linux/solr/build/solr-core/test/J1/temp/solr.handler.admin.AutoscalingHistoryHandlerTest_3D2E790E81B5F13A-001/tempDir-001/node3/AutoscalingHistoryHandlerTest_collection_shard1_replica_n1/../../../../contrib/velocity/lib filtered by .*\.jar to classpath: /home/jenkins/workspace/Lucene-Solr-7.x-Linux/solr/build/solr-core/test/J1/temp/solr.handler.admin.AutoscalingHistoryHandlerTest_3D2E790E81B5F13A-001/tempDir-001/node3/AutoscalingHistoryHandlerTest_collection_shard1_replica_n1/../../../../contrib/velocity/lib
   [junit4]   2> 860680 WARN  (qtp1879398340-18794) [n:127.0.0.1:43299_solr c:AutoscalingHistoryHandlerTest_collection s:shard1 r:core_node5 x:AutoscalingHistoryHandlerTest_collection_shard1_replica_n2] o.a.s.c.SolrConfig Couldn't add files from /home/jenkins/workspace/Lucene-Solr-7.x-Linux/solr/build/solr-core/test/J1/temp/solr.handler.admin.AutoscalingHistoryHandlerTest_3D2E790E81B5F13A-001/tempDir-001/node1/AutoscalingHistoryHandlerTest_collection_shard1_replica_n2/../../../../dist filtered by solr-velocity-\d.*\.jar to classpath: /home/jenkins/workspace/Lucene-Solr-7.x-Linux/solr/build/solr-core/test/J1/temp/solr.handler.admin.AutoscalingHistoryHandlerTest_3D2E790E81B5F13A-001/tempDir-001/node1/AutoscalingHistoryHandlerTest_collection_shard1_replica_n2/../../../../dist
   [junit4]   2> 860680 WARN  (qtp72739325-18797) [n:127.0.0.1:34875_solr c:AutoscalingHistoryHandlerTest_collection s:shard1 r:core_node3 x:AutoscalingHistoryHandlerTest_collection_shard1_replica_n1] o.a.s.c.SolrConfig Couldn't add files from /home/jenkins/workspace/Lucene-Solr-7.x-Linux/solr/build/solr-core/test/J1/temp/solr.handler.admin.AutoscalingHistoryHandlerTest_3D2E790E81B5F13A-001/tempDir-001/node3/AutoscalingHistoryHandlerTest_collection_shard1_replica_n1/../../../../dist filtered by solr-velocity-\d.*\.jar to classpath: /home/jenkins/workspace/Lucene-Solr-7.x-Linux/solr/build/solr-core/test/J1/temp/solr.handler.admin.AutoscalingHistoryHandlerTest_3D2E790E81B5F13A-001/tempDir-001/node3/AutoscalingHistoryHandlerTest_collection_shard1_replica_n1/../../../../dist
   [junit4]   2> 860680 WARN  (qtp70290453-18814) [n:127.0.0.1:32943_solr c:AutoscalingHistoryHandlerTest_collection s:shard1 r:core_node6 x:AutoscalingHistoryHandlerTest_collection_shard1_replica_n4] o.a.s.c.SolrConfig Couldn't add files from /home/jenkins/workspace/Lucene-Solr-7.x-Linux/solr/build/solr-core/test/J1/temp/solr.handler.admin.AutoscalingHistoryHandlerTest_3D2E790E81B5F13A-001/tempDir-001/node2/AutoscalingHistoryHandlerTest_collection_shard1_replica_n4/../../../../dist filtered by solr-velocity-\d.*\.jar to classpath: /home/jenkins/workspace/Lucene-Solr-7.x-Linux/solr/build/solr-core/test/J1/temp/solr.handler.admin.AutoscalingHistoryHandlerTest_3D2E790E81B5F13A-001/tempDir-001/node2/AutoscalingHistoryHandlerTest_collection_shard1_replica_n4/../../../../dist
   [junit4]   2> 860685 INFO  (qtp72739325-18797) [n:127.0.0.1:34875_solr c:AutoscalingHistoryHandlerTest_collection s:shard1 r:core_node3 x:AutoscalingHistoryHandlerTest_collection_shard1_replica_n1] o.a.s.c.SolrConfig Using Lucene MatchVersion: 7.3.0
   [junit4]   2> 860685 INFO  (qtp70290453-18814) [n:127.0.0.1:32943_solr c:AutoscalingHistoryHandlerTest_collection s:shard1 r:core_node6 x:AutoscalingHistoryHandlerTest_collection_shard1_replica_n4] o.a.s.c.SolrConfig Using Lucene MatchVersion: 7.3.0
   [junit4]   2> 860685 INFO  (qtp1879398340-18794) [n:127.0.0.1:43299_solr c:AutoscalingHistoryHandlerTest_collection s:shard1 r:core_node5 x:AutoscalingHistoryHandlerTest_collection_shard1_replica_n2] o.a.s.c.SolrConfig Using Lucene MatchVersion: 7.3.0
   [junit4]   2> 860710 INFO  (qtp1879398340-18794) [n:127.0.0.1:43299_solr c:AutoscalingHistoryHandlerTest_collection s:shard1 r:core_node5 x:AutoscalingHistoryHandlerTest_collection_shard1_replica_n2] o.a.s.s.IndexSchema [AutoscalingHistoryHandlerTest_collection_shard1_replica_n2] Schema name=default-config
   [junit4]   2> 860711 INFO  (qtp70290453-18814) [n:127.0.0.1:32943_solr c:AutoscalingHistoryHandlerTest_collection s:shard1 r:core_node6 x:AutoscalingHistoryHandlerTest_collection_shard1_replica_n4] o.a.s.s.IndexSchema [AutoscalingHistoryHandlerTest_collection_shard1_replica_n4] Schema name=default-config
   [junit4]   2> 860711 INFO  (qtp72739325-18797) [n:127.0.0.1:34875_solr c:AutoscalingHistoryHandlerTest_collection s:shard1 r:core_node3 x:AutoscalingHistoryHandlerTest_collection_shard1_replica_n1] o.a.s.s.IndexSchema [AutoscalingHistoryHandlerTest_collection_shard1_replica_n1] Schema name=default-config
   [junit4]   2> 860825 INFO  (qtp1879398340-18794) [n:127.0.0.1:43299_solr c:AutoscalingHistoryHandlerTest_collection s:shard1 r:core_node5 x:AutoscalingHistoryHandlerTest_collection_shard1_replica_n2] o.a.s.s.IndexSchema Loaded schema default-config/1.6 with uniqueid field id
   [junit4]   2> 860830 INFO  (qtp72739325-18797) [n:127.0.0.1:34875_solr c:AutoscalingHistoryHandlerTest_collection s:shard1 r:core_node3 x:AutoscalingHistoryHandlerTest_collection_shard1_replica_n1] o.a.s.s.IndexSchema Loaded schema default-config/1.6 with uniqueid field id
   [junit4]   2> 860833 INFO  (qtp70290453-18814) [n:127.0.0.1:32943_solr c:AutoscalingHistoryHandlerTest_collection s:shard1 r:core_node6 x:AutoscalingHistoryHandlerTest_collection_shard1_replica_n4] o.a.s.s.IndexSchema Loaded schema default-config/1.6 with uniqueid field id
   [junit4]   2> 860837 INFO  (qtp1879398340-18794) [n:127.0.0.1:43299_solr c:AutoscalingHistoryHandlerTest_collection s:shard1 r:core_node5 x:AutoscalingHistoryHandlerTest_collection_shard1_replica_n2] o.a.s.c.CoreContainer Creating SolrCore 'AutoscalingHistoryHandlerTest_collection_shard1_replica_n2' using configuration from collection AutoscalingHistoryHandlerTest_collection, trusted=true
   [junit4]   2> 860837 INFO  (qtp1879398340-18794) [n:127.0.0.1:43299_solr c:AutoscalingHistoryHandlerTest_collection s:shard1 r:core_node5 x:AutoscalingHistoryHandlerTest_collection_shard1_replica_n2] o.a.s.m.r.SolrJmxReporter JMX monitoring for 'solr_43299.solr.core.AutoscalingHistoryHandlerTest_collection.shard1.replica_n2' (registry 'solr.core.AutoscalingHistoryHandlerTest_collection.shard1.replica_n2') enabled at server: com.sun.jmx.mbeanserver.JmxMBeanServer@7b4c3c
   [junit4]   2> 860837 INFO  (qtp1879398340-18794) [n:127.0.0.1:43299_solr c:AutoscalingHistoryHandlerTest_collection s:shard1 r:core_node5 x:AutoscalingHistoryHandlerTest_collection_shard1_replica_n2] o.a.s.c.SolrCore solr.RecoveryStrategy.Builder
   [junit4]   2> 860837 INFO  (qtp1879398340-18794) [n:127.0.0.1:43299_solr c:AutoscalingHistoryHandlerTest_collection s:shard1 r:core_node5 x:AutoscalingHistoryHandlerTest_collection_shard1_replica_n2] o.a.s.c.SolrCore [[AutoscalingHistoryHandlerTest_collection_shard1_replica_n2] ] Opening new SolrCore at [/home/jenkins/workspace/Lucene-Solr-7.x-Linux/solr/build/solr-core/test/J1/temp/solr.handler.admin.AutoscalingHistoryHandlerTest_3D2E790E81B5F13A-001/tempDir-001/node1/AutoscalingHistoryHandlerTest_collection_shard1_replica_n2], dataDir=[/home/jenkins/workspace/Lucene-Solr-7.x-Linux/solr/build/solr-core/test/J1/temp/solr.handler.admin.AutoscalingHistoryHandlerTest_3D2E790E81B5F13A-001/tempDir-001/node1/./AutoscalingHistoryHandlerTest_collection_shard1_replica_n2/data/]
   [junit4]   2> 860840 INFO  (qtp1879398340-18794) [n:127.0.0.1:43299_solr c:AutoscalingHistoryHandlerTest_collection s:shard1 r:core_node5 x:AutoscalingHistoryHandlerTest_collection_shard1_replica_n2] o.a.s.r.XSLTResponseWriter xsltCacheLifetimeSeconds=5
   [junit4]   2> 860841 INFO  (qtp72739325-18797) [n:127.0.0.1:34875_solr c:AutoscalingHistoryHandlerTest_collection s:shard1 r:core_node3 x:AutoscalingHistoryHandlerTest_collection_shard1_replica_n1] o.a.s.c.CoreContainer Creating SolrCore 'AutoscalingHistoryHandlerTest_collection_shard1_replica_n1' using configuration from collection AutoscalingHistoryHandlerTest_collection, trusted=true
   [junit4]   2> 860841 INFO  (qtp72739325-18797) [n:127.0.0.1:34875_solr c:AutoscalingHistoryHandlerTest_collection s:shard1 r:core_node3 x:AutoscalingHistoryHandlerTest_collection_shard1_replica_n1] o.a.s.m.r.SolrJmxReporter JMX monitoring for 'solr_34875.solr.core.AutoscalingHistoryHandlerTest_collection.shard1.replica_n1' (registry 'solr.core.AutoscalingHistoryHandlerTest_collection.shard1.replica_n1') enabled at server: com.sun.jmx.mbeanserver.JmxMBeanServer@7b4c3c
   [junit4]   2> 860841 INFO  (qtp72739325-18797) [n:127.0.0.1:34875_solr c:AutoscalingHistoryHandlerTest_collection s:shard1 r:core_node3 x:AutoscalingHistoryHandlerTest_collection_shard1_replica_n1] o.a.s.c.SolrCore solr.RecoveryStrategy.Builder
   [junit4]   2> 860842 INFO  (qtp72739325-18797) [n:127.0.0.1:34875_solr c:AutoscalingHistoryHandlerTest_collection s:shard1 r:core_node3 x:AutoscalingHistoryHandlerTest_collection_shard1_replica_n1] o.a.s.c.SolrCore [[AutoscalingHistoryHandlerTest_collection_shard1_replica_n1] ] Opening new SolrCore at [/home/jenkins/workspace/Lucene-Solr-7.x-Linux/solr/build/solr-core/test/J1/temp/solr.handler.admin.AutoscalingHistoryHandlerTest_3D2E790E81B5F13A-001/tempDir-001/node3/AutoscalingHistoryHandlerTest_collection_shard1_replica_n1], dataDir=[/home/jenkins/workspace/Lucene-Solr-7.x-Linux/solr/build/solr-core/test/J1/temp/solr.handler.admin.AutoscalingHistoryHandlerTest_3D2E790E81B5F13A-001/tempDir-001/node3/./AutoscalingHistoryHandlerTest_collection_shard1_replica_n1/data/]
   [junit4]   2> 860844 INFO  (qtp72739325-18797) [n:127.

[...truncated too long message...]

ndler Stopped o.e.j.s.ServletContextHandler@21a41b07{/solr,null,UNAVAILABLE}
   [junit4]   2> 871712 INFO  (jetty-closer-6291-thread-1) [    ] o.e.j.s.session Stopped scavenging
   [junit4]   2> 871713 INFO  (coreCloseExecutor-4684-thread-1) [n:127.0.0.1:32943_solr c:AutoscalingHistoryHandlerTest_collection s:shard1 r:core_node6 x:AutoscalingHistoryHandlerTest_collection_shard1_replica_n4] o.a.s.m.SolrMetricManager Closing metric reporters for registry=solr.collection.AutoscalingHistoryHandlerTest_collection.shard1.leader, tag=2027740597
   [junit4]   2> 871713 INFO  (coreCloseExecutor-4684-thread-2) [n:127.0.0.1:32943_solr c:.system s:shard1 r:core_node5 x:.system_shard1_replica_n2] o.a.s.m.SolrMetricManager Closing metric reporters for registry=solr.collection..system.shard1.leader, tag=696860060
   [junit4]   2> 871714 INFO  (coreCloseExecutor-4685-thread-2) [n:127.0.0.1:43299_solr c:.system s:shard1 r:core_node3 x:.system_shard1_replica_n1] o.a.s.m.SolrMetricManager Closing metric reporters for registry=solr.core..system.shard1.replica_n1, tag=215976976
   [junit4]   2> 871714 INFO  (coreCloseExecutor-4685-thread-2) [n:127.0.0.1:43299_solr c:.system s:shard1 r:core_node3 x:.system_shard1_replica_n1] o.a.s.m.r.SolrJmxReporter Closing reporter [org.apache.solr.metrics.reporters.SolrJmxReporter@23e7f545: rootName = solr_43299, domain = solr.core..system.shard1.replica_n1, service url = null, agent id = null] for registry solr.core..system.shard1.replica_n1 / com.codahale.metrics.MetricRegistry@b657f91
   [junit4]   2> 871716 INFO  (jetty-closer-6291-thread-3) [    ] o.e.j.s.h.ContextHandler Stopped o.e.j.s.ServletContextHandler@46c11a69{/solr,null,UNAVAILABLE}
   [junit4]   2> 871716 INFO  (jetty-closer-6291-thread-3) [    ] o.e.j.s.session Stopped scavenging
   [junit4]   2> 871720 INFO  (coreCloseExecutor-4685-thread-1) [n:127.0.0.1:43299_solr c:AutoscalingHistoryHandlerTest_collection s:shard1 r:core_node5 x:AutoscalingHistoryHandlerTest_collection_shard1_replica_n2] o.a.s.m.SolrMetricManager Closing metric reporters for registry=solr.collection.AutoscalingHistoryHandlerTest_collection.shard1.leader, tag=571881268
   [junit4]   2> 871720 INFO  (coreCloseExecutor-4685-thread-2) [n:127.0.0.1:43299_solr c:.system s:shard1 r:core_node3 x:.system_shard1_replica_n1] o.a.s.m.SolrMetricManager Closing metric reporters for registry=solr.collection..system.shard1.leader, tag=215976976
   [junit4]   2> 871722 INFO  (jetty-closer-6291-thread-2) [    ] o.a.s.c.Overseer Overseer (id=72094546207637511-127.0.0.1:43299_solr-n_0000000000) closing
   [junit4]   2> 871722 INFO  (OverseerStateUpdate-72094546207637511-127.0.0.1:43299_solr-n_0000000000) [n:127.0.0.1:43299_solr    ] o.a.s.c.Overseer Overseer Loop exiting : 127.0.0.1:43299_solr
   [junit4]   2> 871722 WARN  (OverseerAutoScalingTriggerThread-72094546207637511-127.0.0.1:43299_solr-n_0000000000) [n:127.0.0.1:43299_solr    ] o.a.s.c.a.OverseerTriggerThread OverseerTriggerThread woken up but we are closed, exiting.
   [junit4]   2> 871722 DEBUG (jetty-closer-6291-thread-2) [    ] o.a.s.c.a.OverseerTriggerThread OverseerTriggerThread has been closed explicitly
   [junit4]   2> 871723 INFO  (jetty-closer-6291-thread-2) [    ] o.e.j.s.h.ContextHandler Stopped o.e.j.s.ServletContextHandler@4bac2936{/solr,null,UNAVAILABLE}
   [junit4]   2> 871723 INFO  (jetty-closer-6291-thread-2) [    ] o.e.j.s.session Stopped scavenging
   [junit4]   2> 873165 WARN  (zkCallback-6336-thread-1-processing-n:127.0.0.1:45709_solr) [n:127.0.0.1:45709_solr    ] o.a.s.c.c.ZkStateReader ZooKeeper watch triggered, but Solr cannot talk to ZK: [KeeperErrorCode = Session expired for /live_nodes]
   [junit4]   2> 873166 INFO  (jetty-closer-6291-thread-4) [    ] o.e.j.s.h.ContextHandler Stopped o.e.j.s.ServletContextHandler@31163869{/solr,null,UNAVAILABLE}
   [junit4]   2> 873166 INFO  (jetty-closer-6291-thread-4) [    ] o.e.j.s.session Stopped scavenging
   [junit4]   2> 873166 ERROR (SUITE-AutoscalingHistoryHandlerTest-seed#[3D2E790E81B5F13A]-worker) [    ] o.a.z.s.ZooKeeperServer ZKShutdownHandler is not registered, so ZooKeeper server won't take any action on ERROR or SHUTDOWN server state changes
   [junit4]   2> 873167 INFO  (SUITE-AutoscalingHistoryHandlerTest-seed#[3D2E790E81B5F13A]-worker) [    ] o.a.s.c.ZkTestServer connecting to 127.0.0.1:37737 37737
   [junit4]   2> 879323 INFO  (Thread-3394) [    ] o.a.s.c.ZkTestServer connecting to 127.0.0.1:37737 37737
   [junit4]   2> 879324 WARN  (Thread-3394) [    ] o.a.s.c.ZkTestServer Watch limit violations: 
   [junit4]   2> Maximum concurrent create/delete watches above limit:
   [junit4]   2> 
   [junit4]   2> 	11	/solr/collections/AutoscalingHistoryHandlerTest_collection/terms/shard1
   [junit4]   2> 	11	/solr/aliases.json
   [junit4]   2> 	11	/solr/clusterprops.json
   [junit4]   2> 	10	/solr/collections/.system/terms/shard1
   [junit4]   2> 	4	/solr/security.json
   [junit4]   2> 	3	/solr/configs/.system
   [junit4]   2> 	3	/solr/configs/AutoscalingHistoryHandlerTest_collection.AUTOCREATED/managed-schema
   [junit4]   2> 	3	/solr/configs/AutoscalingHistoryHandlerTest_collection.AUTOCREATED
   [junit4]   2> 	3	/solr/configs/.system/managed-schema
   [junit4]   2> 
   [junit4]   2> Maximum concurrent data watches above limit:
   [junit4]   2> 
   [junit4]   2> 	25	/solr/collections/AutoscalingHistoryHandlerTest_collection/state.json
   [junit4]   2> 	22	/solr/collections/.system/state.json
   [junit4]   2> 	11	/solr/clusterstate.json
   [junit4]   2> 
   [junit4]   2> Maximum concurrent children watches above limit:
   [junit4]   2> 
   [junit4]   2> 	11	/solr/live_nodes
   [junit4]   2> 	11	/solr/collections
   [junit4]   2> 
   [junit4]   2> NOTE: leaving temporary files on disk at: /home/jenkins/workspace/Lucene-Solr-7.x-Linux/solr/build/solr-core/test/J1/temp/solr.handler.admin.AutoscalingHistoryHandlerTest_3D2E790E81B5F13A-001
   [junit4]   2> NOTE: test params are: codec=Asserting(Lucene70): {action_s=PostingsFormat(name=Memory), event.source_s=BlockTreeOrds(blocksize=128), type=FST50, before.actions_ss=Lucene50(blocksize=128), event.property._enqueue_time__ss=PostingsFormat(name=Memory), after.actions_ss=PostingsFormat(name=Memory), stage_s=PostingsFormat(name=Memory), event.id_s=BlockTreeOrds(blocksize=128), event.property.eventTimes_ss=FST50, source_s=BlockTreeOrds(blocksize=128), event.type_s=FST50, id=BlockTreeOrds(blocksize=128), event.property.nodeNames_ss=FST50}, docValues:{_version_=DocValuesFormat(name=Memory), event.time_l=DocValuesFormat(name=Lucene70), timestamp=DocValuesFormat(name=Lucene70)}, maxPointsInLeafNode=1615, maxMBSortInHeap=6.686850905884769, sim=RandomSimilarity(queryNorm=true): {}, locale=th-TH, timezone=America/St_Barthelemy
   [junit4]   2> NOTE: Linux 4.13.0-32-generic amd64/Oracle Corporation 1.8.0_162 (64-bit)/cpus=8,threads=1,free=103352128,total=518979584
   [junit4]   2> NOTE: All tests run in this JVM: [TestStressLiveNodes, TestDynamicFieldCollectionResource, TestDistributedStatsComponentCardinality, TriggerIntegrationTest, TestLegacyTerms, TestPolicyCloud, TestElisionMultitermQuery, MoveReplicaHDFSFailoverTest, TestMaxTokenLenTokenizer, LoggingHandlerTest, SolrShardReporterTest, DistributedMLTComponentTest, TestLeaderInitiatedRecoveryThread, RequiredFieldsTest, SortByFunctionTest, TestPerFieldSimilarity, SolrIndexMetricsTest, DistributedQueryComponentOptimizationTest, DocValuesNotIndexedTest, TestSchemaManager, BadCopyFieldTest, DirectoryFactoryTest, TestRestManager, UpdateRequestProcessorFactoryTest, TestConfigsApi, JsonLoaderTest, TestPerFieldSimilarityWithDefaultOverride, TestReloadDeadlock, BasicFunctionalityTest, QueryParsingTest, ClassificationUpdateProcessorIntegrationTest, QueryElevationComponentTest, FileUtilsTest, TestConfigSetImmutable, SolrJmxReporterTest, TestPostingsSolrHighlighter, HdfsBasicDistributedZkTest, TestComplexPhraseLeadingWildcard, SuggesterTest, ScriptEngineTest, TestFieldResource, AsyncCallRequestStatusResponseTest, HLLSerializationTest, XsltUpdateRequestHandlerTest, OverseerRolesTest, AutoAddReplicasPlanActionTest, TestBulkSchemaConcurrent, SampleTest, TestZkChroot, TestStressRecovery, SuggesterFSTTest, TestSolrFieldCacheBean, TestFastLRUCache, QueryEqualityTest, SchemaVersionSpecificBehaviorTest, SortSpecParsingTest, TestNestedDocsSort, TestCoreBackup, DirectUpdateHandlerOptimizeTest, TestSweetSpotSimilarityFactory, DistributedFacetPivotLargeTest, SystemInfoHandlerTest, TestRTGBase, BlockCacheTest, RulesTest, TestSchemaNameResource, DeleteNodeTest, JvmMetricsTest, TestMinMaxOnMultiValuedField, TestSkipOverseerOperations, LegacyCloudClusterPropTest, QueryResultKeyTest, TestSurroundQueryParser, SolrInfoBeanTest, DistribJoinFromCollectionTest, HttpSolrCallGetCoreTest, DistributedDebugComponentTest, TestPartialUpdateDeduplication, TestDistribIDF, DistributedFacetSimpleRefinementLongTailTest, TestSolrJ, BlockJoinFacetSimpleTest, DeleteStatusTest, TestUninvertingReader, HighlighterMaxOffsetTest, TestFieldCache, AnalyticsQueryTest, TestLRUStatsCache, TestNRTOpen, TestSolrCloudWithSecureImpersonation, StressHdfsTest, TestSimpleTextCodec, TestDistributedGrouping, CSVRequestHandlerTest, CdcrVersionReplicationTest, PreAnalyzedUpdateProcessorTest, TestReversedWildcardFilterFactory, TestTrieFacet, DirectSolrConnectionTest, ConcurrentDeleteAndCreateCollectionTest, CurrencyFieldTypeTest, LeaderFailoverAfterPartitionTest, BitVectorTest, SolrGangliaReporterTest, AddReplicaTest, TestRecovery, RestartWhileUpdatingTest, HdfsTlogReplayBufferedWhileIndexingTest, SearchHandlerTest, HttpPartitionTest, TestLegacyField, PKIAuthenticationIntegrationTest, BasicZkTest, TestClassicSimilarityFactory, UUIDUpdateProcessorFallbackTest, TestBM25SimilarityFactory, TestDeleteCollectionOnDownNodes, TestJettySolrRunner, TestChildDocTransformer, ExecutePlanActionTest, AutoscalingHistoryHandlerTest]
   [junit4] Completed [267/774 (1!)] on J1 in 20.31s, 1 test, 1 failure <<< FAILURES!

[...truncated 49839 lines...]