You are viewing a plain text version of this content. The canonical link for it is here.
Posted to notifications@qpid.apache.org by Apache Jenkins Server <je...@builds.apache.org> on 2017/11/03 10:53:46 UTC
Build failed in Jenkins: Qpid-BrokerForJava-TestMatrix » ubuntu,JDK 1.8 (latest),java-dby.0-9-1 #3994
See <https://builds.apache.org/job/Qpid-BrokerForJava-TestMatrix/Ubuntu%20Slaves=ubuntu,jdk=JDK%201.8%20(latest),profile=java-dby.0-9-1/3994/display/redirect>
------------------------------------------
Started by upstream project "Qpid-BrokerForJava-TestMatrix" build number 3994
originally caused by:
Started by an SCM change
[EnvInject] - Loading node environment variables.
Building remotely on H16 (couchdbtest ubuntu xenial) in workspace <https://builds.apache.org/job/Qpid-BrokerForJava-TestMatrix/Ubuntu%20Slaves=ubuntu,jdk=JDK%201.8%20(latest),profile=java-dby.0-9-1/ws/>
> git rev-parse --is-inside-work-tree # timeout=10
Fetching changes from the remote Git repository
> git config remote.origin.url https://git-wip-us.apache.org/repos/asf/qpid-broker-j.git # timeout=10
Cleaning workspace
> git rev-parse --verify HEAD # timeout=10
Resetting working tree
> git reset --hard # timeout=10
> git clean -fdx # timeout=10
Fetching upstream changes from https://git-wip-us.apache.org/repos/asf/qpid-broker-j.git
> git --version # timeout=10
> git fetch --tags --progress https://git-wip-us.apache.org/repos/asf/qpid-broker-j.git +refs/heads/*:refs/remotes/origin/* --depth=1
Checking out Revision c5fd4328917776c3537533a3b7f34273520e2ca7 (refs/remotes/origin/master)
> git config core.sparsecheckout # timeout=10
> git checkout -f c5fd4328917776c3537533a3b7f34273520e2ca7
FATAL: Could not checkout c5fd4328917776c3537533a3b7f34273520e2ca7
hudson.plugins.git.GitException: Command "git checkout -f c5fd4328917776c3537533a3b7f34273520e2ca7" returned status code 128:
stdout:
stderr: fatal: reference is not a tree: c5fd4328917776c3537533a3b7f34273520e2ca7
at org.jenkinsci.plugins.gitclient.CliGitAPIImpl.launchCommandIn(CliGitAPIImpl.java:1970)
at org.jenkinsci.plugins.gitclient.CliGitAPIImpl.access$800(CliGitAPIImpl.java:71)
at org.jenkinsci.plugins.gitclient.CliGitAPIImpl$9.execute(CliGitAPIImpl.java:2269)
at org.jenkinsci.plugins.gitclient.RemoteGitImpl$CommandInvocationHandler$1.call(RemoteGitImpl.java:153)
at org.jenkinsci.plugins.gitclient.RemoteGitImpl$CommandInvocationHandler$1.call(RemoteGitImpl.java:146)
at hudson.remoting.UserRequest.perform(UserRequest.java:181)
at hudson.remoting.UserRequest.perform(UserRequest.java:52)
at hudson.remoting.Request$2.run(Request.java:336)
at hudson.remoting.InterceptingExecutorService$1.call(InterceptingExecutorService.java:68)
at java.util.concurrent.FutureTask.run(FutureTask.java:266)
at java.util.concurrent.ThreadPoolExecutor.runWorker(ThreadPoolExecutor.java:1142)
at java.util.concurrent.ThreadPoolExecutor$Worker.run(ThreadPoolExecutor.java:617)
at java.lang.Thread.run(Thread.java:748)
Caused: hudson.plugins.git.GitException: Could not checkout c5fd4328917776c3537533a3b7f34273520e2ca7
at org.jenkinsci.plugins.gitclient.CliGitAPIImpl$9.execute(CliGitAPIImpl.java:2293)
at org.jenkinsci.plugins.gitclient.RemoteGitImpl$CommandInvocationHandler$1.call(RemoteGitImpl.java:153)
at org.jenkinsci.plugins.gitclient.RemoteGitImpl$CommandInvocationHandler$1.call(RemoteGitImpl.java:146)
at hudson.remoting.UserRequest.perform(UserRequest.java:181)
at hudson.remoting.UserRequest.perform(UserRequest.java:52)
at hudson.remoting.Request$2.run(Request.java:336)
at hudson.remoting.InterceptingExecutorService$1.call(InterceptingExecutorService.java:68)
at java.util.concurrent.FutureTask.run(FutureTask.java:266)
at java.util.concurrent.ThreadPoolExecutor.runWorker(ThreadPoolExecutor.java:1142)
at java.util.concurrent.ThreadPoolExecutor$Worker.run(ThreadPoolExecutor.java:617)
at java.lang.Thread.run(Thread.java:748)
at ......remote call to H16(Native Method)
at hudson.remoting.Channel.attachCallSiteStackTrace(Channel.java:1554)
at hudson.remoting.UserResponse.retrieve(UserRequest.java:281)
at hudson.remoting.Channel.call(Channel.java:839)
at org.jenkinsci.plugins.gitclient.RemoteGitImpl$CommandInvocationHandler.execute(RemoteGitImpl.java:146)
at sun.reflect.GeneratedMethodAccessor703.invoke(Unknown Source)
at sun.reflect.DelegatingMethodAccessorImpl.invoke(DelegatingMethodAccessorImpl.java:43)
at java.lang.reflect.Method.invoke(Method.java:498)
at org.jenkinsci.plugins.gitclient.RemoteGitImpl$CommandInvocationHandler.invoke(RemoteGitImpl.java:132)
at com.sun.proxy.$Proxy129.execute(Unknown Source)
at hudson.plugins.git.GitSCM.checkout(GitSCM.java:1173)
at hudson.scm.SCM.checkout(SCM.java:495)
at hudson.model.AbstractProject.checkout(AbstractProject.java:1212)
at hudson.model.AbstractBuild$AbstractBuildExecution.defaultCheckout(AbstractBuild.java:566)
at jenkins.scm.SCMCheckoutStrategy.checkout(SCMCheckoutStrategy.java:86)
at hudson.model.AbstractBuild$AbstractBuildExecution.run(AbstractBuild.java:491)
at hudson.model.Run.execute(Run.java:1737)
at hudson.matrix.MatrixRun.run(MatrixRun.java:146)
at hudson.model.ResourceController.execute(ResourceController.java:97)
at hudson.model.Executor.run(Executor.java:419)
Archiving artifacts
Performing Post build task...
Match found for : : True
Logical operation result is TRUE
Running script : echo Finishing build
date
[java-dby.0-9-1] $ /bin/bash -xe /tmp/jenkins6226892364837707828.sh
+ echo Finishing build
Finishing build
+ date
Fri Nov 3 10:53:45 UTC 2017
POST BUILD TASK : SUCCESS
END OF POST BUILD TASK : 0
Recording test results
ERROR: Step ?Publish JUnit test result report? failed: No test report files were found. Configuration error?
Jenkins build is back to normal : Qpid-BrokerForJava-TestMatrix » ubuntu,JDK 1.8 (latest),java-dby.0-9-1 #3999
Posted by Apache Jenkins Server <je...@builds.apache.org>.
See <https://builds.apache.org/job/Qpid-BrokerForJava-TestMatrix/Ubuntu%20Slaves=ubuntu,jdk=JDK%201.8%20(latest),profile=java-dby.0-9-1/3999/display/redirect?page=changes>
Build failed in Jenkins: Qpid-BrokerForJava-TestMatrix » ubuntu,JDK 1.8 (latest),java-dby.0-9-1 #3998
Posted by Apache Jenkins Server <je...@builds.apache.org>.
See <https://builds.apache.org/job/Qpid-BrokerForJava-TestMatrix/Ubuntu%20Slaves=ubuntu,jdk=JDK%201.8%20(latest),profile=java-dby.0-9-1/3998/display/redirect>
------------------------------------------
Started by upstream project "Qpid-BrokerForJava-TestMatrix" build number 3998
originally caused by:
Started by an SCM change
Started by an SCM change
Started by an SCM change
Started by an SCM change
Started by an SCM change
[EnvInject] - Loading node environment variables.
Building remotely on ubuntu-eu2 (ubuntu trusty) in workspace <https://builds.apache.org/job/Qpid-BrokerForJava-TestMatrix/Ubuntu%20Slaves=ubuntu,jdk=JDK%201.8%20(latest),profile=java-dby.0-9-1/ws/>
> git rev-parse --is-inside-work-tree # timeout=10
Fetching changes from the remote Git repository
> git config remote.origin.url https://git-wip-us.apache.org/repos/asf/qpid-broker-j.git # timeout=10
Cleaning workspace
> git rev-parse --verify HEAD # timeout=10
Resetting working tree
> git reset --hard # timeout=10
> git clean -fdx # timeout=10
Fetching upstream changes from https://git-wip-us.apache.org/repos/asf/qpid-broker-j.git
> git --version # timeout=10
> git fetch --tags --progress https://git-wip-us.apache.org/repos/asf/qpid-broker-j.git +refs/heads/*:refs/remotes/origin/* --depth=1
Checking out Revision e36f40fa50d2ccc3abb86adf204592bbdaa2de14 (refs/remotes/origin/master)
> git config core.sparsecheckout # timeout=10
> git checkout -f e36f40fa50d2ccc3abb86adf204592bbdaa2de14
FATAL: Could not checkout e36f40fa50d2ccc3abb86adf204592bbdaa2de14
hudson.plugins.git.GitException: Command "git checkout -f e36f40fa50d2ccc3abb86adf204592bbdaa2de14" returned status code 128:
stdout:
stderr: fatal: reference is not a tree: e36f40fa50d2ccc3abb86adf204592bbdaa2de14
at org.jenkinsci.plugins.gitclient.CliGitAPIImpl.launchCommandIn(CliGitAPIImpl.java:1970)
at org.jenkinsci.plugins.gitclient.CliGitAPIImpl.access$800(CliGitAPIImpl.java:71)
at org.jenkinsci.plugins.gitclient.CliGitAPIImpl$9.execute(CliGitAPIImpl.java:2269)
at org.jenkinsci.plugins.gitclient.RemoteGitImpl$CommandInvocationHandler$1.call(RemoteGitImpl.java:153)
at org.jenkinsci.plugins.gitclient.RemoteGitImpl$CommandInvocationHandler$1.call(RemoteGitImpl.java:146)
at hudson.remoting.UserRequest.perform(UserRequest.java:181)
at hudson.remoting.UserRequest.perform(UserRequest.java:52)
at hudson.remoting.Request$2.run(Request.java:336)
at hudson.remoting.InterceptingExecutorService$1.call(InterceptingExecutorService.java:68)
at java.util.concurrent.FutureTask.run(FutureTask.java:266)
at java.util.concurrent.ThreadPoolExecutor.runWorker(ThreadPoolExecutor.java:1142)
at java.util.concurrent.ThreadPoolExecutor$Worker.run(ThreadPoolExecutor.java:617)
at java.lang.Thread.run(Thread.java:748)
Caused: hudson.plugins.git.GitException: Could not checkout e36f40fa50d2ccc3abb86adf204592bbdaa2de14
at org.jenkinsci.plugins.gitclient.CliGitAPIImpl$9.execute(CliGitAPIImpl.java:2293)
at org.jenkinsci.plugins.gitclient.RemoteGitImpl$CommandInvocationHandler$1.call(RemoteGitImpl.java:153)
at org.jenkinsci.plugins.gitclient.RemoteGitImpl$CommandInvocationHandler$1.call(RemoteGitImpl.java:146)
at hudson.remoting.UserRequest.perform(UserRequest.java:181)
at hudson.remoting.UserRequest.perform(UserRequest.java:52)
at hudson.remoting.Request$2.run(Request.java:336)
at hudson.remoting.InterceptingExecutorService$1.call(InterceptingExecutorService.java:68)
at java.util.concurrent.FutureTask.run(FutureTask.java:266)
at java.util.concurrent.ThreadPoolExecutor.runWorker(ThreadPoolExecutor.java:1142)
at java.util.concurrent.ThreadPoolExecutor$Worker.run(ThreadPoolExecutor.java:617)
at java.lang.Thread.run(Thread.java:748)
at ......remote call to ubuntu-eu2(Native Method)
at hudson.remoting.Channel.attachCallSiteStackTrace(Channel.java:1554)
at hudson.remoting.UserResponse.retrieve(UserRequest.java:281)
at hudson.remoting.Channel.call(Channel.java:839)
at org.jenkinsci.plugins.gitclient.RemoteGitImpl$CommandInvocationHandler.execute(RemoteGitImpl.java:146)
at sun.reflect.GeneratedMethodAccessor703.invoke(Unknown Source)
at sun.reflect.DelegatingMethodAccessorImpl.invoke(DelegatingMethodAccessorImpl.java:43)
at java.lang.reflect.Method.invoke(Method.java:498)
at org.jenkinsci.plugins.gitclient.RemoteGitImpl$CommandInvocationHandler.invoke(RemoteGitImpl.java:132)
at com.sun.proxy.$Proxy129.execute(Unknown Source)
at hudson.plugins.git.GitSCM.checkout(GitSCM.java:1173)
at hudson.scm.SCM.checkout(SCM.java:495)
at hudson.model.AbstractProject.checkout(AbstractProject.java:1212)
at hudson.model.AbstractBuild$AbstractBuildExecution.defaultCheckout(AbstractBuild.java:566)
at jenkins.scm.SCMCheckoutStrategy.checkout(SCMCheckoutStrategy.java:86)
at hudson.model.AbstractBuild$AbstractBuildExecution.run(AbstractBuild.java:491)
at hudson.model.Run.execute(Run.java:1737)
at hudson.matrix.MatrixRun.run(MatrixRun.java:146)
at hudson.model.ResourceController.execute(ResourceController.java:97)
at hudson.model.Executor.run(Executor.java:419)
Archiving artifacts
Performing Post build task...
Match found for : : True
Logical operation result is TRUE
Running script : echo Finishing build
date
[java-dby.0-9-1] $ /bin/bash -xe /tmp/jenkins3990455345486238999.sh
+ echo Finishing build
Finishing build
+ date
Fri Nov 3 17:27:42 UTC 2017
POST BUILD TASK : SUCCESS
END OF POST BUILD TASK : 0
Recording test results
ERROR: Step ‘Publish JUnit test result report’ failed: No test report files were found. Configuration error?
Build failed in Jenkins: Qpid-BrokerForJava-TestMatrix » ubuntu,JDK 1.8 (latest),java-dby.0-9-1 #3997
Posted by Apache Jenkins Server <je...@builds.apache.org>.
See <https://builds.apache.org/job/Qpid-BrokerForJava-TestMatrix/Ubuntu%20Slaves=ubuntu,jdk=JDK%201.8%20(latest),profile=java-dby.0-9-1/3997/display/redirect>
------------------------------------------
Started by upstream project "Qpid-BrokerForJava-TestMatrix" build number 3997
originally caused by:
Started by an SCM change
Started by an SCM change
[EnvInject] - Loading node environment variables.
Building remotely on H23 (couchdbtest ubuntu xenial) in workspace <https://builds.apache.org/job/Qpid-BrokerForJava-TestMatrix/Ubuntu%20Slaves=ubuntu,jdk=JDK%201.8%20(latest),profile=java-dby.0-9-1/ws/>
Cloning the remote Git repository
Using shallow clone
Cloning repository https://git-wip-us.apache.org/repos/asf/qpid-broker-j.git
> git init <https://builds.apache.org/job/Qpid-BrokerForJava-TestMatrix/Ubuntu%20Slaves=ubuntu,jdk=JDK%201.8%20(latest),profile=java-dby.0-9-1/ws/> # timeout=10
Fetching upstream changes from https://git-wip-us.apache.org/repos/asf/qpid-broker-j.git
> git --version # timeout=10
> git fetch --tags --progress https://git-wip-us.apache.org/repos/asf/qpid-broker-j.git +refs/heads/*:refs/remotes/origin/* --depth=1
> git config remote.origin.url https://git-wip-us.apache.org/repos/asf/qpid-broker-j.git # timeout=10
> git config --add remote.origin.fetch +refs/heads/*:refs/remotes/origin/* # timeout=10
> git config remote.origin.url https://git-wip-us.apache.org/repos/asf/qpid-broker-j.git # timeout=10
Cleaning workspace
> git rev-parse --verify HEAD # timeout=10
No valid HEAD. Skipping the resetting
> git clean -fdx # timeout=10
Fetching upstream changes from https://git-wip-us.apache.org/repos/asf/qpid-broker-j.git
> git fetch --tags --progress https://git-wip-us.apache.org/repos/asf/qpid-broker-j.git +refs/heads/*:refs/remotes/origin/* --depth=1
Checking out Revision 56c5cfd730ad0be167c2cc078e33ad7040b37cef (refs/remotes/origin/master)
> git config core.sparsecheckout # timeout=10
> git checkout -f 56c5cfd730ad0be167c2cc078e33ad7040b37cef
FATAL: Could not checkout 56c5cfd730ad0be167c2cc078e33ad7040b37cef
hudson.plugins.git.GitException: Command "git checkout -f 56c5cfd730ad0be167c2cc078e33ad7040b37cef" returned status code 128:
stdout:
stderr: fatal: reference is not a tree: 56c5cfd730ad0be167c2cc078e33ad7040b37cef
at org.jenkinsci.plugins.gitclient.CliGitAPIImpl.launchCommandIn(CliGitAPIImpl.java:1970)
at org.jenkinsci.plugins.gitclient.CliGitAPIImpl.access$800(CliGitAPIImpl.java:71)
at org.jenkinsci.plugins.gitclient.CliGitAPIImpl$9.execute(CliGitAPIImpl.java:2269)
at org.jenkinsci.plugins.gitclient.RemoteGitImpl$CommandInvocationHandler$1.call(RemoteGitImpl.java:153)
at org.jenkinsci.plugins.gitclient.RemoteGitImpl$CommandInvocationHandler$1.call(RemoteGitImpl.java:146)
at hudson.remoting.UserRequest.perform(UserRequest.java:181)
at hudson.remoting.UserRequest.perform(UserRequest.java:52)
at hudson.remoting.Request$2.run(Request.java:336)
at hudson.remoting.InterceptingExecutorService$1.call(InterceptingExecutorService.java:68)
at java.util.concurrent.FutureTask.run(FutureTask.java:266)
at java.util.concurrent.ThreadPoolExecutor.runWorker(ThreadPoolExecutor.java:1142)
at java.util.concurrent.ThreadPoolExecutor$Worker.run(ThreadPoolExecutor.java:617)
at java.lang.Thread.run(Thread.java:748)
Caused: hudson.plugins.git.GitException: Could not checkout 56c5cfd730ad0be167c2cc078e33ad7040b37cef
at org.jenkinsci.plugins.gitclient.CliGitAPIImpl$9.execute(CliGitAPIImpl.java:2293)
at org.jenkinsci.plugins.gitclient.RemoteGitImpl$CommandInvocationHandler$1.call(RemoteGitImpl.java:153)
at org.jenkinsci.plugins.gitclient.RemoteGitImpl$CommandInvocationHandler$1.call(RemoteGitImpl.java:146)
at hudson.remoting.UserRequest.perform(UserRequest.java:181)
at hudson.remoting.UserRequest.perform(UserRequest.java:52)
at hudson.remoting.Request$2.run(Request.java:336)
at hudson.remoting.InterceptingExecutorService$1.call(InterceptingExecutorService.java:68)
at java.util.concurrent.FutureTask.run(FutureTask.java:266)
at java.util.concurrent.ThreadPoolExecutor.runWorker(ThreadPoolExecutor.java:1142)
at java.util.concurrent.ThreadPoolExecutor$Worker.run(ThreadPoolExecutor.java:617)
at java.lang.Thread.run(Thread.java:748)
at ......remote call to H23(Native Method)
at hudson.remoting.Channel.attachCallSiteStackTrace(Channel.java:1554)
at hudson.remoting.UserResponse.retrieve(UserRequest.java:281)
at hudson.remoting.Channel.call(Channel.java:839)
at org.jenkinsci.plugins.gitclient.RemoteGitImpl$CommandInvocationHandler.execute(RemoteGitImpl.java:146)
at sun.reflect.GeneratedMethodAccessor703.invoke(Unknown Source)
at sun.reflect.DelegatingMethodAccessorImpl.invoke(DelegatingMethodAccessorImpl.java:43)
at java.lang.reflect.Method.invoke(Method.java:498)
at org.jenkinsci.plugins.gitclient.RemoteGitImpl$CommandInvocationHandler.invoke(RemoteGitImpl.java:132)
at com.sun.proxy.$Proxy129.execute(Unknown Source)
at hudson.plugins.git.GitSCM.checkout(GitSCM.java:1173)
at hudson.scm.SCM.checkout(SCM.java:495)
at hudson.model.AbstractProject.checkout(AbstractProject.java:1212)
at hudson.model.AbstractBuild$AbstractBuildExecution.defaultCheckout(AbstractBuild.java:566)
at jenkins.scm.SCMCheckoutStrategy.checkout(SCMCheckoutStrategy.java:86)
at hudson.model.AbstractBuild$AbstractBuildExecution.run(AbstractBuild.java:491)
at hudson.model.Run.execute(Run.java:1737)
at hudson.matrix.MatrixRun.run(MatrixRun.java:146)
at hudson.model.ResourceController.execute(ResourceController.java:97)
at hudson.model.Executor.run(Executor.java:419)
Archiving artifacts
Performing Post build task...
Match found for : : True
Logical operation result is TRUE
Running script : echo Finishing build
date
[java-dby.0-9-1] $ /bin/bash -xe /tmp/jenkins2594206639727375105.sh
+ echo Finishing build
Finishing build
+ date
Fri Nov 3 17:01:57 UTC 2017
POST BUILD TASK : SUCCESS
END OF POST BUILD TASK : 0
Recording test results
ERROR: Step ?Publish JUnit test result report? failed: No test report files were found. Configuration error?
Build failed in Jenkins: Qpid-BrokerForJava-TestMatrix » ubuntu,JDK 1.8 (latest),java-dby.0-9-1 #3995
Posted by Apache Jenkins Server <je...@builds.apache.org>.
See <https://builds.apache.org/job/Qpid-BrokerForJava-TestMatrix/Ubuntu%20Slaves=ubuntu,jdk=JDK%201.8%20(latest),profile=java-dby.0-9-1/3995/display/redirect>
------------------------------------------
Started by upstream project "Qpid-BrokerForJava-TestMatrix" build number 3995
originally caused by:
Started by an SCM change
Started by an SCM change
Started by an SCM change
Started by an SCM change
Started by an SCM change
[EnvInject] - Loading node environment variables.
Building remotely on ubuntu-us1 (ubuntu trusty) in workspace <https://builds.apache.org/job/Qpid-BrokerForJava-TestMatrix/Ubuntu%20Slaves=ubuntu,jdk=JDK%201.8%20(latest),profile=java-dby.0-9-1/ws/>
Cloning the remote Git repository
Using shallow clone
Cloning repository https://git-wip-us.apache.org/repos/asf/qpid-broker-j.git
> git init <https://builds.apache.org/job/Qpid-BrokerForJava-TestMatrix/Ubuntu%20Slaves=ubuntu,jdk=JDK%201.8%20(latest),profile=java-dby.0-9-1/ws/> # timeout=10
Fetching upstream changes from https://git-wip-us.apache.org/repos/asf/qpid-broker-j.git
> git --version # timeout=10
> git fetch --tags --progress https://git-wip-us.apache.org/repos/asf/qpid-broker-j.git +refs/heads/*:refs/remotes/origin/* --depth=1
> git config remote.origin.url https://git-wip-us.apache.org/repos/asf/qpid-broker-j.git # timeout=10
> git config --add remote.origin.fetch +refs/heads/*:refs/remotes/origin/* # timeout=10
> git config remote.origin.url https://git-wip-us.apache.org/repos/asf/qpid-broker-j.git # timeout=10
Cleaning workspace
> git rev-parse --verify HEAD # timeout=10
No valid HEAD. Skipping the resetting
> git clean -fdx # timeout=10
Fetching upstream changes from https://git-wip-us.apache.org/repos/asf/qpid-broker-j.git
> git fetch --tags --progress https://git-wip-us.apache.org/repos/asf/qpid-broker-j.git +refs/heads/*:refs/remotes/origin/* --depth=1
Checking out Revision b28150f50e473d24415859366974de0f306cd40f (refs/remotes/origin/master)
> git config core.sparsecheckout # timeout=10
> git checkout -f b28150f50e473d24415859366974de0f306cd40f
FATAL: Could not checkout b28150f50e473d24415859366974de0f306cd40f
hudson.plugins.git.GitException: Command "git checkout -f b28150f50e473d24415859366974de0f306cd40f" returned status code 128:
stdout:
stderr: fatal: reference is not a tree: b28150f50e473d24415859366974de0f306cd40f
at org.jenkinsci.plugins.gitclient.CliGitAPIImpl.launchCommandIn(CliGitAPIImpl.java:1970)
at org.jenkinsci.plugins.gitclient.CliGitAPIImpl.access$800(CliGitAPIImpl.java:71)
at org.jenkinsci.plugins.gitclient.CliGitAPIImpl$9.execute(CliGitAPIImpl.java:2269)
at org.jenkinsci.plugins.gitclient.RemoteGitImpl$CommandInvocationHandler$1.call(RemoteGitImpl.java:153)
at org.jenkinsci.plugins.gitclient.RemoteGitImpl$CommandInvocationHandler$1.call(RemoteGitImpl.java:146)
at hudson.remoting.UserRequest.perform(UserRequest.java:181)
at hudson.remoting.UserRequest.perform(UserRequest.java:52)
at hudson.remoting.Request$2.run(Request.java:336)
at hudson.remoting.InterceptingExecutorService$1.call(InterceptingExecutorService.java:68)
at java.util.concurrent.FutureTask.run(FutureTask.java:266)
at java.util.concurrent.ThreadPoolExecutor.runWorker(ThreadPoolExecutor.java:1142)
at java.util.concurrent.ThreadPoolExecutor$Worker.run(ThreadPoolExecutor.java:617)
at java.lang.Thread.run(Thread.java:748)
Caused: hudson.plugins.git.GitException: Could not checkout b28150f50e473d24415859366974de0f306cd40f
at org.jenkinsci.plugins.gitclient.CliGitAPIImpl$9.execute(CliGitAPIImpl.java:2293)
at org.jenkinsci.plugins.gitclient.RemoteGitImpl$CommandInvocationHandler$1.call(RemoteGitImpl.java:153)
at org.jenkinsci.plugins.gitclient.RemoteGitImpl$CommandInvocationHandler$1.call(RemoteGitImpl.java:146)
at hudson.remoting.UserRequest.perform(UserRequest.java:181)
at hudson.remoting.UserRequest.perform(UserRequest.java:52)
at hudson.remoting.Request$2.run(Request.java:336)
at hudson.remoting.InterceptingExecutorService$1.call(InterceptingExecutorService.java:68)
at java.util.concurrent.FutureTask.run(FutureTask.java:266)
at java.util.concurrent.ThreadPoolExecutor.runWorker(ThreadPoolExecutor.java:1142)
at java.util.concurrent.ThreadPoolExecutor$Worker.run(ThreadPoolExecutor.java:617)
at java.lang.Thread.run(Thread.java:748)
at ......remote call to ubuntu-us1(Native Method)
at hudson.remoting.Channel.attachCallSiteStackTrace(Channel.java:1554)
at hudson.remoting.UserResponse.retrieve(UserRequest.java:281)
at hudson.remoting.Channel.call(Channel.java:839)
at org.jenkinsci.plugins.gitclient.RemoteGitImpl$CommandInvocationHandler.execute(RemoteGitImpl.java:146)
at sun.reflect.GeneratedMethodAccessor703.invoke(Unknown Source)
at sun.reflect.DelegatingMethodAccessorImpl.invoke(DelegatingMethodAccessorImpl.java:43)
at java.lang.reflect.Method.invoke(Method.java:498)
at org.jenkinsci.plugins.gitclient.RemoteGitImpl$CommandInvocationHandler.invoke(RemoteGitImpl.java:132)
at com.sun.proxy.$Proxy129.execute(Unknown Source)
at hudson.plugins.git.GitSCM.checkout(GitSCM.java:1173)
at hudson.scm.SCM.checkout(SCM.java:495)
at hudson.model.AbstractProject.checkout(AbstractProject.java:1212)
at hudson.model.AbstractBuild$AbstractBuildExecution.defaultCheckout(AbstractBuild.java:566)
at jenkins.scm.SCMCheckoutStrategy.checkout(SCMCheckoutStrategy.java:86)
at hudson.model.AbstractBuild$AbstractBuildExecution.run(AbstractBuild.java:491)
at hudson.model.Run.execute(Run.java:1737)
at hudson.matrix.MatrixRun.run(MatrixRun.java:146)
at hudson.model.ResourceController.execute(ResourceController.java:97)
at hudson.model.Executor.run(Executor.java:419)
Archiving artifacts
Performing Post build task...
Match found for : : True
Logical operation result is TRUE
Running script : echo Finishing build
date
[java-dby.0-9-1] $ /bin/bash -xe /tmp/jenkins3776794098237708343.sh
+ echo Finishing build
Finishing build
+ date
Fri Nov 3 14:42:08 UTC 2017
POST BUILD TASK : SUCCESS
END OF POST BUILD TASK : 0
Recording test results
ERROR: Step ‘Publish JUnit test result report’ failed: No test report files were found. Configuration error?