You are viewing a plain text version of this content. The canonical link for it is here.
Posted to mapreduce-dev@hadoop.apache.org by Apache Jenkins Server <je...@builds.apache.org> on 2015/11/11 19:15:57 UTC
Hadoop-Mapreduce-trunk - Build # 2597 - Still Failing
See https://builds.apache.org/job/Hadoop-Mapreduce-trunk/2597/
###################################################################################
########################## LAST 60 LINES OF THE CONSOLE ###########################
[...truncated 32366 lines...]
Running org.apache.hadoop.mapreduce.v2.hs.webapp.TestBlocks
Tests run: 5, Failures: 0, Errors: 0, Skipped: 0, Time elapsed: 1.518 sec - in org.apache.hadoop.mapreduce.v2.hs.webapp.TestBlocks
Running org.apache.hadoop.mapreduce.v2.hs.webapp.dao.TestJobInfo
Tests run: 2, Failures: 0, Errors: 0, Skipped: 0, Time elapsed: 2.286 sec - in org.apache.hadoop.mapreduce.v2.hs.webapp.dao.TestJobInfo
Running org.apache.hadoop.mapreduce.v2.hs.webapp.TestHsWebServicesAttempts
Tests run: 15, Failures: 0, Errors: 0, Skipped: 0, Time elapsed: 8.599 sec - in org.apache.hadoop.mapreduce.v2.hs.webapp.TestHsWebServicesAttempts
Running org.apache.hadoop.mapreduce.v2.hs.webapp.TestHsWebServices
Tests run: 11, Failures: 0, Errors: 0, Skipped: 0, Time elapsed: 7.074 sec - in org.apache.hadoop.mapreduce.v2.hs.webapp.TestHsWebServices
Running org.apache.hadoop.mapreduce.v2.hs.TestJobListCache
Tests run: 2, Failures: 0, Errors: 0, Skipped: 0, Time elapsed: 0.717 sec - in org.apache.hadoop.mapreduce.v2.hs.TestJobListCache
Results :
Failed tests:
TestJobHistoryServer.testLaunch:209 expected:<0> but was:<-1>
Tests run: 198, Failures: 1, Errors: 0, Skipped: 0
[INFO] ------------------------------------------------------------------------
[INFO] Reactor Summary:
[INFO]
[INFO] Apache Hadoop MapReduce Client .................... SUCCESS [ 2.977 s]
[INFO] Apache Hadoop MapReduce Core ...................... SUCCESS [01:42 min]
[INFO] Apache Hadoop MapReduce Common .................... SUCCESS [ 29.048 s]
[INFO] Apache Hadoop MapReduce Shuffle ................... SUCCESS [ 4.881 s]
[INFO] Apache Hadoop MapReduce App ....................... SUCCESS [09:17 min]
[INFO] Apache Hadoop MapReduce HistoryServer ............. FAILURE [05:35 min]
[INFO] Apache Hadoop MapReduce JobClient ................. SKIPPED
[INFO] Apache Hadoop MapReduce HistoryServer Plugins ..... SKIPPED
[INFO] Apache Hadoop MapReduce NativeTask ................ SKIPPED
[INFO] Apache Hadoop MapReduce Examples .................. SKIPPED
[INFO] Apache Hadoop MapReduce ........................... SKIPPED
[INFO] ------------------------------------------------------------------------
[INFO] BUILD FAILURE
[INFO] ------------------------------------------------------------------------
[INFO] Total time: 17:12 min
[INFO] Finished at: 2015-11-11T18:16:05+00:00
[INFO] Final Memory: 44M/694M
[INFO] ------------------------------------------------------------------------
[ERROR] Failed to execute goal org.apache.maven.plugins:maven-surefire-plugin:2.17:test (default-test) on project hadoop-mapreduce-client-hs: There are test failures.
[ERROR]
[ERROR] Please refer to /home/jenkins/jenkins-slave/workspace/Hadoop-Mapreduce-trunk/hadoop-mapreduce-project/hadoop-mapreduce-client/hadoop-mapreduce-client-hs/target/surefire-reports for the individual test results.
[ERROR] -> [Help 1]
[ERROR]
[ERROR] To see the full stack trace of the errors, re-run Maven with the -e switch.
[ERROR] Re-run Maven using the -X switch to enable full debug logging.
[ERROR]
[ERROR] For more information about the errors and possible solutions, please read the following articles:
[ERROR] [Help 1] http://cwiki.apache.org/confluence/display/MAVEN/MojoFailureException
[ERROR]
[ERROR] After correcting the problems, you can resume the build with the command
[ERROR] mvn <goals> -rf :hadoop-mapreduce-client-hs
Build step 'Execute shell' marked build as failure
[FINDBUGS] Skipping publisher since build result is FAILURE
Archiving artifacts
Recording test results
Updating MAPREDUCE-6533
Email was triggered for: Failure - Any
Sending email for trigger: Failure - Any
###################################################################################
############################## FAILED TESTS (if any) ##############################
1 tests failed.
FAILED: org.apache.hadoop.mapreduce.v2.hs.TestJobHistoryServer.testLaunch
Error Message:
expected:<0> but was:<-1>
Stack Trace:
java.lang.AssertionError: expected:<0> but was:<-1>
at org.junit.Assert.fail(Assert.java:88)
at org.junit.Assert.failNotEquals(Assert.java:743)
at org.junit.Assert.assertEquals(Assert.java:118)
at org.junit.Assert.assertEquals(Assert.java:555)
at org.junit.Assert.assertEquals(Assert.java:542)
at org.apache.hadoop.mapreduce.v2.hs.TestJobHistoryServer.testLaunch(TestJobHistoryServer.java:209)
Hadoop-Mapreduce-trunk - Build # 2599 - Still Failing
Posted by Apache Jenkins Server <je...@builds.apache.org>.
See https://builds.apache.org/job/Hadoop-Mapreduce-trunk/2599/
###################################################################################
########################## LAST 60 LINES OF THE CONSOLE ###########################
[...truncated 32274 lines...]
Running org.apache.hadoop.mapreduce.v2.app.webapp.TestAMWebApp
Tests run: 12, Failures: 0, Errors: 0, Skipped: 0, Time elapsed: 22.459 sec - in org.apache.hadoop.mapreduce.v2.app.webapp.TestAMWebApp
Running org.apache.hadoop.mapreduce.v2.app.webapp.TestAMWebServicesJobConf
Tests run: 4, Failures: 0, Errors: 0, Skipped: 0, Time elapsed: 8.291 sec - in org.apache.hadoop.mapreduce.v2.app.webapp.TestAMWebServicesJobConf
Running org.apache.hadoop.mapred.TestTaskAttemptListenerImpl
Tests run: 6, Failures: 0, Errors: 0, Skipped: 0, Time elapsed: 2.071 sec - in org.apache.hadoop.mapred.TestTaskAttemptListenerImpl
Running org.apache.hadoop.mapred.TestTaskAttemptFinishingMonitor
Tests run: 1, Failures: 0, Errors: 0, Skipped: 0, Time elapsed: 2.372 sec - in org.apache.hadoop.mapred.TestTaskAttemptFinishingMonitor
Running org.apache.hadoop.mapred.TestLocalContainerLauncher
Tests run: 2, Failures: 0, Errors: 0, Skipped: 0, Time elapsed: 2.928 sec - in org.apache.hadoop.mapred.TestLocalContainerLauncher
Results :
Failed tests:
TestJobImpl.testUnusableNodeTransition:629->assertJobState:1012 expected:<SUCCEEDED> but was:<ERROR>
Tests run: 340, Failures: 1, Errors: 0, Skipped: 0
[INFO] ------------------------------------------------------------------------
[INFO] Reactor Summary:
[INFO]
[INFO] Apache Hadoop MapReduce Client .................... SUCCESS [ 3.883 s]
[INFO] Apache Hadoop MapReduce Core ...................... SUCCESS [02:25 min]
[INFO] Apache Hadoop MapReduce Common .................... SUCCESS [ 40.764 s]
[INFO] Apache Hadoop MapReduce Shuffle ................... SUCCESS [ 7.725 s]
[INFO] Apache Hadoop MapReduce App ....................... FAILURE [11:17 min]
[INFO] Apache Hadoop MapReduce HistoryServer ............. SKIPPED
[INFO] Apache Hadoop MapReduce JobClient ................. SKIPPED
[INFO] Apache Hadoop MapReduce HistoryServer Plugins ..... SKIPPED
[INFO] Apache Hadoop MapReduce NativeTask ................ SKIPPED
[INFO] Apache Hadoop MapReduce Examples .................. SKIPPED
[INFO] Apache Hadoop MapReduce ........................... SKIPPED
[INFO] ------------------------------------------------------------------------
[INFO] BUILD FAILURE
[INFO] ------------------------------------------------------------------------
[INFO] Total time: 14:36 min
[INFO] Finished at: 2015-11-11T23:23:24+00:00
[INFO] Final Memory: 55M/1219M
[INFO] ------------------------------------------------------------------------
[ERROR] Failed to execute goal org.apache.maven.plugins:maven-surefire-plugin:2.17:test (default-test) on project hadoop-mapreduce-client-app: There are test failures.
[ERROR]
[ERROR] Please refer to /home/jenkins/jenkins-slave/workspace/Hadoop-Mapreduce-trunk/hadoop-mapreduce-project/hadoop-mapreduce-client/hadoop-mapreduce-client-app/target/surefire-reports for the individual test results.
[ERROR] -> [Help 1]
[ERROR]
[ERROR] To see the full stack trace of the errors, re-run Maven with the -e switch.
[ERROR] Re-run Maven using the -X switch to enable full debug logging.
[ERROR]
[ERROR] For more information about the errors and possible solutions, please read the following articles:
[ERROR] [Help 1] http://cwiki.apache.org/confluence/display/MAVEN/MojoFailureException
[ERROR]
[ERROR] After correcting the problems, you can resume the build with the command
[ERROR] mvn <goals> -rf :hadoop-mapreduce-client-app
Build step 'Execute shell' marked build as failure
[FINDBUGS] Skipping publisher since build result is FAILURE
Archiving artifacts
Recording test results
Updating HDFS-9396
Email was triggered for: Failure - Any
Sending email for trigger: Failure - Any
###################################################################################
############################## FAILED TESTS (if any) ##############################
1 tests failed.
FAILED: org.apache.hadoop.mapreduce.v2.app.job.impl.TestJobImpl.testUnusableNodeTransition
Error Message:
expected:<SUCCEEDED> but was:<ERROR>
Stack Trace:
java.lang.AssertionError: expected:<SUCCEEDED> but was:<ERROR>
at org.junit.Assert.fail(Assert.java:88)
at org.junit.Assert.failNotEquals(Assert.java:743)
at org.junit.Assert.assertEquals(Assert.java:118)
at org.junit.Assert.assertEquals(Assert.java:144)
at org.apache.hadoop.mapreduce.v2.app.job.impl.TestJobImpl.assertJobState(TestJobImpl.java:1012)
at org.apache.hadoop.mapreduce.v2.app.job.impl.TestJobImpl.testUnusableNodeTransition(TestJobImpl.java:629)
Hadoop-Mapreduce-trunk - Build # 2598 - Still Failing
Posted by Apache Jenkins Server <je...@builds.apache.org>.
See https://builds.apache.org/job/Hadoop-Mapreduce-trunk/2598/
###################################################################################
########################## LAST 60 LINES OF THE CONSOLE ###########################
[...truncated 32270 lines...]
Running org.apache.hadoop.mapreduce.v2.app.webapp.TestAMWebApp
Tests run: 12, Failures: 0, Errors: 0, Skipped: 0, Time elapsed: 22.949 sec - in org.apache.hadoop.mapreduce.v2.app.webapp.TestAMWebApp
Running org.apache.hadoop.mapreduce.v2.app.webapp.TestAMWebServicesJobConf
Tests run: 4, Failures: 0, Errors: 0, Skipped: 0, Time elapsed: 8.275 sec - in org.apache.hadoop.mapreduce.v2.app.webapp.TestAMWebServicesJobConf
Running org.apache.hadoop.mapred.TestTaskAttemptListenerImpl
Tests run: 6, Failures: 0, Errors: 0, Skipped: 0, Time elapsed: 1.872 sec - in org.apache.hadoop.mapred.TestTaskAttemptListenerImpl
Running org.apache.hadoop.mapred.TestTaskAttemptFinishingMonitor
Tests run: 1, Failures: 0, Errors: 0, Skipped: 0, Time elapsed: 2.162 sec - in org.apache.hadoop.mapred.TestTaskAttemptFinishingMonitor
Running org.apache.hadoop.mapred.TestLocalContainerLauncher
Tests run: 2, Failures: 0, Errors: 0, Skipped: 0, Time elapsed: 2.625 sec - in org.apache.hadoop.mapred.TestLocalContainerLauncher
Results :
Failed tests:
TestJobImpl.testUnusableNodeTransition:629->assertJobState:1012 expected:<SUCCEEDED> but was:<ERROR>
Tests run: 340, Failures: 1, Errors: 0, Skipped: 0
[INFO] ------------------------------------------------------------------------
[INFO] Reactor Summary:
[INFO]
[INFO] Apache Hadoop MapReduce Client .................... SUCCESS [ 3.788 s]
[INFO] Apache Hadoop MapReduce Core ...................... SUCCESS [02:15 min]
[INFO] Apache Hadoop MapReduce Common .................... SUCCESS [ 37.474 s]
[INFO] Apache Hadoop MapReduce Shuffle ................... SUCCESS [ 7.131 s]
[INFO] Apache Hadoop MapReduce App ....................... FAILURE [11:13 min]
[INFO] Apache Hadoop MapReduce HistoryServer ............. SKIPPED
[INFO] Apache Hadoop MapReduce JobClient ................. SKIPPED
[INFO] Apache Hadoop MapReduce HistoryServer Plugins ..... SKIPPED
[INFO] Apache Hadoop MapReduce NativeTask ................ SKIPPED
[INFO] Apache Hadoop MapReduce Examples .................. SKIPPED
[INFO] Apache Hadoop MapReduce ........................... SKIPPED
[INFO] ------------------------------------------------------------------------
[INFO] BUILD FAILURE
[INFO] ------------------------------------------------------------------------
[INFO] Total time: 14:19 min
[INFO] Finished at: 2015-11-11T20:36:31+00:00
[INFO] Final Memory: 44M/1215M
[INFO] ------------------------------------------------------------------------
[ERROR] Failed to execute goal org.apache.maven.plugins:maven-surefire-plugin:2.17:test (default-test) on project hadoop-mapreduce-client-app: There are test failures.
[ERROR]
[ERROR] Please refer to /home/jenkins/jenkins-slave/workspace/Hadoop-Mapreduce-trunk/hadoop-mapreduce-project/hadoop-mapreduce-client/hadoop-mapreduce-client-app/target/surefire-reports for the individual test results.
[ERROR] -> [Help 1]
[ERROR]
[ERROR] To see the full stack trace of the errors, re-run Maven with the -e switch.
[ERROR] Re-run Maven using the -X switch to enable full debug logging.
[ERROR]
[ERROR] For more information about the errors and possible solutions, please read the following articles:
[ERROR] [Help 1] http://cwiki.apache.org/confluence/display/MAVEN/MojoFailureException
[ERROR]
[ERROR] After correcting the problems, you can resume the build with the command
[ERROR] mvn <goals> -rf :hadoop-mapreduce-client-app
Build step 'Execute shell' marked build as failure
[FINDBUGS] Skipping publisher since build result is FAILURE
Archiving artifacts
Recording test results
Updating YARN-4183
Email was triggered for: Failure - Any
Sending email for trigger: Failure - Any
###################################################################################
############################## FAILED TESTS (if any) ##############################
1 tests failed.
FAILED: org.apache.hadoop.mapreduce.v2.app.job.impl.TestJobImpl.testUnusableNodeTransition
Error Message:
expected:<SUCCEEDED> but was:<ERROR>
Stack Trace:
java.lang.AssertionError: expected:<SUCCEEDED> but was:<ERROR>
at org.junit.Assert.fail(Assert.java:88)
at org.junit.Assert.failNotEquals(Assert.java:743)
at org.junit.Assert.assertEquals(Assert.java:118)
at org.junit.Assert.assertEquals(Assert.java:144)
at org.apache.hadoop.mapreduce.v2.app.job.impl.TestJobImpl.assertJobState(TestJobImpl.java:1012)
at org.apache.hadoop.mapreduce.v2.app.job.impl.TestJobImpl.testUnusableNodeTransition(TestJobImpl.java:629)