You are viewing a plain text version of this content. The canonical link for it is here.
Posted to dev@thrift.apache.org by Apache Jenkins Server <je...@builds.apache.org> on 2016/03/29 01:29:28 UTC
Build failed in Jenkins: Thrift-precommit #356
See <https://builds.apache.org/job/Thrift-precommit/356/>
------------------------------------------
[...truncated 8002 lines...]
npm http GET https://registry.npmjs.org/esutils/-/esutils-1.0.0.tgz
npm http GET https://registry.npmjs.org/estraverse/-/estraverse-1.5.1.tgz
npm http 200 https://registry.npmjs.org/source-map/-/source-map-0.1.43.tgz
npm http 200 https://registry.npmjs.org/estraverse/-/estraverse-1.5.1.tgz
npm http 200 https://registry.npmjs.org/esutils/-/esutils-1.0.0.tgz
npm http 200 https://registry.npmjs.org/esprima/-/esprima-1.1.1.tgz
npm http GET https://registry.npmjs.org/typedarray
npm http GET https://registry.npmjs.org/readable-stream/-/readable-stream-1.1.13.tgz
npm http GET https://registry.npmjs.org/through
npm http GET https://registry.npmjs.org/JSONStream
npm http GET https://registry.npmjs.org/xtend
npm http 200 https://registry.npmjs.org/typedarray
npm http 200 https://registry.npmjs.org/readable-stream/-/readable-stream-1.1.13.tgz
npm http GET https://registry.npmjs.org/typedarray/-/typedarray-0.0.6.tgz
npm http GET https://registry.npmjs.org/path-platform
npm http 304 https://registry.npmjs.org/xtend
npm http GET https://registry.npmjs.org/rfile
npm http GET https://registry.npmjs.org/ruglify
npm http GET https://registry.npmjs.org/uglify-js
npm http 304 https://registry.npmjs.org/JSONStream
npm http 304 https://registry.npmjs.org/through
npm http GET https://registry.npmjs.org/xtend/-/xtend-2.1.2.tgz
npm http 200 https://registry.npmjs.org/typedarray/-/typedarray-0.0.6.tgz
npm http 200 https://registry.npmjs.org/path-platform
npm http 200 https://registry.npmjs.org/rfile
npm http 200 https://registry.npmjs.org/uglify-js
npm http 200 https://registry.npmjs.org/ruglify
npm http GET https://registry.npmjs.org/JSONStream/-/JSONStream-0.6.4.tgz
npm http GET https://registry.npmjs.org/path-platform/-/path-platform-0.0.1.tgz
npm http GET https://registry.npmjs.org/indexof/0.0.1
npm http 200 https://registry.npmjs.org/xtend/-/xtend-2.1.2.tgz
npm http GET https://registry.npmjs.org/process
npm http GET https://registry.npmjs.org/rfile/-/rfile-1.0.0.tgz
npm http GET https://registry.npmjs.org/uglify-js/-/uglify-js-2.4.24.tgz
npm http GET https://registry.npmjs.org/ruglify/-/ruglify-1.0.0.tgz
npm http 200 https://registry.npmjs.org/JSONStream/-/JSONStream-0.6.4.tgz
npm http 200 https://registry.npmjs.org/path-platform/-/path-platform-0.0.1.tgz
npm http 200 https://registry.npmjs.org/indexof/0.0.1
npm http 304 https://registry.npmjs.org/process
npm http 200 https://registry.npmjs.org/uglify-js/-/uglify-js-2.4.24.tgz
npm http 200 https://registry.npmjs.org/rfile/-/rfile-1.0.0.tgz
npm http GET https://registry.npmjs.org/indexof/-/indexof-0.0.1.tgz
npm http 200 https://registry.npmjs.org/ruglify/-/ruglify-1.0.0.tgz
npm http GET https://registry.npmjs.org/acorn
npm http GET https://registry.npmjs.org/punycode/1.3.2
npm http 200 https://registry.npmjs.org/indexof/-/indexof-0.0.1.tgz
npm http GET https://registry.npmjs.org/querystring/0.2.0
npm http 200 https://registry.npmjs.org/acorn
npm http GET https://registry.npmjs.org/lexical-scope
npm http 200 https://registry.npmjs.org/punycode/1.3.2
npm http 200 https://registry.npmjs.org/querystring/0.2.0
npm http GET https://registry.npmjs.org/combine-source-map
npm http GET https://registry.npmjs.org/acorn/-/acorn-2.7.0.tgz
npm http GET https://registry.npmjs.org/process/-/process-0.6.0.tgz
npm http GET https://registry.npmjs.org/punycode/-/punycode-1.3.2.tgz
npm http GET https://registry.npmjs.org/querystring/-/querystring-0.2.0.tgz
npm http 200 https://registry.npmjs.org/lexical-scope
npm http 200 https://registry.npmjs.org/process/-/process-0.6.0.tgz
npm http 200 https://registry.npmjs.org/acorn/-/acorn-2.7.0.tgz
npm http 200 https://registry.npmjs.org/combine-source-map
npm http 200 https://registry.npmjs.org/querystring/-/querystring-0.2.0.tgz
npm http 200 https://registry.npmjs.org/punycode/-/punycode-1.3.2.tgz
npm http GET https://registry.npmjs.org/lexical-scope/-/lexical-scope-1.1.1.tgz
npm http GET https://registry.npmjs.org/combine-source-map/-/combine-source-map-0.3.0.tgz
npm http 200 https://registry.npmjs.org/lexical-scope/-/lexical-scope-1.1.1.tgz
npm http 200 https://registry.npmjs.org/combine-source-map/-/combine-source-map-0.3.0.tgz
npm http GET https://registry.npmjs.org/pako
npm http 200 https://registry.npmjs.org/pako
npm http GET https://registry.npmjs.org/pako/-/pako-0.2.8.tgz
npm http GET https://registry.npmjs.org/object-keys
npm http GET https://registry.npmjs.org/optimist
npm http 200 https://registry.npmjs.org/pako/-/pako-0.2.8.tgz
npm http GET https://registry.npmjs.org/uglify-js/-/uglify-js-2.3.6.tgz
npm http 200 https://registry.npmjs.org/object-keys
npm http GET https://registry.npmjs.org/object-keys/-/object-keys-0.4.0.tgz
npm http 200 https://registry.npmjs.org/optimist
npm http GET https://registry.npmjs.org/optimist/-/optimist-0.3.7.tgz
npm http 200 https://registry.npmjs.org/object-keys/-/object-keys-0.4.0.tgz
npm http 200 https://registry.npmjs.org/uglify-js/-/uglify-js-2.3.6.tgz
npm http GET https://registry.npmjs.org/minimist
npm http GET https://registry.npmjs.org/parents/0.0.2
npm http 200 https://registry.npmjs.org/optimist/-/optimist-0.3.7.tgz
npm http GET https://registry.npmjs.org/detective
npm http GET https://registry.npmjs.org/duplexer2/0.0.2
npm http GET https://registry.npmjs.org/stream-combiner
npm http GET https://registry.npmjs.org/esprima-fb
npm http GET https://registry.npmjs.org/esrefactor
npm http 200 https://registry.npmjs.org/parents/0.0.2
npm http 200 https://registry.npmjs.org/duplexer2/0.0.2
npm http 200 https://registry.npmjs.org/minimist
npm http GET https://registry.npmjs.org/parents/-/parents-0.0.2.tgz
npm http 200 https://registry.npmjs.org/detective
npm http 200 https://registry.npmjs.org/esrefactor
npm http 304 https://registry.npmjs.org/stream-combiner
npm http 200 https://registry.npmjs.org/esprima-fb
npm http GET https://registry.npmjs.org/minimist/-/minimist-0.0.10.tgz
npm http GET https://registry.npmjs.org/duplexer2/-/duplexer2-0.0.2.tgz
npm http GET https://registry.npmjs.org/detective/-/detective-3.1.0.tgz
npm http GET https://registry.npmjs.org/stream-combiner/-/stream-combiner-0.1.0.tgz
npm http GET https://registry.npmjs.org/esrefactor/-/esrefactor-0.1.0.tgz
npm http GET https://registry.npmjs.org/esprima-fb/-/esprima-fb-3001.0001.0000-dev-harmony-fb.tgz
npm http 200 https://registry.npmjs.org/parents/-/parents-0.0.2.tgz
npm http 200 https://registry.npmjs.org/esrefactor/-/esrefactor-0.1.0.tgz
npm http 200 https://registry.npmjs.org/stream-combiner/-/stream-combiner-0.1.0.tgz
npm http 200 https://registry.npmjs.org/esprima-fb/-/esprima-fb-3001.0001.0000-dev-harmony-fb.tgz
npm http 200 https://registry.npmjs.org/minimist/-/minimist-0.0.10.tgz
npm http 200 https://registry.npmjs.org/duplexer2/-/duplexer2-0.0.2.tgz
npm http 200 https://registry.npmjs.org/detective/-/detective-3.1.0.tgz
npm http GET https://registry.npmjs.org/jsonparse/0.0.5
npm http 200 https://registry.npmjs.org/jsonparse/0.0.5
npm http GET https://registry.npmjs.org/jsonparse/-/jsonparse-0.0.5.tgz
npm http 200 https://registry.npmjs.org/jsonparse/-/jsonparse-0.0.5.tgz
npm http GET https://registry.npmjs.org/isarray/0.0.1
npm http GET https://registry.npmjs.org/string_decoder
npm http GET https://registry.npmjs.org/core-util-is
npm http 304 https://registry.npmjs.org/string_decoder
npm http 304 https://registry.npmjs.org/isarray/0.0.1
npm http 304 https://registry.npmjs.org/core-util-is
npm http GET https://registry.npmjs.org/Base64
npm http GET https://registry.npmjs.org/escodegen
npm http 200 https://registry.npmjs.org/Base64
npm http GET https://registry.npmjs.org/Base64/-/Base64-0.2.1.tgz
npm http 304 https://registry.npmjs.org/escodegen
npm http GET https://registry.npmjs.org/escodegen/-/escodegen-1.1.0.tgz
npm http 200 https://registry.npmjs.org/Base64/-/Base64-0.2.1.tgz
npm http 200 https://registry.npmjs.org/escodegen/-/escodegen-1.1.0.tgz
npm http GET https://registry.npmjs.org/astw
npm http 200 https://registry.npmjs.org/astw
npm http GET https://registry.npmjs.org/astw/-/astw-2.0.0.tgz
npm http 200 https://registry.npmjs.org/astw/-/astw-2.0.0.tgz
npm http GET https://registry.npmjs.org/base64-js
npm http GET https://registry.npmjs.org/ieee754
npm http 200 https://registry.npmjs.org/ieee754
npm http 200 https://registry.npmjs.org/base64-js
npm http GET https://registry.npmjs.org/ieee754/-/ieee754-1.1.6.tgz
npm http GET https://registry.npmjs.org/base64-js/-/base64-js-0.0.8.tgz
npm http GET https://registry.npmjs.org/acorn/-/acorn-1.2.2.tgz
npm http 200 https://registry.npmjs.org/ieee754/-/ieee754-1.1.6.tgz
npm http 200 https://registry.npmjs.org/base64-js/-/base64-js-0.0.8.tgz
npm http 200 https://registry.npmjs.org/acorn/-/acorn-1.2.2.tgz
npm http GET https://registry.npmjs.org/inline-source-map
npm http GET https://registry.npmjs.org/convert-source-map
npm http 200 https://registry.npmjs.org/inline-source-map
npm http 200 https://registry.npmjs.org/convert-source-map
npm http GET https://registry.npmjs.org/inline-source-map/-/inline-source-map-0.3.1.tgz
npm http GET https://registry.npmjs.org/convert-source-map/-/convert-source-map-0.3.5.tgz
npm http 200 https://registry.npmjs.org/convert-source-map/-/convert-source-map-0.3.5.tgz
npm http 200 https://registry.npmjs.org/inline-source-map/-/inline-source-map-0.3.1.tgz
npm http GET https://registry.npmjs.org/callsite
npm http GET https://registry.npmjs.org/resolve
npm http 304 https://registry.npmjs.org/resolve
npm http 200 https://registry.npmjs.org/callsite
npm http GET https://registry.npmjs.org/resolve/-/resolve-0.3.1.tgz
npm http GET https://registry.npmjs.org/callsite/-/callsite-1.0.0.tgz
npm http 200 https://registry.npmjs.org/resolve/-/resolve-0.3.1.tgz
npm http GET https://registry.npmjs.org/through/-/through-2.2.7.tgz
npm http 200 https://registry.npmjs.org/callsite/-/callsite-1.0.0.tgz
npm http 200 https://registry.npmjs.org/through/-/through-2.2.7.tgz
npm http GET https://registry.npmjs.org/source-map
npm http 304 https://registry.npmjs.org/source-map
npm http GET https://registry.npmjs.org/source-map/-/source-map-0.3.0.tgz
npm http 200 https://registry.npmjs.org/source-map/-/source-map-0.3.0.tgz
npm http GET https://registry.npmjs.org/async
npm http GET https://registry.npmjs.org/uglify-js/-/uglify-js-2.2.5.tgz
npm http 304 https://registry.npmjs.org/async
npm http GET https://registry.npmjs.org/async/-/async-0.2.10.tgz
npm http 200 https://registry.npmjs.org/uglify-js/-/uglify-js-2.2.5.tgz
npm http GET https://registry.npmjs.org/amdefine
npm http 200 https://registry.npmjs.org/async/-/async-0.2.10.tgz
npm http GET https://registry.npmjs.org/source-map/0.1.34
npm http GET https://registry.npmjs.org/yargs
npm http GET https://registry.npmjs.org/uglify-to-browserify
npm http 200 https://registry.npmjs.org/amdefine
npm http GET https://registry.npmjs.org/amdefine/-/amdefine-1.0.0.tgz
npm http 200 https://registry.npmjs.org/source-map/0.1.34
npm http 200 https://registry.npmjs.org/uglify-to-browserify
npm http GET https://registry.npmjs.org/source-map/-/source-map-0.1.34.tgz
npm http GET https://registry.npmjs.org/uglify-to-browserify/-/uglify-to-browserify-1.0.2.tgz
npm http 200 https://registry.npmjs.org/amdefine/-/amdefine-1.0.0.tgz
npm http 200 https://registry.npmjs.org/yargs
npm http 200 https://registry.npmjs.org/source-map/-/source-map-0.1.34.tgz
npm http 200 https://registry.npmjs.org/uglify-to-browserify/-/uglify-to-browserify-1.0.2.tgz
npm http GET https://registry.npmjs.org/yargs/-/yargs-3.5.4.tgz
npm http 200 https://registry.npmjs.org/yargs/-/yargs-3.5.4.tgz
npm http GET https://registry.npmjs.org/decamelize
npm http GET https://registry.npmjs.org/window-size/0.1.0
npm http GET https://registry.npmjs.org/wordwrap/0.0.2
npm http GET https://registry.npmjs.org/camelcase
npm http 200 https://registry.npmjs.org/decamelize
npm http 200 https://registry.npmjs.org/camelcase
npm http GET https://registry.npmjs.org/decamelize/-/decamelize-1.2.0.tgz
npm http GET https://registry.npmjs.org/camelcase/-/camelcase-1.2.1.tgz
npm http 200 https://registry.npmjs.org/wordwrap/0.0.2
npm http GET https://registry.npmjs.org/wordwrap/-/wordwrap-0.0.2.tgz
npm http 200 https://registry.npmjs.org/camelcase/-/camelcase-1.2.1.tgz
npm http 200 https://registry.npmjs.org/decamelize/-/decamelize-1.2.0.tgz
npm http 200 https://registry.npmjs.org/wordwrap/-/wordwrap-0.0.2.tgz
npm http 200 https://registry.npmjs.org/window-size/0.1.0
npm http GET https://registry.npmjs.org/window-size/-/window-size-0.1.0.tgz
npm http 200 https://registry.npmjs.org/window-size/-/window-size-0.1.0.tgz
npm http GET https://registry.npmjs.org/optimist
npm http 304 https://registry.npmjs.org/optimist
npm http GET https://registry.npmjs.org/wordwrap
npm http 304 https://registry.npmjs.org/wordwrap
npm http GET https://registry.npmjs.org/escope
npm http GET https://registry.npmjs.org/esprima
npm http GET https://registry.npmjs.org/estraverse
npm http GET https://registry.npmjs.org/esprima
npm http GET https://registry.npmjs.org/estraverse
npm http GET https://registry.npmjs.org/esutils
npm http 304 https://registry.npmjs.org/estraverse
npm http GET https://registry.npmjs.org/estraverse/-/estraverse-0.0.4.tgz
npm http 304 https://registry.npmjs.org/esprima
npm http 304 https://registry.npmjs.org/esprima
npm http 304 https://registry.npmjs.org/esutils
npm http GET https://registry.npmjs.org/esprima/-/esprima-1.0.4.tgz
npm http 304 https://registry.npmjs.org/estraverse
npm http 200 https://registry.npmjs.org/escope
npm http GET https://registry.npmjs.org/escope/-/escope-0.0.16.tgz
npm http 200 https://registry.npmjs.org/estraverse/-/estraverse-0.0.4.tgz
npm http 200 https://registry.npmjs.org/esprima/-/esprima-1.0.4.tgz
npm http 200 https://registry.npmjs.org/escope/-/escope-0.0.16.tgz
npm http GET https://registry.npmjs.org/argparse
npm http GET https://registry.npmjs.org/esprima
npm http 304 https://registry.npmjs.org/esprima
npm http GET https://registry.npmjs.org/esprima/-/esprima-2.7.2.tgz
npm http 200 https://registry.npmjs.org/argparse
npm http GET https://registry.npmjs.org/argparse/-/argparse-1.0.7.tgz
npm http 200 https://registry.npmjs.org/esprima/-/esprima-2.7.2.tgz
npm http 200 https://registry.npmjs.org/argparse/-/argparse-1.0.7.tgz
npm http GET https://registry.npmjs.org/sprintf-js
npm http 200 https://registry.npmjs.org/sprintf-js
npm http GET https://registry.npmjs.org/sprintf-js/-/sprintf-js-1.0.3.tgz
npm http 200 https://registry.npmjs.org/sprintf-js/-/sprintf-js-1.0.3.tgz
npm ERR!
npm ERR! Additional logging details can be found in:
npm ERR! /thrift/lib/nodejs/npm-debug.log
npm ERR! not ok code 0
make[2]: *** [deps] Error 1
make[2]: Leaving directory `/thrift/lib/nodejs'
make[1]: *** [check-recursive] Error 1
make[1]: Leaving directory `/thrift/lib'
make: *** [check-recursive] Error 1
Build step 'Execute shell' marked build as failure
[WARNINGS] Skipping publisher since build result is FAILURE
[TASKS] Skipping publisher since build result is FAILURE
Archiving artifacts
Compressed 145.16 MB of artifacts by 98.4% relative to #355
Publishing Javadoc
Jenkins build is back to normal : Thrift-precommit #358
Posted by Apache Jenkins Server <je...@builds.apache.org>.
See <https://builds.apache.org/job/Thrift-precommit/358/>
Build failed in Jenkins: Thrift-precommit #357
Posted by Apache Jenkins Server <je...@builds.apache.org>.
See <https://builds.apache.org/job/Thrift-precommit/357/>
------------------------------------------
GitHub pull request #927 to apache/thrift
GitHub pull request #927 to apache/thrift
[EnvInject] - Loading node environment variables.
Building remotely on ubuntu-6 (docker Ubuntu ubuntu yahoo-not-h2) in workspace <https://builds.apache.org/job/Thrift-precommit/ws/>
> git rev-parse --is-inside-work-tree # timeout=10
Fetching changes from the remote Git repository
> git config remote.origin.url https://github.com/apache/thrift.git # timeout=10
Fetching upstream changes from https://github.com/apache/thrift.git
> git --version # timeout=10
> git -c core.askpass=true fetch --tags --progress https://github.com/apache/thrift.git +refs/heads/*:refs/remotes/origin/*
> git config core.sparsecheckout # timeout=10
> git checkout -f origin/master # timeout=10
> git branch -a # timeout=10
> git rev-parse remotes/origin/0.1.x^{commit} # timeout=10
> git rev-parse remotes/origin/0.2.x^{commit} # timeout=10
> git rev-parse remotes/origin/0.3.x^{commit} # timeout=10
> git rev-parse remotes/origin/0.4.x^{commit} # timeout=10
> git rev-parse remotes/origin/0.5.x^{commit} # timeout=10
> git rev-parse remotes/origin/0.6.x^{commit} # timeout=10
> git rev-parse remotes/origin/0.7.x^{commit} # timeout=10
> git rev-parse remotes/origin/0.8.x^{commit} # timeout=10
> git rev-parse remotes/origin/0.9.1^{commit} # timeout=10
> git rev-parse remotes/origin/0.9.2^{commit} # timeout=10
> git rev-parse remotes/origin/0.9.3^{commit} # timeout=10
> git rev-parse remotes/origin/0.9.x^{commit} # timeout=10
> git rev-parse remotes/origin/master^{commit} # timeout=10
> git rev-parse remotes/origin/py-compiler^{commit} # timeout=10
> git checkout -b master origin/master
FATAL: Could not checkout master with start point origin/master
hudson.plugins.git.GitException: Could not checkout master with start point origin/master
at org.jenkinsci.plugins.gitclient.CliGitAPIImpl$9.execute(CliGitAPIImpl.java:1962)
at org.jenkinsci.plugins.gitclient.AbstractGitAPIImpl.checkoutBranch(AbstractGitAPIImpl.java:82)
at org.jenkinsci.plugins.gitclient.CliGitAPIImpl.checkoutBranch(CliGitAPIImpl.java:62)
at sun.reflect.NativeMethodAccessorImpl.invoke0(Native Method)
at sun.reflect.NativeMethodAccessorImpl.invoke(NativeMethodAccessorImpl.java:57)
at sun.reflect.DelegatingMethodAccessorImpl.invoke(DelegatingMethodAccessorImpl.java:43)
at java.lang.reflect.Method.invoke(Method.java:606)
at hudson.remoting.RemoteInvocationHandler$RPCRequest.perform(RemoteInvocationHandler.java:608)
at hudson.remoting.RemoteInvocationHandler$RPCRequest.call(RemoteInvocationHandler.java:583)
at hudson.remoting.RemoteInvocationHandler$RPCRequest.call(RemoteInvocationHandler.java:542)
at hudson.remoting.UserRequest.perform(UserRequest.java:120)
at hudson.remoting.UserRequest.perform(UserRequest.java:48)
at hudson.remoting.Request$2.run(Request.java:326)
at hudson.remoting.InterceptingExecutorService$1.call(InterceptingExecutorService.java:68)
at java.util.concurrent.FutureTask.run(FutureTask.java:262)
at java.util.concurrent.ThreadPoolExecutor.runWorker(ThreadPoolExecutor.java:1145)
at java.util.concurrent.ThreadPoolExecutor$Worker.run(ThreadPoolExecutor.java:615)
at java.lang.Thread.run(Thread.java:745)
at ......remote call to ubuntu-6(Native Method)
at hudson.remoting.Channel.attachCallSiteStackTrace(Channel.java:1416)
at hudson.remoting.UserResponse.retrieve(UserRequest.java:220)
at hudson.remoting.Channel.call(Channel.java:781)
at hudson.remoting.RemoteInvocationHandler.invoke(RemoteInvocationHandler.java:250)
at com.sun.proxy.$Proxy115.checkoutBranch(Unknown Source)
at org.jenkinsci.plugins.gitclient.RemoteGitImpl.checkoutBranch(RemoteGitImpl.java:327)
at com.cloudbees.jenkins.plugins.git.vmerge.BuildChooserImpl.getCandidateRevisions(BuildChooserImpl.java:78)
at hudson.plugins.git.GitSCM.determineRevisionToBuild(GitSCM.java:951)
at hudson.plugins.git.GitSCM.checkout(GitSCM.java:1054)
at hudson.scm.SCM.checkout(SCM.java:485)
at hudson.model.AbstractProject.checkout(AbstractProject.java:1276)
at hudson.model.AbstractBuild$AbstractBuildExecution.defaultCheckout(AbstractBuild.java:607)
at jenkins.scm.SCMCheckoutStrategy.checkout(SCMCheckoutStrategy.java:86)
at hudson.model.AbstractBuild$AbstractBuildExecution.run(AbstractBuild.java:529)
at hudson.model.Run.execute(Run.java:1738)
at hudson.model.FreeStyleBuild.run(FreeStyleBuild.java:43)
at hudson.model.ResourceController.execute(ResourceController.java:98)
at hudson.model.Executor.run(Executor.java:410)
Caused by: hudson.plugins.git.GitException: Command "git checkout -b master origin/master" returned status code 1:
stdout: lib/c_glib/src/thrift/c_glib/protocol/thrift_compact_protocol.c: needs merge
lib/c_glib/test/testcompactprotocol.c: needs merge
stderr: error: you need to resolve your current index first
at org.jenkinsci.plugins.gitclient.CliGitAPIImpl.launchCommandIn(CliGitAPIImpl.java:1693)
at org.jenkinsci.plugins.gitclient.CliGitAPIImpl.access$500(CliGitAPIImpl.java:62)
at org.jenkinsci.plugins.gitclient.CliGitAPIImpl$9.execute(CliGitAPIImpl.java:1956)
at org.jenkinsci.plugins.gitclient.AbstractGitAPIImpl.checkoutBranch(AbstractGitAPIImpl.java:82)
at org.jenkinsci.plugins.gitclient.CliGitAPIImpl.checkoutBranch(CliGitAPIImpl.java:62)
at sun.reflect.NativeMethodAccessorImpl.invoke0(Native Method)
at sun.reflect.NativeMethodAccessorImpl.invoke(NativeMethodAccessorImpl.java:57)
at sun.reflect.DelegatingMethodAccessorImpl.invoke(DelegatingMethodAccessorImpl.java:43)
at java.lang.reflect.Method.invoke(Method.java:606)
at hudson.remoting.RemoteInvocationHandler$RPCRequest.perform(RemoteInvocationHandler.java:608)
at hudson.remoting.RemoteInvocationHandler$RPCRequest.call(RemoteInvocationHandler.java:583)
at hudson.remoting.RemoteInvocationHandler$RPCRequest.call(RemoteInvocationHandler.java:542)
at hudson.remoting.UserRequest.perform(UserRequest.java:120)
at hudson.remoting.UserRequest.perform(UserRequest.java:48)
at hudson.remoting.Request$2.run(Request.java:326)
at hudson.remoting.InterceptingExecutorService$1.call(InterceptingExecutorService.java:68)
at java.util.concurrent.FutureTask.run(FutureTask.java:262)
at java.util.concurrent.ThreadPoolExecutor.runWorker(ThreadPoolExecutor.java:1145)
at java.util.concurrent.ThreadPoolExecutor$Worker.run(ThreadPoolExecutor.java:615)
at java.lang.Thread.run(Thread.java:745)
[WARNINGS] Skipping publisher since build result is FAILURE
[TASKS] Skipping publisher since build result is FAILURE
Archiving artifacts
Publishing Javadoc
Update relevant JIRA issues is waiting for a checkpoint on Thrift-precommit #356