You are viewing a plain text version of this content. The canonical link for it is here.
Posted to builds@lucene.apache.org by Apache Jenkins Server <je...@builds.apache.org> on 2026/05/10 07:33:15 UTC

[JENKINS] Lucene » Lucene-NightlyTests-main - Build # 2005 - Unstable!

Build: https://ci-builds.apache.org/job/Lucene/job/Lucene-NightlyTests-main/2005/

1 tests failed.
FAILED:  org.apache.lucene.sandbox.search.TestSortedDvMultiRangeQuery.testDuelWithStandardDisjunction

Error Message:
java.lang.AssertionError: expected:<510 hits> but was:<511 hits>

Stack Trace:
java.lang.AssertionError: expected:<510 hits> but was:<511 hits>
	at __randomizedtesting.SeedInfo.seed([BFFF75D56FC538BF:3DFCAC1677560D7B]:0)
	at junit@4.13.2/org.junit.Assert.fail(Assert.java:89)
	at junit@4.13.2/org.junit.Assert.failNotEquals(Assert.java:835)
	at junit@4.13.2/org.junit.Assert.assertEquals(Assert.java:120)
	at junit@4.13.2/org.junit.Assert.assertEquals(Assert.java:146)
	at org.apache.lucene.sandbox.search.TestSortedDvMultiRangeQuery.testDuelWithStandardDisjunction(TestSortedDvMultiRangeQuery.java:154)




Build Log:
[...truncated 729 lines...]
ERROR: 1 test has failed:

  - org.apache.lucene.sandbox.search.TestSortedDvMultiRangeQuery.testDuelWithStandardDisjunction (:lucene:sandbox)
    Test output: /home/jenkins/jenkins-agent/workspace/Lucene/Lucene-NightlyTests-main/checkout/lucene/sandbox/build/test-results/test/outputs/OUTPUT-org.apache.lucene.sandbox.search.TestSortedDvMultiRangeQuery.txt
    Reproduce with: gradlew :lucene:sandbox:test --tests "org.apache.lucene.sandbox.search.TestSortedDvMultiRangeQuery.testDuelWithStandardDisjunction" -Ptests.asserts=true -Ptests.file.encoding=US-ASCII -Ptests.gui=true -Ptests.haltonfailure=false -Ptests.jvmargs= -Ptests.jvms=4 -Ptests.linedocsfile=/home/jenkins/jenkins-agent/workspace/Lucene/Lucene-NightlyTests-main/test-data/enwiki.random.lines.txt -Ptests.multiplier=2 -Ptests.nightly=true -Ptests.seed=BFFF75D56FC538BF -Ptests.vectorsize=default

The slowest tests during this run:
  691.18s TestIDVersionPostingsFormat.testGlobalVersions (:lucene:sandbox)
  594.61s Test2BPostings.test (:lucene:core)
  345.40s TestSimpleTextPostingsFormat.testDocsAndFreqsAndPositionsAndOffsetsAndPayloads (:lucene:codecs)
  330.66s TestStressNRTReplication.test (:lucene:replicator)
  265.34s TestSearcherTaxonomyManager.testDirectory (:lucene:facet)
  219.91s TestSortedDvMultiRangeQuery.testDuelWithStandardDisjunction (:lucene:sandbox)
  190.22s TestSimpleTextPostingsFormat.testLineFileDocs (:lucene:codecs)
  157.93s TestIndexWriterExceptions.testTooManyTokens (:lucene:core)
  155.76s TestSimpleTextPostingsFormat.testDocsAndFreqsAndPositionsAndOffsets (:lucene:codecs)
  153.71s TestSimpleTextPostingsFormat.testDocsAndFreqsAndPositionsAndPayloads (:lucene:codecs)
The slowest suites during this run:
  1042.43s TestSimpleTextPostingsFormat (:lucene:codecs)
  693.60s TestIDVersionPostingsFormat (:lucene:sandbox)
  594.63s Test2BPostings (:lucene:core)
  348.43s TestLucene90DocValuesFormatMergeInstance (:lucene:core)
  331.05s TestStressNRTReplication (:lucene:replicator)
  308.81s TestLucene90DocValuesFormat (:lucene:core)
  291.39s TestSearcherTaxonomyManager (:lucene:facet)
  219.96s TestSortedDvMultiRangeQuery (:lucene:sandbox)
  191.19s TestSimpleTextDocValuesFormat (:lucene:codecs)
  186.61s TestFSTPostingsFormat (:lucene:codecs)

[Incubating] Problems report is available at: file:///home/jenkins/jenkins-agent/workspace/Lucene/Lucene-NightlyTests-main/checkout/build/reports/problems/problems-report.html

BUILD SUCCESSFUL in 1h 31m 45s
294 actionable tasks: 148 executed, 146 up-to-date
Consider enabling configuration cache to speed up this build: https://docs.gradle.org/9.5.0/userguide/configuration_cache_enabling.html
Build step 'Invoke Gradle script' changed build result to SUCCESS
Archiving artifacts
‘**/build*/**/tests-cwd/*.hprof’ doesn’t match anything: ‘**’ exists but not ‘**/build*/**/tests-cwd/*.hprof’
No artifacts found that match the file pattern "**/build*/**/tests-cwd/*.hprof,**/*_pid*.log". Configuration error?
Recording test results
[Checks API] No suitable checks publisher found.
Build step 'Publish JUnit test result report' changed build result to UNSTABLE
Email was triggered for: Unstable (Test Failures)
Sending email for trigger: Unstable (Test Failures)