You are viewing a plain text version of this content. The canonical link for it is here.
Posted to builds@mesos.apache.org by Apache Jenkins Server <je...@builds.apache.org> on 2024/07/02 20:35:17 UTC
Build failed in Jenkins: Mesos » Mesos-Tidybot » -DENABLE_LIBEVENT=OFF -DENABLE_SSL=OFF,ubuntu #257
See <https://ci-builds.apache.org/job/Mesos/job/Mesos-Tidybot/CMAKE_ARGS=-DENABLE_LIBEVENT=OFF%20-DENABLE_SSL=OFF,label_exp=ubuntu/257/display/redirect?page=changes>
Changes:
[Benjamin Mahler] [build] Fix make distcheck for ubuntu 20.04.
------------------------------------------
[...truncated 608.16 KB...]
cd /BUILD/3rdparty/libprocess/src/tests && /usr/bin/c++ -DBUILD_DIR=\"/BUILD/3rdparty/libprocess/src/tests\" -DHAVE_LIBZ -DLIBDIR=\"/usr/local/lib\" -DPKGDATADIR=\"/usr/local/share/mesos\" -DPKGLIBEXECDIR=\"/usr/local/libexec/mesos\" -DVERSION=\"1.12.0\" -D__STDC_FORMAT_MACROS -I/BUILD/3rdparty/libprocess/src/tests -I/tmp/SRC/3rdparty/libprocess/src/tests/.. -I/tmp/SRC/3rdparty/libprocess/src/../include -I/tmp/SRC/3rdparty/stout/include -I/BUILD/3rdparty/boost-1.81.0/src/boost-1.81.0 -I/BUILD/3rdparty/elfio-3.2/src/elfio-3.2 -I/BUILD/3rdparty/picojson-1.3.0/src/picojson-1.3.0 -I/BUILD/3rdparty/rapidjson-1.1.0/src/rapidjson-1.1.0/include -I/usr/include/subversion-1 -I/BUILD/3rdparty/grpc-1.11.1/src/grpc-1.11.1/include -isystem /usr/include/apr-1.0 -isystem /BUILD/3rdparty/glog-0.4.0/src/glog-0.4.0-install/include -isystem /BUILD/3rdparty/libarchive-3.3.2/src/libarchive-3.3.2-build/include -isystem /BUILD/3rdparty/protobuf-3.5.0/src/protobuf-3.5.0/src -isystem /BUILD/3rdparty/http_parser-2.6.2/src/http_parser-2.6.2 -isystem /BUILD/3rdparty/googletest-1.8.0/src/googletest-1.8.0/googlemock/include -isystem /BUILD/3rdparty/googletest-1.8.0/src/googletest-1.8.0/googletest/include -O3 -DNDEBUG -fPIE -Wall -Wsign-compare -Wformat-security -fstack-protector-strong -Wno-unused-local-typedefs -std=c++11 -o CMakeFiles/libprocess-tests.dir/io_tests.cpp.o -c /tmp/SRC/3rdparty/libprocess/src/tests/io_tests.cpp
[ 88%] Building CXX object 3rdparty/libprocess/src/tests/CMakeFiles/libprocess-tests.dir/limiter_tests.cpp.o
[ 88%] Building CXX object 3rdparty/libprocess/src/tests/CMakeFiles/libprocess-tests.dir/loop_tests.cpp.o
cd /BUILD/3rdparty/libprocess/src/tests && /usr/bin/c++ -DBUILD_DIR=\"/BUILD/3rdparty/libprocess/src/tests\" -DHAVE_LIBZ -DLIBDIR=\"/usr/local/lib\" -DPKGDATADIR=\"/usr/local/share/mesos\" -DPKGLIBEXECDIR=\"/usr/local/libexec/mesos\" -DVERSION=\"1.12.0\" -D__STDC_FORMAT_MACROS -I/BUILD/3rdparty/libprocess/src/tests -I/tmp/SRC/3rdparty/libprocess/src/tests/.. -I/tmp/SRC/3rdparty/libprocess/src/../include -I/tmp/SRC/3rdparty/stout/include -I/BUILD/3rdparty/boost-1.81.0/src/boost-1.81.0 -I/BUILD/3rdparty/elfio-3.2/src/elfio-3.2 -I/BUILD/3rdparty/picojson-1.3.0/src/picojson-1.3.0 -I/BUILD/3rdparty/rapidjson-1.1.0/src/rapidjson-1.1.0/include -I/usr/include/subversion-1 -I/BUILD/3rdparty/grpc-1.11.1/src/grpc-1.11.1/include -isystem /usr/include/apr-1.0 -isystem /BUILD/3rdparty/glog-0.4.0/src/glog-0.4.0-install/include -isystem /BUILD/3rdparty/libarchive-3.3.2/src/libarchive-3.3.2-build/include -isystem /BUILD/3rdparty/protobuf-3.5.0/src/protobuf-3.5.0/src -isystem /BUILD/3rdparty/http_parser-2.6.2/src/http_parser-2.6.2 -isystem /BUILD/3rdparty/googletest-1.8.0/src/googletest-1.8.0/googlemock/include -isystem /BUILD/3rdparty/googletest-1.8.0/src/googletest-1.8.0/googletest/include -O3 -DNDEBUG -fPIE -Wall -Wsign-compare -Wformat-security -fstack-protector-strong -Wno-unused-local-typedefs -std=c++11 -o CMakeFiles/libprocess-tests.dir/limiter_tests.cpp.o -c /tmp/SRC/3rdparty/libprocess/src/tests/limiter_tests.cpp
cd /BUILD/3rdparty/libprocess/src/tests && /usr/bin/c++ -DBUILD_DIR=\"/BUILD/3rdparty/libprocess/src/tests\" -DHAVE_LIBZ -DLIBDIR=\"/usr/local/lib\" -DPKGDATADIR=\"/usr/local/share/mesos\" -DPKGLIBEXECDIR=\"/usr/local/libexec/mesos\" -DVERSION=\"1.12.0\" -D__STDC_FORMAT_MACROS -I/BUILD/3rdparty/libprocess/src/tests -I/tmp/SRC/3rdparty/libprocess/src/tests/.. -I/tmp/SRC/3rdparty/libprocess/src/../include -I/tmp/SRC/3rdparty/stout/include -I/BUILD/3rdparty/boost-1.81.0/src/boost-1.81.0 -I/BUILD/3rdparty/elfio-3.2/src/elfio-3.2 -I/BUILD/3rdparty/picojson-1.3.0/src/picojson-1.3.0 -I/BUILD/3rdparty/rapidjson-1.1.0/src/rapidjson-1.1.0/include -I/usr/include/subversion-1 -I/BUILD/3rdparty/grpc-1.11.1/src/grpc-1.11.1/include -isystem /usr/include/apr-1.0 -isystem /BUILD/3rdparty/glog-0.4.0/src/glog-0.4.0-install/include -isystem /BUILD/3rdparty/libarchive-3.3.2/src/libarchive-3.3.2-build/include -isystem /BUILD/3rdparty/protobuf-3.5.0/src/protobuf-3.5.0/src -isystem /BUILD/3rdparty/http_parser-2.6.2/src/http_parser-2.6.2 -isystem /BUILD/3rdparty/googletest-1.8.0/src/googletest-1.8.0/googlemock/include -isystem /BUILD/3rdparty/googletest-1.8.0/src/googletest-1.8.0/googletest/include -O3 -DNDEBUG -fPIE -Wall -Wsign-compare -Wformat-security -fstack-protector-strong -Wno-unused-local-typedefs -std=c++11 -o CMakeFiles/libprocess-tests.dir/loop_tests.cpp.o -c /tmp/SRC/3rdparty/libprocess/src/tests/loop_tests.cpp
[ 88%] Building CXX object 3rdparty/libprocess/src/tests/CMakeFiles/libprocess-tests.dir/metrics_tests.cpp.o
[ 88%] Building CXX object 3rdparty/libprocess/src/tests/CMakeFiles/libprocess-tests.dir/mpsc_linked_queue_tests.cpp.o
cd /BUILD/3rdparty/libprocess/src/tests && /usr/bin/c++ -DBUILD_DIR=\"/BUILD/3rdparty/libprocess/src/tests\" -DHAVE_LIBZ -DLIBDIR=\"/usr/local/lib\" -DPKGDATADIR=\"/usr/local/share/mesos\" -DPKGLIBEXECDIR=\"/usr/local/libexec/mesos\" -DVERSION=\"1.12.0\" -D__STDC_FORMAT_MACROS -I/BUILD/3rdparty/libprocess/src/tests -I/tmp/SRC/3rdparty/libprocess/src/tests/.. -I/tmp/SRC/3rdparty/libprocess/src/../include -I/tmp/SRC/3rdparty/stout/include -I/BUILD/3rdparty/boost-1.81.0/src/boost-1.81.0 -I/BUILD/3rdparty/elfio-3.2/src/elfio-3.2 -I/BUILD/3rdparty/picojson-1.3.0/src/picojson-1.3.0 -I/BUILD/3rdparty/rapidjson-1.1.0/src/rapidjson-1.1.0/include -I/usr/include/subversion-1 -I/BUILD/3rdparty/grpc-1.11.1/src/grpc-1.11.1/include -isystem /usr/include/apr-1.0 -isystem /BUILD/3rdparty/glog-0.4.0/src/glog-0.4.0-install/include -isystem /BUILD/3rdparty/libarchive-3.3.2/src/libarchive-3.3.2-build/include -isystem /BUILD/3rdparty/protobuf-3.5.0/src/protobuf-3.5.0/src -isystem /BUILD/3rdparty/http_parser-2.6.2/src/http_parser-2.6.2 -isystem /BUILD/3rdparty/googletest-1.8.0/src/googletest-1.8.0/googlemock/include -isystem /BUILD/3rdparty/googletest-1.8.0/src/googletest-1.8.0/googletest/include -O3 -DNDEBUG -fPIE -Wall -Wsign-compare -Wformat-security -fstack-protector-strong -Wno-unused-local-typedefs -std=c++11 -o CMakeFiles/libprocess-tests.dir/metrics_tests.cpp.o -c /tmp/SRC/3rdparty/libprocess/src/tests/metrics_tests.cpp
cd /BUILD/3rdparty/libprocess/src/tests && /usr/bin/c++ -DBUILD_DIR=\"/BUILD/3rdparty/libprocess/src/tests\" -DHAVE_LIBZ -DLIBDIR=\"/usr/local/lib\" -DPKGDATADIR=\"/usr/local/share/mesos\" -DPKGLIBEXECDIR=\"/usr/local/libexec/mesos\" -DVERSION=\"1.12.0\" -D__STDC_FORMAT_MACROS -I/BUILD/3rdparty/libprocess/src/tests -I/tmp/SRC/3rdparty/libprocess/src/tests/.. -I/tmp/SRC/3rdparty/libprocess/src/../include -I/tmp/SRC/3rdparty/stout/include -I/BUILD/3rdparty/boost-1.81.0/src/boost-1.81.0 -I/BUILD/3rdparty/elfio-3.2/src/elfio-3.2 -I/BUILD/3rdparty/picojson-1.3.0/src/picojson-1.3.0 -I/BUILD/3rdparty/rapidjson-1.1.0/src/rapidjson-1.1.0/include -I/usr/include/subversion-1 -I/BUILD/3rdparty/grpc-1.11.1/src/grpc-1.11.1/include -isystem /usr/include/apr-1.0 -isystem /BUILD/3rdparty/glog-0.4.0/src/glog-0.4.0-install/include -isystem /BUILD/3rdparty/libarchive-3.3.2/src/libarchive-3.3.2-build/include -isystem /BUILD/3rdparty/protobuf-3.5.0/src/protobuf-3.5.0/src -isystem /BUILD/3rdparty/http_parser-2.6.2/src/http_parser-2.6.2 -isystem /BUILD/3rdparty/googletest-1.8.0/src/googletest-1.8.0/googlemock/include -isystem /BUILD/3rdparty/googletest-1.8.0/src/googletest-1.8.0/googletest/include -O3 -DNDEBUG -fPIE -Wall -Wsign-compare -Wformat-security -fstack-protector-strong -Wno-unused-local-typedefs -std=c++11 -o CMakeFiles/libprocess-tests.dir/mpsc_linked_queue_tests.cpp.o -c /tmp/SRC/3rdparty/libprocess/src/tests/mpsc_linked_queue_tests.cpp
[ 88%] Building CXX object 3rdparty/libprocess/src/tests/CMakeFiles/libprocess-tests.dir/mutex_tests.cpp.o
cd /BUILD/3rdparty/libprocess/src/tests && /usr/bin/c++ -DBUILD_DIR=\"/BUILD/3rdparty/libprocess/src/tests\" -DHAVE_LIBZ -DLIBDIR=\"/usr/local/lib\" -DPKGDATADIR=\"/usr/local/share/mesos\" -DPKGLIBEXECDIR=\"/usr/local/libexec/mesos\" -DVERSION=\"1.12.0\" -D__STDC_FORMAT_MACROS -I/BUILD/3rdparty/libprocess/src/tests -I/tmp/SRC/3rdparty/libprocess/src/tests/.. -I/tmp/SRC/3rdparty/libprocess/src/../include -I/tmp/SRC/3rdparty/stout/include -I/BUILD/3rdparty/boost-1.81.0/src/boost-1.81.0 -I/BUILD/3rdparty/elfio-3.2/src/elfio-3.2 -I/BUILD/3rdparty/picojson-1.3.0/src/picojson-1.3.0 -I/BUILD/3rdparty/rapidjson-1.1.0/src/rapidjson-1.1.0/include -I/usr/include/subversion-1 -I/BUILD/3rdparty/grpc-1.11.1/src/grpc-1.11.1/include -isystem /usr/include/apr-1.0 -isystem /BUILD/3rdparty/glog-0.4.0/src/glog-0.4.0-install/include -isystem /BUILD/3rdparty/libarchive-3.3.2/src/libarchive-3.3.2-build/include -isystem /BUILD/3rdparty/protobuf-3.5.0/src/protobuf-3.5.0/src -isystem /BUILD/3rdparty/http_parser-2.6.2/src/http_parser-2.6.2 -isystem /BUILD/3rdparty/googletest-1.8.0/src/googletest-1.8.0/googlemock/include -isystem /BUILD/3rdparty/googletest-1.8.0/src/googletest-1.8.0/googletest/include -O3 -DNDEBUG -fPIE -Wall -Wsign-compare -Wformat-security -fstack-protector-strong -Wno-unused-local-typedefs -std=c++11 -o CMakeFiles/libprocess-tests.dir/mutex_tests.cpp.o -c /tmp/SRC/3rdparty/libprocess/src/tests/mutex_tests.cpp
[ 88%] Building CXX object 3rdparty/libprocess/src/tests/CMakeFiles/libprocess-tests.dir/process_tests.cpp.o
[ 88%] Building CXX object 3rdparty/libprocess/src/tests/CMakeFiles/libprocess-tests.dir/owned_tests.cpp.o
cd /BUILD/3rdparty/libprocess/src/tests && /usr/bin/c++ -DBUILD_DIR=\"/BUILD/3rdparty/libprocess/src/tests\" -DHAVE_LIBZ -DLIBDIR=\"/usr/local/lib\" -DPKGDATADIR=\"/usr/local/share/mesos\" -DPKGLIBEXECDIR=\"/usr/local/libexec/mesos\" -DVERSION=\"1.12.0\" -D__STDC_FORMAT_MACROS -I/BUILD/3rdparty/libprocess/src/tests -I/tmp/SRC/3rdparty/libprocess/src/tests/.. -I/tmp/SRC/3rdparty/libprocess/src/../include -I/tmp/SRC/3rdparty/stout/include -I/BUILD/3rdparty/boost-1.81.0/src/boost-1.81.0 -I/BUILD/3rdparty/elfio-3.2/src/elfio-3.2 -I/BUILD/3rdparty/picojson-1.3.0/src/picojson-1.3.0 -I/BUILD/3rdparty/rapidjson-1.1.0/src/rapidjson-1.1.0/include -I/usr/include/subversion-1 -I/BUILD/3rdparty/grpc-1.11.1/src/grpc-1.11.1/include -isystem /usr/include/apr-1.0 -isystem /BUILD/3rdparty/glog-0.4.0/src/glog-0.4.0-install/include -isystem /BUILD/3rdparty/libarchive-3.3.2/src/libarchive-3.3.2-build/include -isystem /BUILD/3rdparty/protobuf-3.5.0/src/protobuf-3.5.0/src -isystem /BUILD/3rdparty/http_parser-2.6.2/src/http_parser-2.6.2 -isystem /BUILD/3rdparty/googletest-1.8.0/src/googletest-1.8.0/googlemock/include -isystem /BUILD/3rdparty/googletest-1.8.0/src/googletest-1.8.0/googletest/include -O3 -DNDEBUG -fPIE -Wall -Wsign-compare -Wformat-security -fstack-protector-strong -Wno-unused-local-typedefs -std=c++11 -o CMakeFiles/libprocess-tests.dir/process_tests.cpp.o -c /tmp/SRC/3rdparty/libprocess/src/tests/process_tests.cpp
cd /BUILD/3rdparty/libprocess/src/tests && /usr/bin/c++ -DBUILD_DIR=\"/BUILD/3rdparty/libprocess/src/tests\" -DHAVE_LIBZ -DLIBDIR=\"/usr/local/lib\" -DPKGDATADIR=\"/usr/local/share/mesos\" -DPKGLIBEXECDIR=\"/usr/local/libexec/mesos\" -DVERSION=\"1.12.0\" -D__STDC_FORMAT_MACROS -I/BUILD/3rdparty/libprocess/src/tests -I/tmp/SRC/3rdparty/libprocess/src/tests/.. -I/tmp/SRC/3rdparty/libprocess/src/../include -I/tmp/SRC/3rdparty/stout/include -I/BUILD/3rdparty/boost-1.81.0/src/boost-1.81.0 -I/BUILD/3rdparty/elfio-3.2/src/elfio-3.2 -I/BUILD/3rdparty/picojson-1.3.0/src/picojson-1.3.0 -I/BUILD/3rdparty/rapidjson-1.1.0/src/rapidjson-1.1.0/include -I/usr/include/subversion-1 -I/BUILD/3rdparty/grpc-1.11.1/src/grpc-1.11.1/include -isystem /usr/include/apr-1.0 -isystem /BUILD/3rdparty/glog-0.4.0/src/glog-0.4.0-install/include -isystem /BUILD/3rdparty/libarchive-3.3.2/src/libarchive-3.3.2-build/include -isystem /BUILD/3rdparty/protobuf-3.5.0/src/protobuf-3.5.0/src -isystem /BUILD/3rdparty/http_parser-2.6.2/src/http_parser-2.6.2 -isystem /BUILD/3rdparty/googletest-1.8.0/src/googletest-1.8.0/googlemock/include -isystem /BUILD/3rdparty/googletest-1.8.0/src/googletest-1.8.0/googletest/include -O3 -DNDEBUG -fPIE -Wall -Wsign-compare -Wformat-security -fstack-protector-strong -Wno-unused-local-typedefs -std=c++11 -o CMakeFiles/libprocess-tests.dir/owned_tests.cpp.o -c /tmp/SRC/3rdparty/libprocess/src/tests/owned_tests.cpp
[ 94%] Building CXX object 3rdparty/libprocess/src/tests/CMakeFiles/libprocess-tests.dir/profiler_tests.cpp.o
[ 94%] Building CXX object 3rdparty/libprocess/src/tests/CMakeFiles/libprocess-tests.dir/queue_tests.cpp.o
cd /BUILD/3rdparty/libprocess/src/tests && /usr/bin/c++ -DBUILD_DIR=\"/BUILD/3rdparty/libprocess/src/tests\" -DHAVE_LIBZ -DLIBDIR=\"/usr/local/lib\" -DPKGDATADIR=\"/usr/local/share/mesos\" -DPKGLIBEXECDIR=\"/usr/local/libexec/mesos\" -DVERSION=\"1.12.0\" -D__STDC_FORMAT_MACROS -I/BUILD/3rdparty/libprocess/src/tests -I/tmp/SRC/3rdparty/libprocess/src/tests/.. -I/tmp/SRC/3rdparty/libprocess/src/../include -I/tmp/SRC/3rdparty/stout/include -I/BUILD/3rdparty/boost-1.81.0/src/boost-1.81.0 -I/BUILD/3rdparty/elfio-3.2/src/elfio-3.2 -I/BUILD/3rdparty/picojson-1.3.0/src/picojson-1.3.0 -I/BUILD/3rdparty/rapidjson-1.1.0/src/rapidjson-1.1.0/include -I/usr/include/subversion-1 -I/BUILD/3rdparty/grpc-1.11.1/src/grpc-1.11.1/include -isystem /usr/include/apr-1.0 -isystem /BUILD/3rdparty/glog-0.4.0/src/glog-0.4.0-install/include -isystem /BUILD/3rdparty/libarchive-3.3.2/src/libarchive-3.3.2-build/include -isystem /BUILD/3rdparty/protobuf-3.5.0/src/protobuf-3.5.0/src -isystem /BUILD/3rdparty/http_parser-2.6.2/src/http_parser-2.6.2 -isystem /BUILD/3rdparty/googletest-1.8.0/src/googletest-1.8.0/googlemock/include -isystem /BUILD/3rdparty/googletest-1.8.0/src/googletest-1.8.0/googletest/include -O3 -DNDEBUG -fPIE -Wall -Wsign-compare -Wformat-security -fstack-protector-strong -Wno-unused-local-typedefs -std=c++11 -o CMakeFiles/libprocess-tests.dir/profiler_tests.cpp.o -c /tmp/SRC/3rdparty/libprocess/src/tests/profiler_tests.cpp
cd /BUILD/3rdparty/libprocess/src/tests && /usr/bin/c++ -DBUILD_DIR=\"/BUILD/3rdparty/libprocess/src/tests\" -DHAVE_LIBZ -DLIBDIR=\"/usr/local/lib\" -DPKGDATADIR=\"/usr/local/share/mesos\" -DPKGLIBEXECDIR=\"/usr/local/libexec/mesos\" -DVERSION=\"1.12.0\" -D__STDC_FORMAT_MACROS -I/BUILD/3rdparty/libprocess/src/tests -I/tmp/SRC/3rdparty/libprocess/src/tests/.. -I/tmp/SRC/3rdparty/libprocess/src/../include -I/tmp/SRC/3rdparty/stout/include -I/BUILD/3rdparty/boost-1.81.0/src/boost-1.81.0 -I/BUILD/3rdparty/elfio-3.2/src/elfio-3.2 -I/BUILD/3rdparty/picojson-1.3.0/src/picojson-1.3.0 -I/BUILD/3rdparty/rapidjson-1.1.0/src/rapidjson-1.1.0/include -I/usr/include/subversion-1 -I/BUILD/3rdparty/grpc-1.11.1/src/grpc-1.11.1/include -isystem /usr/include/apr-1.0 -isystem /BUILD/3rdparty/glog-0.4.0/src/glog-0.4.0-install/include -isystem /BUILD/3rdparty/libarchive-3.3.2/src/libarchive-3.3.2-build/include -isystem /BUILD/3rdparty/protobuf-3.5.0/src/protobuf-3.5.0/src -isystem /BUILD/3rdparty/http_parser-2.6.2/src/http_parser-2.6.2 -isystem /BUILD/3rdparty/googletest-1.8.0/src/googletest-1.8.0/googlemock/include -isystem /BUILD/3rdparty/googletest-1.8.0/src/googletest-1.8.0/googletest/include -O3 -DNDEBUG -fPIE -Wall -Wsign-compare -Wformat-security -fstack-protector-strong -Wno-unused-local-typedefs -std=c++11 -o CMakeFiles/libprocess-tests.dir/queue_tests.cpp.o -c /tmp/SRC/3rdparty/libprocess/src/tests/queue_tests.cpp
[ 94%] Building CXX object 3rdparty/libprocess/src/tests/CMakeFiles/libprocess-tests.dir/rwlock_tests.cpp.o
cd /BUILD/3rdparty/libprocess/src/tests && /usr/bin/c++ -DBUILD_DIR=\"/BUILD/3rdparty/libprocess/src/tests\" -DHAVE_LIBZ -DLIBDIR=\"/usr/local/lib\" -DPKGDATADIR=\"/usr/local/share/mesos\" -DPKGLIBEXECDIR=\"/usr/local/libexec/mesos\" -DVERSION=\"1.12.0\" -D__STDC_FORMAT_MACROS -I/BUILD/3rdparty/libprocess/src/tests -I/tmp/SRC/3rdparty/libprocess/src/tests/.. -I/tmp/SRC/3rdparty/libprocess/src/../include -I/tmp/SRC/3rdparty/stout/include -I/BUILD/3rdparty/boost-1.81.0/src/boost-1.81.0 -I/BUILD/3rdparty/elfio-3.2/src/elfio-3.2 -I/BUILD/3rdparty/picojson-1.3.0/src/picojson-1.3.0 -I/BUILD/3rdparty/rapidjson-1.1.0/src/rapidjson-1.1.0/include -I/usr/include/subversion-1 -I/BUILD/3rdparty/grpc-1.11.1/src/grpc-1.11.1/include -isystem /usr/include/apr-1.0 -isystem /BUILD/3rdparty/glog-0.4.0/src/glog-0.4.0-install/include -isystem /BUILD/3rdparty/libarchive-3.3.2/src/libarchive-3.3.2-build/include -isystem /BUILD/3rdparty/protobuf-3.5.0/src/protobuf-3.5.0/src -isystem /BUILD/3rdparty/http_parser-2.6.2/src/http_parser-2.6.2 -isystem /BUILD/3rdparty/googletest-1.8.0/src/googletest-1.8.0/googlemock/include -isystem /BUILD/3rdparty/googletest-1.8.0/src/googletest-1.8.0/googletest/include -O3 -DNDEBUG -fPIE -Wall -Wsign-compare -Wformat-security -fstack-protector-strong -Wno-unused-local-typedefs -std=c++11 -o CMakeFiles/libprocess-tests.dir/rwlock_tests.cpp.o -c /tmp/SRC/3rdparty/libprocess/src/tests/rwlock_tests.cpp
[ 94%] Building CXX object 3rdparty/libprocess/src/tests/CMakeFiles/libprocess-tests.dir/sequence_tests.cpp.o
cd /BUILD/3rdparty/libprocess/src/tests && /usr/bin/c++ -DBUILD_DIR=\"/BUILD/3rdparty/libprocess/src/tests\" -DHAVE_LIBZ -DLIBDIR=\"/usr/local/lib\" -DPKGDATADIR=\"/usr/local/share/mesos\" -DPKGLIBEXECDIR=\"/usr/local/libexec/mesos\" -DVERSION=\"1.12.0\" -D__STDC_FORMAT_MACROS -I/BUILD/3rdparty/libprocess/src/tests -I/tmp/SRC/3rdparty/libprocess/src/tests/.. -I/tmp/SRC/3rdparty/libprocess/src/../include -I/tmp/SRC/3rdparty/stout/include -I/BUILD/3rdparty/boost-1.81.0/src/boost-1.81.0 -I/BUILD/3rdparty/elfio-3.2/src/elfio-3.2 -I/BUILD/3rdparty/picojson-1.3.0/src/picojson-1.3.0 -I/BUILD/3rdparty/rapidjson-1.1.0/src/rapidjson-1.1.0/include -I/usr/include/subversion-1 -I/BUILD/3rdparty/grpc-1.11.1/src/grpc-1.11.1/include -isystem /usr/include/apr-1.0 -isystem /BUILD/3rdparty/glog-0.4.0/src/glog-0.4.0-install/include -isystem /BUILD/3rdparty/libarchive-3.3.2/src/libarchive-3.3.2-build/include -isystem /BUILD/3rdparty/protobuf-3.5.0/src/protobuf-3.5.0/src -isystem /BUILD/3rdparty/http_parser-2.6.2/src/http_parser-2.6.2 -isystem /BUILD/3rdparty/googletest-1.8.0/src/googletest-1.8.0/googlemock/include -isystem /BUILD/3rdparty/googletest-1.8.0/src/googletest-1.8.0/googletest/include -O3 -DNDEBUG -fPIE -Wall -Wsign-compare -Wformat-security -fstack-protector-strong -Wno-unused-local-typedefs -std=c++11 -o CMakeFiles/libprocess-tests.dir/sequence_tests.cpp.o -c /tmp/SRC/3rdparty/libprocess/src/tests/sequence_tests.cpp
[ 94%] Building CXX object 3rdparty/libprocess/src/tests/CMakeFiles/libprocess-tests.dir/shared_tests.cpp.o
cd /BUILD/3rdparty/libprocess/src/tests && /usr/bin/c++ -DBUILD_DIR=\"/BUILD/3rdparty/libprocess/src/tests\" -DHAVE_LIBZ -DLIBDIR=\"/usr/local/lib\" -DPKGDATADIR=\"/usr/local/share/mesos\" -DPKGLIBEXECDIR=\"/usr/local/libexec/mesos\" -DVERSION=\"1.12.0\" -D__STDC_FORMAT_MACROS -I/BUILD/3rdparty/libprocess/src/tests -I/tmp/SRC/3rdparty/libprocess/src/tests/.. -I/tmp/SRC/3rdparty/libprocess/src/../include -I/tmp/SRC/3rdparty/stout/include -I/BUILD/3rdparty/boost-1.81.0/src/boost-1.81.0 -I/BUILD/3rdparty/elfio-3.2/src/elfio-3.2 -I/BUILD/3rdparty/picojson-1.3.0/src/picojson-1.3.0 -I/BUILD/3rdparty/rapidjson-1.1.0/src/rapidjson-1.1.0/include -I/usr/include/subversion-1 -I/BUILD/3rdparty/grpc-1.11.1/src/grpc-1.11.1/include -isystem /usr/include/apr-1.0 -isystem /BUILD/3rdparty/glog-0.4.0/src/glog-0.4.0-install/include -isystem /BUILD/3rdparty/libarchive-3.3.2/src/libarchive-3.3.2-build/include -isystem /BUILD/3rdparty/protobuf-3.5.0/src/protobuf-3.5.0/src -isystem /BUILD/3rdparty/http_parser-2.6.2/src/http_parser-2.6.2 -isystem /BUILD/3rdparty/googletest-1.8.0/src/googletest-1.8.0/googlemock/include -isystem /BUILD/3rdparty/googletest-1.8.0/src/googletest-1.8.0/googletest/include -O3 -DNDEBUG -fPIE -Wall -Wsign-compare -Wformat-security -fstack-protector-strong -Wno-unused-local-typedefs -std=c++11 -o CMakeFiles/libprocess-tests.dir/shared_tests.cpp.o -c /tmp/SRC/3rdparty/libprocess/src/tests/shared_tests.cpp
[ 94%] Building CXX object 3rdparty/libprocess/src/tests/CMakeFiles/libprocess-tests.dir/socket_tests.cpp.o
cd /BUILD/3rdparty/libprocess/src/tests && /usr/bin/c++ -DBUILD_DIR=\"/BUILD/3rdparty/libprocess/src/tests\" -DHAVE_LIBZ -DLIBDIR=\"/usr/local/lib\" -DPKGDATADIR=\"/usr/local/share/mesos\" -DPKGLIBEXECDIR=\"/usr/local/libexec/mesos\" -DVERSION=\"1.12.0\" -D__STDC_FORMAT_MACROS -I/BUILD/3rdparty/libprocess/src/tests -I/tmp/SRC/3rdparty/libprocess/src/tests/.. -I/tmp/SRC/3rdparty/libprocess/src/../include -I/tmp/SRC/3rdparty/stout/include -I/BUILD/3rdparty/boost-1.81.0/src/boost-1.81.0 -I/BUILD/3rdparty/elfio-3.2/src/elfio-3.2 -I/BUILD/3rdparty/picojson-1.3.0/src/picojson-1.3.0 -I/BUILD/3rdparty/rapidjson-1.1.0/src/rapidjson-1.1.0/include -I/usr/include/subversion-1 -I/BUILD/3rdparty/grpc-1.11.1/src/grpc-1.11.1/include -isystem /usr/include/apr-1.0 -isystem /BUILD/3rdparty/glog-0.4.0/src/glog-0.4.0-install/include -isystem /BUILD/3rdparty/libarchive-3.3.2/src/libarchive-3.3.2-build/include -isystem /BUILD/3rdparty/protobuf-3.5.0/src/protobuf-3.5.0/src -isystem /BUILD/3rdparty/http_parser-2.6.2/src/http_parser-2.6.2 -isystem /BUILD/3rdparty/googletest-1.8.0/src/googletest-1.8.0/googlemock/include -isystem /BUILD/3rdparty/googletest-1.8.0/src/googletest-1.8.0/googletest/include -O3 -DNDEBUG -fPIE -Wall -Wsign-compare -Wformat-security -fstack-protector-strong -Wno-unused-local-typedefs -std=c++11 -o CMakeFiles/libprocess-tests.dir/socket_tests.cpp.o -c /tmp/SRC/3rdparty/libprocess/src/tests/socket_tests.cpp
[ 94%] Building CXX object 3rdparty/libprocess/src/tests/CMakeFiles/libprocess-tests.dir/state_machine_tests.cpp.o
cd /BUILD/3rdparty/libprocess/src/tests && /usr/bin/c++ -DBUILD_DIR=\"/BUILD/3rdparty/libprocess/src/tests\" -DHAVE_LIBZ -DLIBDIR=\"/usr/local/lib\" -DPKGDATADIR=\"/usr/local/share/mesos\" -DPKGLIBEXECDIR=\"/usr/local/libexec/mesos\" -DVERSION=\"1.12.0\" -D__STDC_FORMAT_MACROS -I/BUILD/3rdparty/libprocess/src/tests -I/tmp/SRC/3rdparty/libprocess/src/tests/.. -I/tmp/SRC/3rdparty/libprocess/src/../include -I/tmp/SRC/3rdparty/stout/include -I/BUILD/3rdparty/boost-1.81.0/src/boost-1.81.0 -I/BUILD/3rdparty/elfio-3.2/src/elfio-3.2 -I/BUILD/3rdparty/picojson-1.3.0/src/picojson-1.3.0 -I/BUILD/3rdparty/rapidjson-1.1.0/src/rapidjson-1.1.0/include -I/usr/include/subversion-1 -I/BUILD/3rdparty/grpc-1.11.1/src/grpc-1.11.1/include -isystem /usr/include/apr-1.0 -isystem /BUILD/3rdparty/glog-0.4.0/src/glog-0.4.0-install/include -isystem /BUILD/3rdparty/libarchive-3.3.2/src/libarchive-3.3.2-build/include -isystem /BUILD/3rdparty/protobuf-3.5.0/src/protobuf-3.5.0/src -isystem /BUILD/3rdparty/http_parser-2.6.2/src/http_parser-2.6.2 -isystem /BUILD/3rdparty/googletest-1.8.0/src/googletest-1.8.0/googlemock/include -isystem /BUILD/3rdparty/googletest-1.8.0/src/googletest-1.8.0/googletest/include -O3 -DNDEBUG -fPIE -Wall -Wsign-compare -Wformat-security -fstack-protector-strong -Wno-unused-local-typedefs -std=c++11 -o CMakeFiles/libprocess-tests.dir/state_machine_tests.cpp.o -c /tmp/SRC/3rdparty/libprocess/src/tests/state_machine_tests.cpp
[ 94%] Building CXX object 3rdparty/libprocess/src/tests/CMakeFiles/libprocess-tests.dir/statistics_tests.cpp.o
cd /BUILD/3rdparty/libprocess/src/tests && /usr/bin/c++ -DBUILD_DIR=\"/BUILD/3rdparty/libprocess/src/tests\" -DHAVE_LIBZ -DLIBDIR=\"/usr/local/lib\" -DPKGDATADIR=\"/usr/local/share/mesos\" -DPKGLIBEXECDIR=\"/usr/local/libexec/mesos\" -DVERSION=\"1.12.0\" -D__STDC_FORMAT_MACROS -I/BUILD/3rdparty/libprocess/src/tests -I/tmp/SRC/3rdparty/libprocess/src/tests/.. -I/tmp/SRC/3rdparty/libprocess/src/../include -I/tmp/SRC/3rdparty/stout/include -I/BUILD/3rdparty/boost-1.81.0/src/boost-1.81.0 -I/BUILD/3rdparty/elfio-3.2/src/elfio-3.2 -I/BUILD/3rdparty/picojson-1.3.0/src/picojson-1.3.0 -I/BUILD/3rdparty/rapidjson-1.1.0/src/rapidjson-1.1.0/include -I/usr/include/subversion-1 -I/BUILD/3rdparty/grpc-1.11.1/src/grpc-1.11.1/include -isystem /usr/include/apr-1.0 -isystem /BUILD/3rdparty/glog-0.4.0/src/glog-0.4.0-install/include -isystem /BUILD/3rdparty/libarchive-3.3.2/src/libarchive-3.3.2-build/include -isystem /BUILD/3rdparty/protobuf-3.5.0/src/protobuf-3.5.0/src -isystem /BUILD/3rdparty/http_parser-2.6.2/src/http_parser-2.6.2 -isystem /BUILD/3rdparty/googletest-1.8.0/src/googletest-1.8.0/googlemock/include -isystem /BUILD/3rdparty/googletest-1.8.0/src/googletest-1.8.0/googletest/include -O3 -DNDEBUG -fPIE -Wall -Wsign-compare -Wformat-security -fstack-protector-strong -Wno-unused-local-typedefs -std=c++11 -o CMakeFiles/libprocess-tests.dir/statistics_tests.cpp.o -c /tmp/SRC/3rdparty/libprocess/src/tests/statistics_tests.cpp
[ 94%] Building CXX object 3rdparty/libprocess/src/tests/CMakeFiles/libprocess-tests.dir/subprocess_tests.cpp.o
cd /BUILD/3rdparty/libprocess/src/tests && /usr/bin/c++ -DBUILD_DIR=\"/BUILD/3rdparty/libprocess/src/tests\" -DHAVE_LIBZ -DLIBDIR=\"/usr/local/lib\" -DPKGDATADIR=\"/usr/local/share/mesos\" -DPKGLIBEXECDIR=\"/usr/local/libexec/mesos\" -DVERSION=\"1.12.0\" -D__STDC_FORMAT_MACROS -I/BUILD/3rdparty/libprocess/src/tests -I/tmp/SRC/3rdparty/libprocess/src/tests/.. -I/tmp/SRC/3rdparty/libprocess/src/../include -I/tmp/SRC/3rdparty/stout/include -I/BUILD/3rdparty/boost-1.81.0/src/boost-1.81.0 -I/BUILD/3rdparty/elfio-3.2/src/elfio-3.2 -I/BUILD/3rdparty/picojson-1.3.0/src/picojson-1.3.0 -I/BUILD/3rdparty/rapidjson-1.1.0/src/rapidjson-1.1.0/include -I/usr/include/subversion-1 -I/BUILD/3rdparty/grpc-1.11.1/src/grpc-1.11.1/include -isystem /usr/include/apr-1.0 -isystem /BUILD/3rdparty/glog-0.4.0/src/glog-0.4.0-install/include -isystem /BUILD/3rdparty/libarchive-3.3.2/src/libarchive-3.3.2-build/include -isystem /BUILD/3rdparty/protobuf-3.5.0/src/protobuf-3.5.0/src -isystem /BUILD/3rdparty/http_parser-2.6.2/src/http_parser-2.6.2 -isystem /BUILD/3rdparty/googletest-1.8.0/src/googletest-1.8.0/googlemock/include -isystem /BUILD/3rdparty/googletest-1.8.0/src/googletest-1.8.0/googletest/include -O3 -DNDEBUG -fPIE -Wall -Wsign-compare -Wformat-security -fstack-protector-strong -Wno-unused-local-typedefs -std=c++11 -o CMakeFiles/libprocess-tests.dir/subprocess_tests.cpp.o -c /tmp/SRC/3rdparty/libprocess/src/tests/subprocess_tests.cpp
[100%] Building CXX object 3rdparty/libprocess/src/tests/CMakeFiles/libprocess-tests.dir/system_tests.cpp.o
cd /BUILD/3rdparty/libprocess/src/tests && /usr/bin/c++ -DBUILD_DIR=\"/BUILD/3rdparty/libprocess/src/tests\" -DHAVE_LIBZ -DLIBDIR=\"/usr/local/lib\" -DPKGDATADIR=\"/usr/local/share/mesos\" -DPKGLIBEXECDIR=\"/usr/local/libexec/mesos\" -DVERSION=\"1.12.0\" -D__STDC_FORMAT_MACROS -I/BUILD/3rdparty/libprocess/src/tests -I/tmp/SRC/3rdparty/libprocess/src/tests/.. -I/tmp/SRC/3rdparty/libprocess/src/../include -I/tmp/SRC/3rdparty/stout/include -I/BUILD/3rdparty/boost-1.81.0/src/boost-1.81.0 -I/BUILD/3rdparty/elfio-3.2/src/elfio-3.2 -I/BUILD/3rdparty/picojson-1.3.0/src/picojson-1.3.0 -I/BUILD/3rdparty/rapidjson-1.1.0/src/rapidjson-1.1.0/include -I/usr/include/subversion-1 -I/BUILD/3rdparty/grpc-1.11.1/src/grpc-1.11.1/include -isystem /usr/include/apr-1.0 -isystem /BUILD/3rdparty/glog-0.4.0/src/glog-0.4.0-install/include -isystem /BUILD/3rdparty/libarchive-3.3.2/src/libarchive-3.3.2-build/include -isystem /BUILD/3rdparty/protobuf-3.5.0/src/protobuf-3.5.0/src -isystem /BUILD/3rdparty/http_parser-2.6.2/src/http_parser-2.6.2 -isystem /BUILD/3rdparty/googletest-1.8.0/src/googletest-1.8.0/googlemock/include -isystem /BUILD/3rdparty/googletest-1.8.0/src/googletest-1.8.0/googletest/include -O3 -DNDEBUG -fPIE -Wall -Wsign-compare -Wformat-security -fstack-protector-strong -Wno-unused-local-typedefs -std=c++11 -o CMakeFiles/libprocess-tests.dir/system_tests.cpp.o -c /tmp/SRC/3rdparty/libprocess/src/tests/system_tests.cpp
[100%] Building CXX object 3rdparty/libprocess/src/tests/CMakeFiles/libprocess-tests.dir/time_tests.cpp.o
[100%] Building CXX object 3rdparty/libprocess/src/tests/CMakeFiles/libprocess-tests.dir/timeseries_tests.cpp.o
cd /BUILD/3rdparty/libprocess/src/tests && /usr/bin/c++ -DBUILD_DIR=\"/BUILD/3rdparty/libprocess/src/tests\" -DHAVE_LIBZ -DLIBDIR=\"/usr/local/lib\" -DPKGDATADIR=\"/usr/local/share/mesos\" -DPKGLIBEXECDIR=\"/usr/local/libexec/mesos\" -DVERSION=\"1.12.0\" -D__STDC_FORMAT_MACROS -I/BUILD/3rdparty/libprocess/src/tests -I/tmp/SRC/3rdparty/libprocess/src/tests/.. -I/tmp/SRC/3rdparty/libprocess/src/../include -I/tmp/SRC/3rdparty/stout/include -I/BUILD/3rdparty/boost-1.81.0/src/boost-1.81.0 -I/BUILD/3rdparty/elfio-3.2/src/elfio-3.2 -I/BUILD/3rdparty/picojson-1.3.0/src/picojson-1.3.0 -I/BUILD/3rdparty/rapidjson-1.1.0/src/rapidjson-1.1.0/include -I/usr/include/subversion-1 -I/BUILD/3rdparty/grpc-1.11.1/src/grpc-1.11.1/include -isystem /usr/include/apr-1.0 -isystem /BUILD/3rdparty/glog-0.4.0/src/glog-0.4.0-install/include -isystem /BUILD/3rdparty/libarchive-3.3.2/src/libarchive-3.3.2-build/include -isystem /BUILD/3rdparty/protobuf-3.5.0/src/protobuf-3.5.0/src -isystem /BUILD/3rdparty/http_parser-2.6.2/src/http_parser-2.6.2 -isystem /BUILD/3rdparty/googletest-1.8.0/src/googletest-1.8.0/googlemock/include -isystem /BUILD/3rdparty/googletest-1.8.0/src/googletest-1.8.0/googletest/include -O3 -DNDEBUG -fPIE -Wall -Wsign-compare -Wformat-security -fstack-protector-strong -Wno-unused-local-typedefs -std=c++11 -o CMakeFiles/libprocess-tests.dir/time_tests.cpp.o -c /tmp/SRC/3rdparty/libprocess/src/tests/time_tests.cpp
cd /BUILD/3rdparty/libprocess/src/tests && /usr/bin/c++ -DBUILD_DIR=\"/BUILD/3rdparty/libprocess/src/tests\" -DHAVE_LIBZ -DLIBDIR=\"/usr/local/lib\" -DPKGDATADIR=\"/usr/local/share/mesos\" -DPKGLIBEXECDIR=\"/usr/local/libexec/mesos\" -DVERSION=\"1.12.0\" -D__STDC_FORMAT_MACROS -I/BUILD/3rdparty/libprocess/src/tests -I/tmp/SRC/3rdparty/libprocess/src/tests/.. -I/tmp/SRC/3rdparty/libprocess/src/../include -I/tmp/SRC/3rdparty/stout/include -I/BUILD/3rdparty/boost-1.81.0/src/boost-1.81.0 -I/BUILD/3rdparty/elfio-3.2/src/elfio-3.2 -I/BUILD/3rdparty/picojson-1.3.0/src/picojson-1.3.0 -I/BUILD/3rdparty/rapidjson-1.1.0/src/rapidjson-1.1.0/include -I/usr/include/subversion-1 -I/BUILD/3rdparty/grpc-1.11.1/src/grpc-1.11.1/include -isystem /usr/include/apr-1.0 -isystem /BUILD/3rdparty/glog-0.4.0/src/glog-0.4.0-install/include -isystem /BUILD/3rdparty/libarchive-3.3.2/src/libarchive-3.3.2-build/include -isystem /BUILD/3rdparty/protobuf-3.5.0/src/protobuf-3.5.0/src -isystem /BUILD/3rdparty/http_parser-2.6.2/src/http_parser-2.6.2 -isystem /BUILD/3rdparty/googletest-1.8.0/src/googletest-1.8.0/googlemock/include -isystem /BUILD/3rdparty/googletest-1.8.0/src/googletest-1.8.0/googletest/include -O3 -DNDEBUG -fPIE -Wall -Wsign-compare -Wformat-security -fstack-protector-strong -Wno-unused-local-typedefs -std=c++11 -o CMakeFiles/libprocess-tests.dir/timeseries_tests.cpp.o -c /tmp/SRC/3rdparty/libprocess/src/tests/timeseries_tests.cpp
[100%] Building CXX object 3rdparty/libprocess/src/tests/CMakeFiles/libprocess-tests.dir/reap_tests.cpp.o
cd /BUILD/3rdparty/libprocess/src/tests && /usr/bin/c++ -DBUILD_DIR=\"/BUILD/3rdparty/libprocess/src/tests\" -DHAVE_LIBZ -DLIBDIR=\"/usr/local/lib\" -DPKGDATADIR=\"/usr/local/share/mesos\" -DPKGLIBEXECDIR=\"/usr/local/libexec/mesos\" -DVERSION=\"1.12.0\" -D__STDC_FORMAT_MACROS -I/BUILD/3rdparty/libprocess/src/tests -I/tmp/SRC/3rdparty/libprocess/src/tests/.. -I/tmp/SRC/3rdparty/libprocess/src/../include -I/tmp/SRC/3rdparty/stout/include -I/BUILD/3rdparty/boost-1.81.0/src/boost-1.81.0 -I/BUILD/3rdparty/elfio-3.2/src/elfio-3.2 -I/BUILD/3rdparty/picojson-1.3.0/src/picojson-1.3.0 -I/BUILD/3rdparty/rapidjson-1.1.0/src/rapidjson-1.1.0/include -I/usr/include/subversion-1 -I/BUILD/3rdparty/grpc-1.11.1/src/grpc-1.11.1/include -isystem /usr/include/apr-1.0 -isystem /BUILD/3rdparty/glog-0.4.0/src/glog-0.4.0-install/include -isystem /BUILD/3rdparty/libarchive-3.3.2/src/libarchive-3.3.2-build/include -isystem /BUILD/3rdparty/protobuf-3.5.0/src/protobuf-3.5.0/src -isystem /BUILD/3rdparty/http_parser-2.6.2/src/http_parser-2.6.2 -isystem /BUILD/3rdparty/googletest-1.8.0/src/googletest-1.8.0/googlemock/include -isystem /BUILD/3rdparty/googletest-1.8.0/src/googletest-1.8.0/googletest/include -O3 -DNDEBUG -fPIE -Wall -Wsign-compare -Wformat-security -fstack-protector-strong -Wno-unused-local-typedefs -std=c++11 -o CMakeFiles/libprocess-tests.dir/reap_tests.cpp.o -c /tmp/SRC/3rdparty/libprocess/src/tests/reap_tests.cpp
[100%] Building CXX object 3rdparty/libprocess/src/tests/CMakeFiles/libprocess-tests.dir/grpc_tests.grpc.pb.cc.o
cd /BUILD/3rdparty/libprocess/src/tests && /usr/bin/c++ -DBUILD_DIR=\"/BUILD/3rdparty/libprocess/src/tests\" -DHAVE_LIBZ -DLIBDIR=\"/usr/local/lib\" -DPKGDATADIR=\"/usr/local/share/mesos\" -DPKGLIBEXECDIR=\"/usr/local/libexec/mesos\" -DVERSION=\"1.12.0\" -D__STDC_FORMAT_MACROS -I/BUILD/3rdparty/libprocess/src/tests -I/tmp/SRC/3rdparty/libprocess/src/tests/.. -I/tmp/SRC/3rdparty/libprocess/src/../include -I/tmp/SRC/3rdparty/stout/include -I/BUILD/3rdparty/boost-1.81.0/src/boost-1.81.0 -I/BUILD/3rdparty/elfio-3.2/src/elfio-3.2 -I/BUILD/3rdparty/picojson-1.3.0/src/picojson-1.3.0 -I/BUILD/3rdparty/rapidjson-1.1.0/src/rapidjson-1.1.0/include -I/usr/include/subversion-1 -I/BUILD/3rdparty/grpc-1.11.1/src/grpc-1.11.1/include -isystem /usr/include/apr-1.0 -isystem /BUILD/3rdparty/glog-0.4.0/src/glog-0.4.0-install/include -isystem /BUILD/3rdparty/libarchive-3.3.2/src/libarchive-3.3.2-build/include -isystem /BUILD/3rdparty/protobuf-3.5.0/src/protobuf-3.5.0/src -isystem /BUILD/3rdparty/http_parser-2.6.2/src/http_parser-2.6.2 -isystem /BUILD/3rdparty/googletest-1.8.0/src/googletest-1.8.0/googlemock/include -isystem /BUILD/3rdparty/googletest-1.8.0/src/googletest-1.8.0/googletest/include -O3 -DNDEBUG -fPIE -Wall -Wsign-compare -Wformat-security -fstack-protector-strong -Wno-unused-local-typedefs -std=c++11 -o CMakeFiles/libprocess-tests.dir/grpc_tests.grpc.pb.cc.o -c /BUILD/3rdparty/libprocess/src/tests/grpc_tests.grpc.pb.cc
[100%] Building CXX object 3rdparty/libprocess/src/tests/CMakeFiles/libprocess-tests.dir/grpc_tests.pb.cc.o
cd /BUILD/3rdparty/libprocess/src/tests && /usr/bin/c++ -DBUILD_DIR=\"/BUILD/3rdparty/libprocess/src/tests\" -DHAVE_LIBZ -DLIBDIR=\"/usr/local/lib\" -DPKGDATADIR=\"/usr/local/share/mesos\" -DPKGLIBEXECDIR=\"/usr/local/libexec/mesos\" -DVERSION=\"1.12.0\" -D__STDC_FORMAT_MACROS -I/BUILD/3rdparty/libprocess/src/tests -I/tmp/SRC/3rdparty/libprocess/src/tests/.. -I/tmp/SRC/3rdparty/libprocess/src/../include -I/tmp/SRC/3rdparty/stout/include -I/BUILD/3rdparty/boost-1.81.0/src/boost-1.81.0 -I/BUILD/3rdparty/elfio-3.2/src/elfio-3.2 -I/BUILD/3rdparty/picojson-1.3.0/src/picojson-1.3.0 -I/BUILD/3rdparty/rapidjson-1.1.0/src/rapidjson-1.1.0/include -I/usr/include/subversion-1 -I/BUILD/3rdparty/grpc-1.11.1/src/grpc-1.11.1/include -isystem /usr/include/apr-1.0 -isystem /BUILD/3rdparty/glog-0.4.0/src/glog-0.4.0-install/include -isystem /BUILD/3rdparty/libarchive-3.3.2/src/libarchive-3.3.2-build/include -isystem /BUILD/3rdparty/protobuf-3.5.0/src/protobuf-3.5.0/src -isystem /BUILD/3rdparty/http_parser-2.6.2/src/http_parser-2.6.2 -isystem /BUILD/3rdparty/googletest-1.8.0/src/googletest-1.8.0/googlemock/include -isystem /BUILD/3rdparty/googletest-1.8.0/src/googletest-1.8.0/googletest/include -O3 -DNDEBUG -fPIE -Wall -Wsign-compare -Wformat-security -fstack-protector-strong -Wno-unused-local-typedefs -std=c++11 -o CMakeFiles/libprocess-tests.dir/grpc_tests.pb.cc.o -c /BUILD/3rdparty/libprocess/src/tests/grpc_tests.pb.cc
[100%] Linking CXX executable libprocess-tests
cd /BUILD/3rdparty/libprocess/src/tests && /usr/local/bin/cmake -E cmake_link_script CMakeFiles/libprocess-tests.dir/link.txt --verbose=1
/usr/bin/c++ -O3 -DNDEBUG CMakeFiles/libprocess-tests.dir/main.cpp.o CMakeFiles/libprocess-tests.dir/after_tests.cpp.o CMakeFiles/libprocess-tests.dir/collect_tests.cpp.o CMakeFiles/libprocess-tests.dir/count_down_latch_tests.cpp.o CMakeFiles/libprocess-tests.dir/decoder_tests.cpp.o CMakeFiles/libprocess-tests.dir/encoder_tests.cpp.o CMakeFiles/libprocess-tests.dir/future_tests.cpp.o CMakeFiles/libprocess-tests.dir/grpc_tests.cpp.o CMakeFiles/libprocess-tests.dir/http_tests.cpp.o CMakeFiles/libprocess-tests.dir/io_tests.cpp.o CMakeFiles/libprocess-tests.dir/limiter_tests.cpp.o CMakeFiles/libprocess-tests.dir/loop_tests.cpp.o CMakeFiles/libprocess-tests.dir/metrics_tests.cpp.o CMakeFiles/libprocess-tests.dir/mpsc_linked_queue_tests.cpp.o CMakeFiles/libprocess-tests.dir/mutex_tests.cpp.o CMakeFiles/libprocess-tests.dir/owned_tests.cpp.o CMakeFiles/libprocess-tests.dir/process_tests.cpp.o CMakeFiles/libprocess-tests.dir/profiler_tests.cpp.o CMakeFiles/libprocess-tests.dir/queue_tests.cpp.o CMakeFiles/libprocess-tests.dir/rwlock_tests.cpp.o CMakeFiles/libprocess-tests.dir/sequence_tests.cpp.o CMakeFiles/libprocess-tests.dir/shared_tests.cpp.o CMakeFiles/libprocess-tests.dir/socket_tests.cpp.o CMakeFiles/libprocess-tests.dir/state_machine_tests.cpp.o CMakeFiles/libprocess-tests.dir/statistics_tests.cpp.o CMakeFiles/libprocess-tests.dir/subprocess_tests.cpp.o CMakeFiles/libprocess-tests.dir/system_tests.cpp.o CMakeFiles/libprocess-tests.dir/time_tests.cpp.o CMakeFiles/libprocess-tests.dir/timeseries_tests.cpp.o CMakeFiles/libprocess-tests.dir/reap_tests.cpp.o CMakeFiles/libprocess-tests.dir/grpc_tests.grpc.pb.cc.o CMakeFiles/libprocess-tests.dir/grpc_tests.pb.cc.o -o libprocess-tests -Wl,-rpath,/BUILD/3rdparty/libprocess/src:/BUILD/3rdparty/glog-0.4.0/src/glog-0.4.0-install/lib:/BUILD/3rdparty/protobuf-3.5.0/src/protobuf-3.5.0-build:/BUILD/3rdparty/grpc-1.11.1/src/grpc-1.11.1-build:/BUILD/3rdparty/libev-4.22/src/libev-4.22-build/lib ../libprocess.so /usr/lib/x86_64-linux-gnu/libapr-1.so ../../../glog-0.4.0/src/glog-0.4.0-install/lib/libglog.so ../../../libarchive-3.3.2/src/libarchive-3.3.2-build/lib/libarchive.a /usr/lib/x86_64-linux-gnu/libcurl.so ../../../protobuf-3.5.0/src/protobuf-3.5.0-build/libprotobuf.so -lpthread /usr/lib/x86_64-linux-gnu/libz.so -lrt -ldl /usr/lib/x86_64-linux-gnu/libsvn_delta-1.so /usr/lib/x86_64-linux-gnu/libsvn_diff-1.so /usr/lib/x86_64-linux-gnu/libsvn_subr-1.so ../../../http_parser-2.6.2/src/http_parser-2.6.2-build/libhttp_parser.a ../../../grpc-1.11.1/src/grpc-1.11.1-build/libgrpc++_unsecure.so ../../../grpc-1.11.1/src/grpc-1.11.1-build/libgrpc_unsecure.so ../../../grpc-1.11.1/src/grpc-1.11.1-build/libgpr.so ../../../googletest-1.8.0/src/googletest-1.8.0-build/googlemock/libgmock.a ../../../googletest-1.8.0/src/googletest-1.8.0-build/googlemock/gtest/libgtest.a -Wl,-rpath-link,/BUILD/3rdparty/libev-4.22/src/libev-4.22-build/lib
make[3]: Leaving directory '/BUILD'
[100%] Built target libprocess-tests
make[2]: Leaving directory '/BUILD'
/usr/local/bin/cmake -E cmake_progress_start /BUILD/CMakeFiles 0
make[1]: Leaving directory '/BUILD'
cd /BUILD && /usr/bin/make -f CMakeFiles/Makefile2 3rdparty/libprocess/src/tests/CMakeFiles/benchmarks.dir/rule
make[1]: Entering directory '/BUILD'
/usr/local/bin/cmake -S/tmp/SRC -B/BUILD --check-build-system CMakeFiles/Makefile.cmake 0
/usr/local/bin/cmake -E cmake_progress_start /BUILD/CMakeFiles 13
/usr/bin/make -f CMakeFiles/Makefile2 3rdparty/libprocess/src/tests/CMakeFiles/benchmarks.dir/all
make[2]: Entering directory '/BUILD'
/usr/bin/make -f 3rdparty/CMakeFiles/picojson-1.3.0.dir/build.make 3rdparty/CMakeFiles/picojson-1.3.0.dir/depend
/usr/bin/make -f 3rdparty/CMakeFiles/protobuf-3.5.0.dir/build.make 3rdparty/CMakeFiles/protobuf-3.5.0.dir/depend
/usr/bin/make -f 3rdparty/CMakeFiles/elfio-3.2.dir/build.make 3rdparty/CMakeFiles/elfio-3.2.dir/depend
/usr/bin/make -f 3rdparty/CMakeFiles/rapidjson-1.1.0.dir/build.make 3rdparty/CMakeFiles/rapidjson-1.1.0.dir/depend
/usr/bin/make -f 3rdparty/CMakeFiles/concurrentqueue-7b69a8f.dir/build.make 3rdparty/CMakeFiles/concurrentqueue-7b69a8f.dir/depend
/usr/bin/make -f 3rdparty/CMakeFiles/glog-0.4.0.dir/build.make 3rdparty/CMakeFiles/glog-0.4.0.dir/depend
make[3]: Entering directory '/BUILD'
cd /BUILD && /usr/local/bin/cmake -E cmake_depends "Unix Makefiles" /tmp/SRC /tmp/SRC/3rdparty /BUILD /BUILD/3rdparty /BUILD/3rdparty/CMakeFiles/picojson-1.3.0.dir/DependInfo.cmake --color=
/usr/bin/make -f 3rdparty/CMakeFiles/boost-1.81.0.dir/build.make 3rdparty/CMakeFiles/boost-1.81.0.dir/depend
/usr/bin/make -f 3rdparty/CMakeFiles/http_parser-2.6.2.dir/build.make 3rdparty/CMakeFiles/http_parser-2.6.2.dir/depend
/usr/bin/make -f 3rdparty/CMakeFiles/libarchive-3.3.2.dir/build.make 3rdparty/CMakeFiles/libarchive-3.3.2.dir/depend
/usr/bin/make -f 3rdparty/CMakeFiles/libev-4.22.dir/build.make 3rdparty/CMakeFiles/libev-4.22.dir/depend
make[3]: Entering directory '/BUILD'
cd /BUILD && /usr/local/bin/cmake -E cmake_depends "Unix Makefiles" /tmp/SRC /tmp/SRC/3rdparty /BUILD /BUILD/3rdparty /BUILD/3rdparty/CMakeFiles/rapidjson-1.1.0.dir/DependInfo.cmake --color=
/usr/bin/make -f 3rdparty/CMakeFiles/googletest-1.8.0.dir/build.make 3rdparty/CMakeFiles/googletest-1.8.0.dir/depend
make[3]: Entering directory '/BUILD'
cd /BUILD && /usr/local/bin/cmake -E cmake_depends "Unix Makefiles" /tmp/SRC /tmp/SRC/3rdparty /BUILD /BUILD/3rdparty /BUILD/3rdparty/CMakeFiles/glog-0.4.0.dir/DependInfo.cmake --color=
make[3]: Entering directory '/BUILD'
cd /BUILD && /usr/local/bin/cmake -E cmake_depends "Unix Makefiles" /tmp/SRC /tmp/SRC/3rdparty /BUILD /BUILD/3rdparty /BUILD/3rdparty/CMakeFiles/boost-1.81.0.dir/DependInfo.cmake --color=
make[3]: Entering directory '/BUILD'
cd /BUILD && /usr/local/bin/cmake -E cmake_depends "Unix Makefiles" /tmp/SRC /tmp/SRC/3rdparty /BUILD /BUILD/3rdparty /BUILD/3rdparty/CMakeFiles/protobuf-3.5.0.dir/DependInfo.cmake --color=
make[3]: Entering directory '/BUILD'
cd /BUILD && /usr/local/bin/cmake -E cmake_depends "Unix Makefiles" /tmp/SRC /tmp/SRC/3rdparty /BUILD /BUILD/3rdparty /BUILD/3rdparty/CMakeFiles/concurrentqueue-7b69a8f.dir/DependInfo.cmake --color=
make[3]: Entering directory '/BUILD'
cd /BUILD && /usr/local/bin/cmake -E cmake_depends "Unix Makefiles" /tmp/SRC /tmp/SRC/3rdparty /BUILD /BUILD/3rdparty /BUILD/3rdparty/CMakeFiles/http_parser-2.6.2.dir/DependInfo.cmake --color=
make[3]: Entering directory '/BUILD'
cd /BUILD && /usr/local/bin/cmake -E cmake_depends "Unix Makefiles" /tmp/SRC /tmp/SRC/3rdparty /BUILD /BUILD/3rdparty /BUILD/3rdparty/CMakeFiles/elfio-3.2.dir/DependInfo.cmake --color=
make[3]: Entering directory '/BUILD'
cd /BUILD && /usr/local/bin/cmake -E cmake_depends "Unix Makefiles" /tmp/SRC /tmp/SRC/3rdparty /BUILD /BUILD/3rdparty /BUILD/3rdparty/CMakeFiles/libarchive-3.3.2.dir/DependInfo.cmake --color=
make[3]: Entering directory '/BUILD'
cd /BUILD && /usr/local/bin/cmake -E cmake_depends "Unix Makefiles" /tmp/SRC /tmp/SRC/3rdparty /BUILD /BUILD/3rdparty /BUILD/3rdparty/CMakeFiles/googletest-1.8.0.dir/DependInfo.cmake --color=
make[3]: Entering directory '/BUILD'
cd /BUILD && /usr/local/bin/cmake -E cmake_depends "Unix Makefiles" /tmp/SRC /tmp/SRC/3rdparty /BUILD /BUILD/3rdparty /BUILD/3rdparty/CMakeFiles/libev-4.22.dir/DependInfo.cmake --color=
make[3]: Leaving directory '/BUILD'
make[3]: Leaving directory '/BUILD'
/usr/bin/make -f 3rdparty/CMakeFiles/picojson-1.3.0.dir/build.make 3rdparty/CMakeFiles/picojson-1.3.0.dir/build
/usr/bin/make -f 3rdparty/CMakeFiles/rapidjson-1.1.0.dir/build.make 3rdparty/CMakeFiles/rapidjson-1.1.0.dir/build
make[3]: Leaving directory '/BUILD'
make[3]: Leaving directory '/BUILD'
/usr/bin/make -f 3rdparty/CMakeFiles/glog-0.4.0.dir/build.make 3rdparty/CMakeFiles/glog-0.4.0.dir/build
make[3]: Leaving directory '/BUILD'
make[3]: Leaving directory '/BUILD'
/usr/bin/make -f 3rdparty/CMakeFiles/protobuf-3.5.0.dir/build.make 3rdparty/CMakeFiles/protobuf-3.5.0.dir/build
/usr/bin/make -f 3rdparty/CMakeFiles/concurrentqueue-7b69a8f.dir/build.make 3rdparty/CMakeFiles/concurrentqueue-7b69a8f.dir/build
/usr/bin/make -f 3rdparty/CMakeFiles/libarchive-3.3.2.dir/build.make 3rdparty/CMakeFiles/libarchive-3.3.2.dir/build
make[3]: Entering directory '/BUILD'
make[3]: Nothing to be done for '3rdparty/CMakeFiles/rapidjson-1.1.0.dir/build'.
make[3]: Leaving directory '/BUILD'
make[3]: Leaving directory '/BUILD'
make[3]: Entering directory '/BUILD'
make[3]: Nothing to be done for '3rdparty/CMakeFiles/picojson-1.3.0.dir/build'.
make[3]: Leaving directory '/BUILD'
make[3]: Leaving directory '/BUILD'
make[3]: Leaving directory '/BUILD'
/usr/bin/make -f 3rdparty/CMakeFiles/googletest-1.8.0.dir/build.make 3rdparty/CMakeFiles/googletest-1.8.0.dir/build
make[3]: Leaving directory '/BUILD'
/usr/bin/make -f 3rdparty/CMakeFiles/boost-1.81.0.dir/build.make 3rdparty/CMakeFiles/boost-1.81.0.dir/build
/usr/bin/make -f 3rdparty/CMakeFiles/http_parser-2.6.2.dir/build.make 3rdparty/CMakeFiles/http_parser-2.6.2.dir/build
make[3]: Leaving directory '/BUILD'
/usr/bin/make -f 3rdparty/CMakeFiles/libev-4.22.dir/build.make 3rdparty/CMakeFiles/libev-4.22.dir/build
/usr/bin/make -f 3rdparty/CMakeFiles/elfio-3.2.dir/build.make 3rdparty/CMakeFiles/elfio-3.2.dir/build
make[3]: Entering directory '/BUILD'
make[3]: Nothing to be done for '3rdparty/CMakeFiles/glog-0.4.0.dir/build'.
make[3]: Leaving directory '/BUILD'
make[3]: Entering directory '/BUILD'
make[3]: Nothing to be done for '3rdparty/CMakeFiles/protobuf-3.5.0.dir/build'.
make[3]: Leaving directory '/BUILD'
make[3]: Entering directory '/BUILD'
make[3]: Nothing to be done for '3rdparty/CMakeFiles/concurrentqueue-7b69a8f.dir/build'.
make[3]: Leaving directory '/BUILD'
make[3]: Entering directory '/BUILD'
make[3]: Nothing to be done for '3rdparty/CMakeFiles/libarchive-3.3.2.dir/build'.
make[3]: Leaving directory '/BUILD'
make[3]: Entering directory '/BUILD'
make[3]: Nothing to be done for '3rdparty/CMakeFiles/googletest-1.8.0.dir/build'.
make[3]: Leaving directory '/BUILD'
make[3]: Entering directory '/BUILD'
make[3]: Nothing to be done for '3rdparty/CMakeFiles/boost-1.81.0.dir/build'.
make[3]: Leaving directory '/BUILD'
make[3]: Entering directory '/BUILD'
make[3]: Nothing to be done for '3rdparty/CMakeFiles/http_parser-2.6.2.dir/build'.
make[3]: Entering directory '/BUILD'
make[3]: Nothing to be done for '3rdparty/CMakeFiles/libev-4.22.dir/build'.
make[3]: Leaving directory '/BUILD'
make[3]: Leaving directory '/BUILD'
make[3]: Entering directory '/BUILD'
make[3]: Nothing to be done for '3rdparty/CMakeFiles/elfio-3.2.dir/build'.
make[3]: Leaving directory '/BUILD'
[ 15%] Built target picojson-1.3.0
[ 15%] Built target glog-0.4.0
[ 30%] Built target protobuf-3.5.0
[ 30%] Built target rapidjson-1.1.0
/usr/bin/make -f 3rdparty/CMakeFiles/grpc-1.11.1.dir/build.make 3rdparty/CMakeFiles/grpc-1.11.1.dir/depend
[ 53%] Built target libarchive-3.3.2
[ 53%] Built target concurrentqueue-7b69a8f
[ 53%] Built target googletest-1.8.0
[ 69%] Built target libev-4.22
[ 69%] Built target http_parser-2.6.2
[ 69%] Built target boost-1.81.0
[ 69%] Built target elfio-3.2
make[3]: Entering directory '/BUILD'
cd /BUILD && /usr/local/bin/cmake -E cmake_depends "Unix Makefiles" /tmp/SRC /tmp/SRC/3rdparty /BUILD /BUILD/3rdparty /BUILD/3rdparty/CMakeFiles/grpc-1.11.1.dir/DependInfo.cmake --color=
make[3]: Leaving directory '/BUILD'
/usr/bin/make -f 3rdparty/CMakeFiles/grpc-1.11.1.dir/build.make 3rdparty/CMakeFiles/grpc-1.11.1.dir/build
make[3]: Entering directory '/BUILD'
make[3]: Nothing to be done for '3rdparty/CMakeFiles/grpc-1.11.1.dir/build'.
make[3]: Leaving directory '/BUILD'
[ 76%] Built target grpc-1.11.1
/usr/bin/make -f 3rdparty/libprocess/src/CMakeFiles/process.dir/build.make 3rdparty/libprocess/src/CMakeFiles/process.dir/depend
make[3]: Entering directory '/BUILD'
cd /BUILD && /usr/local/bin/cmake -E cmake_depends "Unix Makefiles" /tmp/SRC /tmp/SRC/3rdparty/libprocess/src /BUILD /BUILD/3rdparty/libprocess/src /BUILD/3rdparty/libprocess/src/CMakeFiles/process.dir/DependInfo.cmake --color=
make[3]: Leaving directory '/BUILD'
/usr/bin/make -f 3rdparty/libprocess/src/CMakeFiles/process.dir/build.make 3rdparty/libprocess/src/CMakeFiles/process.dir/build
make[3]: Entering directory '/BUILD'
make[3]: Nothing to be done for '3rdparty/libprocess/src/CMakeFiles/process.dir/build'.
make[3]: Leaving directory '/BUILD'
[100%] Built target process
/usr/bin/make -f 3rdparty/libprocess/src/tests/CMakeFiles/benchmarks.dir/build.make 3rdparty/libprocess/src/tests/CMakeFiles/benchmarks.dir/depend
make[3]: Entering directory '/BUILD'
cd /BUILD && /usr/local/bin/cmake -E cmake_depends "Unix Makefiles" /tmp/SRC /tmp/SRC/3rdparty/libprocess/src/tests /BUILD /BUILD/3rdparty/libprocess/src/tests /BUILD/3rdparty/libprocess/src/tests/CMakeFiles/benchmarks.dir/DependInfo.cmake --color=
make[3]: Leaving directory '/BUILD'
/usr/bin/make -f 3rdparty/libprocess/src/tests/CMakeFiles/benchmarks.dir/build.make 3rdparty/libprocess/src/tests/CMakeFiles/benchmarks.dir/build
make[3]: Entering directory '/BUILD'
make[3]: Nothing to be done for '3rdparty/libprocess/src/tests/CMakeFiles/benchmarks.dir/build'.
make[3]: Leaving directory '/BUILD'
[100%] Built target benchmarks
make[2]: Leaving directory '/BUILD'
/usr/local/bin/cmake -E cmake_progress_start /BUILD/CMakeFiles 0
make[1]: Leaving directory '/BUILD'
FATAL: command execution failed
java.io.EOFException
at java.base/java.io.ObjectInputStream$PeekInputStream.readFully(ObjectInputStream.java:2911)
at java.base/java.io.ObjectInputStream$BlockDataInputStream.readShort(ObjectInputStream.java:3406)
at java.base/java.io.ObjectInputStream.readStreamHeader(ObjectInputStream.java:932)
at java.base/java.io.ObjectInputStream.<init>(ObjectInputStream.java:375)
at hudson.remoting.ObjectInputStreamEx.<init>(ObjectInputStreamEx.java:49)
at hudson.remoting.Command.readFrom(Command.java:142)
at hudson.remoting.Command.readFrom(Command.java:128)
at hudson.remoting.AbstractSynchronousByteArrayCommandTransport.read(AbstractSynchronousByteArrayCommandTransport.java:35)
at hudson.remoting.SynchronousCommandTransport$ReaderThread.run(SynchronousCommandTransport.java:61)
Caused: java.io.IOException: Unexpected termination of the channel
at hudson.remoting.SynchronousCommandTransport$ReaderThread.run(SynchronousCommandTransport.java:75)
Caused: hudson.remoting.ChannelClosedException: Channel "hudson.remoting.Channel@12bb56c4:builds58": Remote call on builds58 failed. The channel is closing down or has closed down
at hudson.remoting.Channel.call(Channel.java:996)
at hudson.remoting.RemoteInvocationHandler.invoke(RemoteInvocationHandler.java:285)
at com.sun.proxy.$Proxy251.isAlive(Unknown Source)
at hudson.Launcher$RemoteLauncher$ProcImpl.isAlive(Launcher.java:1212)
at hudson.Launcher$RemoteLauncher$ProcImpl.join(Launcher.java:1204)
at hudson.tasks.CommandInterpreter.join(CommandInterpreter.java:195)
at hudson.tasks.CommandInterpreter.perform(CommandInterpreter.java:145)
at hudson.tasks.CommandInterpreter.perform(CommandInterpreter.java:92)
at hudson.tasks.BuildStepMonitor$1.perform(BuildStepMonitor.java:20)
at hudson.model.AbstractBuild$AbstractBuildExecution.perform(AbstractBuild.java:818)
at hudson.model.Build$BuildExecution.build(Build.java:199)
at hudson.model.Build$BuildExecution.doRun(Build.java:164)
at hudson.model.AbstractBuild$AbstractBuildExecution.run(AbstractBuild.java:526)
at hudson.model.Run.execute(Run.java:1841)
at hudson.matrix.MatrixRun.run(MatrixRun.java:153)
at hudson.model.ResourceController.execute(ResourceController.java:101)
at hudson.model.Executor.run(Executor.java:442)
FATAL: Unable to delete script file /tmp/jenkins3015877948348697054.sh
java.io.EOFException
at java.base/java.io.ObjectInputStream$PeekInputStream.readFully(ObjectInputStream.java:2911)
at java.base/java.io.ObjectInputStream$BlockDataInputStream.readShort(ObjectInputStream.java:3406)
at java.base/java.io.ObjectInputStream.readStreamHeader(ObjectInputStream.java:932)
at java.base/java.io.ObjectInputStream.<init>(ObjectInputStream.java:375)
at hudson.remoting.ObjectInputStreamEx.<init>(ObjectInputStreamEx.java:49)
at hudson.remoting.Command.readFrom(Command.java:142)
at hudson.remoting.Command.readFrom(Command.java:128)
at hudson.remoting.AbstractSynchronousByteArrayCommandTransport.read(AbstractSynchronousByteArrayCommandTransport.java:35)
at hudson.remoting.SynchronousCommandTransport$ReaderThread.run(SynchronousCommandTransport.java:61)
Caused: java.io.IOException: Unexpected termination of the channel
at hudson.remoting.SynchronousCommandTransport$ReaderThread.run(SynchronousCommandTransport.java:75)
Caused: hudson.remoting.ChannelClosedException: Channel "hudson.remoting.Channel@12bb56c4:builds58": Remote call on builds58 failed. The channel is closing down or has closed down
at hudson.remoting.Channel.call(Channel.java:996)
at hudson.FilePath.act(FilePath.java:1230)
at hudson.FilePath.act(FilePath.java:1219)
at hudson.FilePath.delete(FilePath.java:1766)
at hudson.tasks.CommandInterpreter.perform(CommandInterpreter.java:163)
at hudson.tasks.CommandInterpreter.perform(CommandInterpreter.java:92)
at hudson.tasks.BuildStepMonitor$1.perform(BuildStepMonitor.java:20)
at hudson.model.AbstractBuild$AbstractBuildExecution.perform(AbstractBuild.java:818)
at hudson.model.Build$BuildExecution.build(Build.java:199)
at hudson.model.Build$BuildExecution.doRun(Build.java:164)
at hudson.model.AbstractBuild$AbstractBuildExecution.run(AbstractBuild.java:526)
at hudson.model.Run.execute(Run.java:1841)
at hudson.matrix.MatrixRun.run(MatrixRun.java:153)
at hudson.model.ResourceController.execute(ResourceController.java:101)
at hudson.model.Executor.run(Executor.java:442)
Build step 'Execute shell' marked build as failure
Build failed in Jenkins: Mesos » Mesos-Tidybot » -DENABLE_LIBEVENT=OFF -DENABLE_SSL=OFF,ubuntu #258
Posted by Apache Jenkins Server <je...@builds.apache.org>.
See <https://ci-builds.apache.org/job/Mesos/job/Mesos-Tidybot/CMAKE_ARGS=-DENABLE_LIBEVENT=OFF%20-DENABLE_SSL=OFF,label_exp=ubuntu/258/display/redirect?page=changes>
Changes:
[Benjamin Mahler] [build] Use ubuntu:20.04 for verify-reviews.py.
------------------------------------------
[...truncated 586.61 KB...]
cd /BUILD/3rdparty/libprocess/src/tests && /usr/bin/c++ -DHAVE_LIBZ -DLIBDIR=\"/usr/local/lib\" -DPKGDATADIR=\"/usr/local/share/mesos\" -DPKGLIBEXECDIR=\"/usr/local/libexec/mesos\" -DVERSION=\"1.12.0\" -D__STDC_FORMAT_MACROS -I/BUILD/3rdparty/libprocess/src/tests -I/tmp/SRC/3rdparty/libprocess/src/tests/.. -I/tmp/SRC/3rdparty/libprocess/src/../include -I/tmp/SRC/3rdparty/stout/include -I/BUILD/3rdparty/boost-1.81.0/src/boost-1.81.0 -I/BUILD/3rdparty/elfio-3.2/src/elfio-3.2 -I/BUILD/3rdparty/picojson-1.3.0/src/picojson-1.3.0 -I/BUILD/3rdparty/rapidjson-1.1.0/src/rapidjson-1.1.0/include -I/usr/include/subversion-1 -I/BUILD/3rdparty/grpc-1.11.1/src/grpc-1.11.1/include -isystem /usr/include/apr-1.0 -isystem /BUILD/3rdparty/glog-0.4.0/src/glog-0.4.0-install/include -isystem /BUILD/3rdparty/libarchive-3.3.2/src/libarchive-3.3.2-build/include -isystem /BUILD/3rdparty/protobuf-3.5.0/src/protobuf-3.5.0/src -isystem /BUILD/3rdparty/http_parser-2.6.2/src/http_parser-2.6.2 -isystem /BUILD/3rdparty/googletest-1.8.0/src/googletest-1.8.0/googlemock/include -isystem /BUILD/3rdparty/googletest-1.8.0/src/googletest-1.8.0/googletest/include -O3 -DNDEBUG -fPIE -Wall -Wsign-compare -Wformat-security -fstack-protector-strong -Wno-unused-local-typedefs -std=c++11 -o CMakeFiles/benchmarks.dir/benchmarks.pb.cc.o -c /BUILD/3rdparty/libprocess/src/tests/benchmarks.pb.cc
[ 77%] Linking CXX executable example
cd /BUILD/3rdparty/libprocess/examples && /usr/local/bin/cmake -E cmake_link_script CMakeFiles/example.dir/link.txt --verbose=1
/usr/bin/c++ -O3 -DNDEBUG CMakeFiles/example.dir/example.cpp.o -o example -Wl,-rpath,/BUILD/3rdparty/libprocess/src:/BUILD/3rdparty/glog-0.4.0/src/glog-0.4.0-install/lib:/BUILD/3rdparty/protobuf-3.5.0/src/protobuf-3.5.0-build:/BUILD/3rdparty/grpc-1.11.1/src/grpc-1.11.1-build:/BUILD/3rdparty/libev-4.22/src/libev-4.22-build/lib ../src/libprocess.so /usr/lib/x86_64-linux-gnu/libapr-1.so ../../glog-0.4.0/src/glog-0.4.0-install/lib/libglog.so ../../libarchive-3.3.2/src/libarchive-3.3.2-build/lib/libarchive.a /usr/lib/x86_64-linux-gnu/libcurl.so ../../protobuf-3.5.0/src/protobuf-3.5.0-build/libprotobuf.so -lpthread /usr/lib/x86_64-linux-gnu/libz.so -lrt -ldl /usr/lib/x86_64-linux-gnu/libsvn_delta-1.so /usr/lib/x86_64-linux-gnu/libsvn_diff-1.so /usr/lib/x86_64-linux-gnu/libsvn_subr-1.so ../../http_parser-2.6.2/src/http_parser-2.6.2-build/libhttp_parser.a ../../grpc-1.11.1/src/grpc-1.11.1-build/libgrpc++_unsecure.so ../../grpc-1.11.1/src/grpc-1.11.1-build/libgrpc_unsecure.so ../../grpc-1.11.1/src/grpc-1.11.1-build/libgpr.so -Wl,-rpath-link,/BUILD/3rdparty/libev-4.22/src/libev-4.22-build/lib
make[3]: Leaving directory '/BUILD'
[ 77%] Built target example
[ 77%] Linking CXX executable test-linkee
cd /BUILD/3rdparty/libprocess/src/tests && /usr/local/bin/cmake -E cmake_link_script CMakeFiles/test-linkee.dir/link.txt --verbose=1
/usr/bin/c++ -O3 -DNDEBUG CMakeFiles/test-linkee.dir/test_linkee.cpp.o -o test-linkee -Wl,-rpath,/BUILD/3rdparty/libprocess/src:/BUILD/3rdparty/glog-0.4.0/src/glog-0.4.0-install/lib:/BUILD/3rdparty/protobuf-3.5.0/src/protobuf-3.5.0-build:/BUILD/3rdparty/grpc-1.11.1/src/grpc-1.11.1-build:/BUILD/3rdparty/libev-4.22/src/libev-4.22-build/lib ../libprocess.so /usr/lib/x86_64-linux-gnu/libapr-1.so ../../../glog-0.4.0/src/glog-0.4.0-install/lib/libglog.so ../../../libarchive-3.3.2/src/libarchive-3.3.2-build/lib/libarchive.a /usr/lib/x86_64-linux-gnu/libcurl.so ../../../protobuf-3.5.0/src/protobuf-3.5.0-build/libprotobuf.so -lpthread /usr/lib/x86_64-linux-gnu/libz.so -lrt -ldl /usr/lib/x86_64-linux-gnu/libsvn_delta-1.so /usr/lib/x86_64-linux-gnu/libsvn_diff-1.so /usr/lib/x86_64-linux-gnu/libsvn_subr-1.so ../../../http_parser-2.6.2/src/http_parser-2.6.2-build/libhttp_parser.a ../../../grpc-1.11.1/src/grpc-1.11.1-build/libgrpc++_unsecure.so ../../../grpc-1.11.1/src/grpc-1.11.1-build/libgrpc_unsecure.so ../../../grpc-1.11.1/src/grpc-1.11.1-build/libgpr.so ../../../googletest-1.8.0/src/googletest-1.8.0-build/googlemock/libgmock.a ../../../googletest-1.8.0/src/googletest-1.8.0-build/googlemock/gtest/libgtest.a -Wl,-rpath-link,/BUILD/3rdparty/libev-4.22/src/libev-4.22-build/lib
make[3]: Leaving directory '/BUILD'
[ 77%] Built target test-linkee
[ 77%] Linking CXX executable benchmarks
cd /BUILD/3rdparty/libprocess/src/tests && /usr/local/bin/cmake -E cmake_link_script CMakeFiles/benchmarks.dir/link.txt --verbose=1
/usr/bin/c++ -O3 -DNDEBUG CMakeFiles/benchmarks.dir/benchmarks.cpp.o CMakeFiles/benchmarks.dir/benchmarks.pb.cc.o -o benchmarks -Wl,-rpath,/BUILD/3rdparty/libprocess/src:/BUILD/3rdparty/glog-0.4.0/src/glog-0.4.0-install/lib:/BUILD/3rdparty/protobuf-3.5.0/src/protobuf-3.5.0-build:/BUILD/3rdparty/grpc-1.11.1/src/grpc-1.11.1-build:/BUILD/3rdparty/libev-4.22/src/libev-4.22-build/lib ../libprocess.so /usr/lib/x86_64-linux-gnu/libapr-1.so ../../../glog-0.4.0/src/glog-0.4.0-install/lib/libglog.so ../../../libarchive-3.3.2/src/libarchive-3.3.2-build/lib/libarchive.a /usr/lib/x86_64-linux-gnu/libcurl.so ../../../protobuf-3.5.0/src/protobuf-3.5.0-build/libprotobuf.so -lpthread /usr/lib/x86_64-linux-gnu/libz.so -lrt -ldl /usr/lib/x86_64-linux-gnu/libsvn_delta-1.so /usr/lib/x86_64-linux-gnu/libsvn_diff-1.so /usr/lib/x86_64-linux-gnu/libsvn_subr-1.so ../../../http_parser-2.6.2/src/http_parser-2.6.2-build/libhttp_parser.a ../../../grpc-1.11.1/src/grpc-1.11.1-build/libgrpc++_unsecure.so ../../../grpc-1.11.1/src/grpc-1.11.1-build/libgrpc_unsecure.so ../../../grpc-1.11.1/src/grpc-1.11.1-build/libgpr.so ../../../googletest-1.8.0/src/googletest-1.8.0-build/googlemock/libgmock.a ../../../googletest-1.8.0/src/googletest-1.8.0-build/googlemock/gtest/libgtest.a -Wl,-rpath-link,/BUILD/3rdparty/libev-4.22/src/libev-4.22-build/lib
make[3]: Leaving directory '/BUILD'
[ 77%] Built target benchmarks
/usr/bin/make -f 3rdparty/libprocess/src/tests/CMakeFiles/libprocess-tests.dir/build.make 3rdparty/libprocess/src/tests/CMakeFiles/libprocess-tests.dir/depend
make[3]: Entering directory '/BUILD'
[ 83%] Generating grpc_tests.grpc.pb.cc, grpc_tests.grpc.pb.h, grpc_tests.pb.cc, grpc_tests.pb.h
cd /BUILD/3rdparty/libprocess/src/tests && ../../../protobuf-3.5.0/src/protobuf-3.5.0-build/protoc -I/tmp/SRC/3rdparty/libprocess/src/tests --cpp_out=/BUILD/3rdparty/libprocess/src/tests --grpc_out=/BUILD/3rdparty/libprocess/src/tests --plugin=protoc-gen-grpc=/BUILD/3rdparty/grpc-1.11.1/src/grpc-1.11.1-build/grpc_cpp_plugin /tmp/SRC/3rdparty/libprocess/src/tests/grpc_tests.proto
cd /BUILD && /usr/local/bin/cmake -E cmake_depends "Unix Makefiles" /tmp/SRC /tmp/SRC/3rdparty/libprocess/src/tests /BUILD /BUILD/3rdparty/libprocess/src/tests /BUILD/3rdparty/libprocess/src/tests/CMakeFiles/libprocess-tests.dir/DependInfo.cmake --color=
Scanning dependencies of target libprocess-tests
make[3]: Leaving directory '/BUILD'
/usr/bin/make -f 3rdparty/libprocess/src/tests/CMakeFiles/libprocess-tests.dir/build.make 3rdparty/libprocess/src/tests/CMakeFiles/libprocess-tests.dir/build
make[3]: Entering directory '/BUILD'
[ 83%] Building CXX object 3rdparty/libprocess/src/tests/CMakeFiles/libprocess-tests.dir/main.cpp.o
cd /BUILD/3rdparty/libprocess/src/tests && /usr/bin/c++ -DBUILD_DIR=\"/BUILD/3rdparty/libprocess/src/tests\" -DHAVE_LIBZ -DLIBDIR=\"/usr/local/lib\" -DPKGDATADIR=\"/usr/local/share/mesos\" -DPKGLIBEXECDIR=\"/usr/local/libexec/mesos\" -DVERSION=\"1.12.0\" -D__STDC_FORMAT_MACROS -I/BUILD/3rdparty/libprocess/src/tests -I/tmp/SRC/3rdparty/libprocess/src/tests/.. -I/tmp/SRC/3rdparty/libprocess/src/../include -I/tmp/SRC/3rdparty/stout/include -I/BUILD/3rdparty/boost-1.81.0/src/boost-1.81.0 -I/BUILD/3rdparty/elfio-3.2/src/elfio-3.2 -I/BUILD/3rdparty/picojson-1.3.0/src/picojson-1.3.0 -I/BUILD/3rdparty/rapidjson-1.1.0/src/rapidjson-1.1.0/include -I/usr/include/subversion-1 -I/BUILD/3rdparty/grpc-1.11.1/src/grpc-1.11.1/include -isystem /usr/include/apr-1.0 -isystem /BUILD/3rdparty/glog-0.4.0/src/glog-0.4.0-install/include -isystem /BUILD/3rdparty/libarchive-3.3.2/src/libarchive-3.3.2-build/include -isystem /BUILD/3rdparty/protobuf-3.5.0/src/protobuf-3.5.0/src -isystem /BUILD/3rdparty/http_parser-2.6.2/src/http_parser-2.6.2 -isystem /BUILD/3rdparty/googletest-1.8.0/src/googletest-1.8.0/googlemock/include -isystem /BUILD/3rdparty/googletest-1.8.0/src/googletest-1.8.0/googletest/include -O3 -DNDEBUG -fPIE -Wall -Wsign-compare -Wformat-security -fstack-protector-strong -Wno-unused-local-typedefs -std=c++11 -o CMakeFiles/libprocess-tests.dir/main.cpp.o -c /tmp/SRC/3rdparty/libprocess/src/tests/main.cpp
[ 83%] Building CXX object 3rdparty/libprocess/src/tests/CMakeFiles/libprocess-tests.dir/after_tests.cpp.o
cd /BUILD/3rdparty/libprocess/src/tests && /usr/bin/c++ -DBUILD_DIR=\"/BUILD/3rdparty/libprocess/src/tests\" -DHAVE_LIBZ -DLIBDIR=\"/usr/local/lib\" -DPKGDATADIR=\"/usr/local/share/mesos\" -DPKGLIBEXECDIR=\"/usr/local/libexec/mesos\" -DVERSION=\"1.12.0\" -D__STDC_FORMAT_MACROS -I/BUILD/3rdparty/libprocess/src/tests -I/tmp/SRC/3rdparty/libprocess/src/tests/.. -I/tmp/SRC/3rdparty/libprocess/src/../include -I/tmp/SRC/3rdparty/stout/include -I/BUILD/3rdparty/boost-1.81.0/src/boost-1.81.0 -I/BUILD/3rdparty/elfio-3.2/src/elfio-3.2 -I/BUILD/3rdparty/picojson-1.3.0/src/picojson-1.3.0 -I/BUILD/3rdparty/rapidjson-1.1.0/src/rapidjson-1.1.0/include -I/usr/include/subversion-1 -I/BUILD/3rdparty/grpc-1.11.1/src/grpc-1.11.1/include -isystem /usr/include/apr-1.0 -isystem /BUILD/3rdparty/glog-0.4.0/src/glog-0.4.0-install/include -isystem /BUILD/3rdparty/libarchive-3.3.2/src/libarchive-3.3.2-build/include -isystem /BUILD/3rdparty/protobuf-3.5.0/src/protobuf-3.5.0/src -isystem /BUILD/3rdparty/http_parser-2.6.2/src/http_parser-2.6.2 -isystem /BUILD/3rdparty/googletest-1.8.0/src/googletest-1.8.0/googlemock/include -isystem /BUILD/3rdparty/googletest-1.8.0/src/googletest-1.8.0/googletest/include -O3 -DNDEBUG -fPIE -Wall -Wsign-compare -Wformat-security -fstack-protector-strong -Wno-unused-local-typedefs -std=c++11 -o CMakeFiles/libprocess-tests.dir/after_tests.cpp.o -c /tmp/SRC/3rdparty/libprocess/src/tests/after_tests.cpp
[ 83%] Building CXX object 3rdparty/libprocess/src/tests/CMakeFiles/libprocess-tests.dir/collect_tests.cpp.o
cd /BUILD/3rdparty/libprocess/src/tests && /usr/bin/c++ -DBUILD_DIR=\"/BUILD/3rdparty/libprocess/src/tests\" -DHAVE_LIBZ -DLIBDIR=\"/usr/local/lib\" -DPKGDATADIR=\"/usr/local/share/mesos\" -DPKGLIBEXECDIR=\"/usr/local/libexec/mesos\" -DVERSION=\"1.12.0\" -D__STDC_FORMAT_MACROS -I/BUILD/3rdparty/libprocess/src/tests -I/tmp/SRC/3rdparty/libprocess/src/tests/.. -I/tmp/SRC/3rdparty/libprocess/src/../include -I/tmp/SRC/3rdparty/stout/include -I/BUILD/3rdparty/boost-1.81.0/src/boost-1.81.0 -I/BUILD/3rdparty/elfio-3.2/src/elfio-3.2 -I/BUILD/3rdparty/picojson-1.3.0/src/picojson-1.3.0 -I/BUILD/3rdparty/rapidjson-1.1.0/src/rapidjson-1.1.0/include -I/usr/include/subversion-1 -I/BUILD/3rdparty/grpc-1.11.1/src/grpc-1.11.1/include -isystem /usr/include/apr-1.0 -isystem /BUILD/3rdparty/glog-0.4.0/src/glog-0.4.0-install/include -isystem /BUILD/3rdparty/libarchive-3.3.2/src/libarchive-3.3.2-build/include -isystem /BUILD/3rdparty/protobuf-3.5.0/src/protobuf-3.5.0/src -isystem /BUILD/3rdparty/http_parser-2.6.2/src/http_parser-2.6.2 -isystem /BUILD/3rdparty/googletest-1.8.0/src/googletest-1.8.0/googlemock/include -isystem /BUILD/3rdparty/googletest-1.8.0/src/googletest-1.8.0/googletest/include -O3 -DNDEBUG -fPIE -Wall -Wsign-compare -Wformat-security -fstack-protector-strong -Wno-unused-local-typedefs -std=c++11 -o CMakeFiles/libprocess-tests.dir/collect_tests.cpp.o -c /tmp/SRC/3rdparty/libprocess/src/tests/collect_tests.cpp
[ 83%] Building CXX object 3rdparty/libprocess/src/tests/CMakeFiles/libprocess-tests.dir/count_down_latch_tests.cpp.o
cd /BUILD/3rdparty/libprocess/src/tests && /usr/bin/c++ -DBUILD_DIR=\"/BUILD/3rdparty/libprocess/src/tests\" -DHAVE_LIBZ -DLIBDIR=\"/usr/local/lib\" -DPKGDATADIR=\"/usr/local/share/mesos\" -DPKGLIBEXECDIR=\"/usr/local/libexec/mesos\" -DVERSION=\"1.12.0\" -D__STDC_FORMAT_MACROS -I/BUILD/3rdparty/libprocess/src/tests -I/tmp/SRC/3rdparty/libprocess/src/tests/.. -I/tmp/SRC/3rdparty/libprocess/src/../include -I/tmp/SRC/3rdparty/stout/include -I/BUILD/3rdparty/boost-1.81.0/src/boost-1.81.0 -I/BUILD/3rdparty/elfio-3.2/src/elfio-3.2 -I/BUILD/3rdparty/picojson-1.3.0/src/picojson-1.3.0 -I/BUILD/3rdparty/rapidjson-1.1.0/src/rapidjson-1.1.0/include -I/usr/include/subversion-1 -I/BUILD/3rdparty/grpc-1.11.1/src/grpc-1.11.1/include -isystem /usr/include/apr-1.0 -isystem /BUILD/3rdparty/glog-0.4.0/src/glog-0.4.0-install/include -isystem /BUILD/3rdparty/libarchive-3.3.2/src/libarchive-3.3.2-build/include -isystem /BUILD/3rdparty/protobuf-3.5.0/src/protobuf-3.5.0/src -isystem /BUILD/3rdparty/http_parser-2.6.2/src/http_parser-2.6.2 -isystem /BUILD/3rdparty/googletest-1.8.0/src/googletest-1.8.0/googlemock/include -isystem /BUILD/3rdparty/googletest-1.8.0/src/googletest-1.8.0/googletest/include -O3 -DNDEBUG -fPIE -Wall -Wsign-compare -Wformat-security -fstack-protector-strong -Wno-unused-local-typedefs -std=c++11 -o CMakeFiles/libprocess-tests.dir/count_down_latch_tests.cpp.o -c /tmp/SRC/3rdparty/libprocess/src/tests/count_down_latch_tests.cpp
[ 83%] Building CXX object 3rdparty/libprocess/src/tests/CMakeFiles/libprocess-tests.dir/decoder_tests.cpp.o
cd /BUILD/3rdparty/libprocess/src/tests && /usr/bin/c++ -DBUILD_DIR=\"/BUILD/3rdparty/libprocess/src/tests\" -DHAVE_LIBZ -DLIBDIR=\"/usr/local/lib\" -DPKGDATADIR=\"/usr/local/share/mesos\" -DPKGLIBEXECDIR=\"/usr/local/libexec/mesos\" -DVERSION=\"1.12.0\" -D__STDC_FORMAT_MACROS -I/BUILD/3rdparty/libprocess/src/tests -I/tmp/SRC/3rdparty/libprocess/src/tests/.. -I/tmp/SRC/3rdparty/libprocess/src/../include -I/tmp/SRC/3rdparty/stout/include -I/BUILD/3rdparty/boost-1.81.0/src/boost-1.81.0 -I/BUILD/3rdparty/elfio-3.2/src/elfio-3.2 -I/BUILD/3rdparty/picojson-1.3.0/src/picojson-1.3.0 -I/BUILD/3rdparty/rapidjson-1.1.0/src/rapidjson-1.1.0/include -I/usr/include/subversion-1 -I/BUILD/3rdparty/grpc-1.11.1/src/grpc-1.11.1/include -isystem /usr/include/apr-1.0 -isystem /BUILD/3rdparty/glog-0.4.0/src/glog-0.4.0-install/include -isystem /BUILD/3rdparty/libarchive-3.3.2/src/libarchive-3.3.2-build/include -isystem /BUILD/3rdparty/protobuf-3.5.0/src/protobuf-3.5.0/src -isystem /BUILD/3rdparty/http_parser-2.6.2/src/http_parser-2.6.2 -isystem /BUILD/3rdparty/googletest-1.8.0/src/googletest-1.8.0/googlemock/include -isystem /BUILD/3rdparty/googletest-1.8.0/src/googletest-1.8.0/googletest/include -O3 -DNDEBUG -fPIE -Wall -Wsign-compare -Wformat-security -fstack-protector-strong -Wno-unused-local-typedefs -std=c++11 -o CMakeFiles/libprocess-tests.dir/decoder_tests.cpp.o -c /tmp/SRC/3rdparty/libprocess/src/tests/decoder_tests.cpp
[ 83%] Building CXX object 3rdparty/libprocess/src/tests/CMakeFiles/libprocess-tests.dir/encoder_tests.cpp.o
[ 83%] Building CXX object 3rdparty/libprocess/src/tests/CMakeFiles/libprocess-tests.dir/future_tests.cpp.o
cd /BUILD/3rdparty/libprocess/src/tests && /usr/bin/c++ -DBUILD_DIR=\"/BUILD/3rdparty/libprocess/src/tests\" -DHAVE_LIBZ -DLIBDIR=\"/usr/local/lib\" -DPKGDATADIR=\"/usr/local/share/mesos\" -DPKGLIBEXECDIR=\"/usr/local/libexec/mesos\" -DVERSION=\"1.12.0\" -D__STDC_FORMAT_MACROS -I/BUILD/3rdparty/libprocess/src/tests -I/tmp/SRC/3rdparty/libprocess/src/tests/.. -I/tmp/SRC/3rdparty/libprocess/src/../include -I/tmp/SRC/3rdparty/stout/include -I/BUILD/3rdparty/boost-1.81.0/src/boost-1.81.0 -I/BUILD/3rdparty/elfio-3.2/src/elfio-3.2 -I/BUILD/3rdparty/picojson-1.3.0/src/picojson-1.3.0 -I/BUILD/3rdparty/rapidjson-1.1.0/src/rapidjson-1.1.0/include -I/usr/include/subversion-1 -I/BUILD/3rdparty/grpc-1.11.1/src/grpc-1.11.1/include -isystem /usr/include/apr-1.0 -isystem /BUILD/3rdparty/glog-0.4.0/src/glog-0.4.0-install/include -isystem /BUILD/3rdparty/libarchive-3.3.2/src/libarchive-3.3.2-build/include -isystem /BUILD/3rdparty/protobuf-3.5.0/src/protobuf-3.5.0/src -isystem /BUILD/3rdparty/http_parser-2.6.2/src/http_parser-2.6.2 -isystem /BUILD/3rdparty/googletest-1.8.0/src/googletest-1.8.0/googlemock/include -isystem /BUILD/3rdparty/googletest-1.8.0/src/googletest-1.8.0/googletest/include -O3 -DNDEBUG -fPIE -Wall -Wsign-compare -Wformat-security -fstack-protector-strong -Wno-unused-local-typedefs -std=c++11 -o CMakeFiles/libprocess-tests.dir/encoder_tests.cpp.o -c /tmp/SRC/3rdparty/libprocess/src/tests/encoder_tests.cpp
cd /BUILD/3rdparty/libprocess/src/tests && /usr/bin/c++ -DBUILD_DIR=\"/BUILD/3rdparty/libprocess/src/tests\" -DHAVE_LIBZ -DLIBDIR=\"/usr/local/lib\" -DPKGDATADIR=\"/usr/local/share/mesos\" -DPKGLIBEXECDIR=\"/usr/local/libexec/mesos\" -DVERSION=\"1.12.0\" -D__STDC_FORMAT_MACROS -I/BUILD/3rdparty/libprocess/src/tests -I/tmp/SRC/3rdparty/libprocess/src/tests/.. -I/tmp/SRC/3rdparty/libprocess/src/../include -I/tmp/SRC/3rdparty/stout/include -I/BUILD/3rdparty/boost-1.81.0/src/boost-1.81.0 -I/BUILD/3rdparty/elfio-3.2/src/elfio-3.2 -I/BUILD/3rdparty/picojson-1.3.0/src/picojson-1.3.0 -I/BUILD/3rdparty/rapidjson-1.1.0/src/rapidjson-1.1.0/include -I/usr/include/subversion-1 -I/BUILD/3rdparty/grpc-1.11.1/src/grpc-1.11.1/include -isystem /usr/include/apr-1.0 -isystem /BUILD/3rdparty/glog-0.4.0/src/glog-0.4.0-install/include -isystem /BUILD/3rdparty/libarchive-3.3.2/src/libarchive-3.3.2-build/include -isystem /BUILD/3rdparty/protobuf-3.5.0/src/protobuf-3.5.0/src -isystem /BUILD/3rdparty/http_parser-2.6.2/src/http_parser-2.6.2 -isystem /BUILD/3rdparty/googletest-1.8.0/src/googletest-1.8.0/googlemock/include -isystem /BUILD/3rdparty/googletest-1.8.0/src/googletest-1.8.0/googletest/include -O3 -DNDEBUG -fPIE -Wall -Wsign-compare -Wformat-security -fstack-protector-strong -Wno-unused-local-typedefs -std=c++11 -o CMakeFiles/libprocess-tests.dir/future_tests.cpp.o -c /tmp/SRC/3rdparty/libprocess/src/tests/future_tests.cpp
[ 83%] Building CXX object 3rdparty/libprocess/src/tests/CMakeFiles/libprocess-tests.dir/grpc_tests.cpp.o
cd /BUILD/3rdparty/libprocess/src/tests && /usr/bin/c++ -DBUILD_DIR=\"/BUILD/3rdparty/libprocess/src/tests\" -DHAVE_LIBZ -DLIBDIR=\"/usr/local/lib\" -DPKGDATADIR=\"/usr/local/share/mesos\" -DPKGLIBEXECDIR=\"/usr/local/libexec/mesos\" -DVERSION=\"1.12.0\" -D__STDC_FORMAT_MACROS -I/BUILD/3rdparty/libprocess/src/tests -I/tmp/SRC/3rdparty/libprocess/src/tests/.. -I/tmp/SRC/3rdparty/libprocess/src/../include -I/tmp/SRC/3rdparty/stout/include -I/BUILD/3rdparty/boost-1.81.0/src/boost-1.81.0 -I/BUILD/3rdparty/elfio-3.2/src/elfio-3.2 -I/BUILD/3rdparty/picojson-1.3.0/src/picojson-1.3.0 -I/BUILD/3rdparty/rapidjson-1.1.0/src/rapidjson-1.1.0/include -I/usr/include/subversion-1 -I/BUILD/3rdparty/grpc-1.11.1/src/grpc-1.11.1/include -isystem /usr/include/apr-1.0 -isystem /BUILD/3rdparty/glog-0.4.0/src/glog-0.4.0-install/include -isystem /BUILD/3rdparty/libarchive-3.3.2/src/libarchive-3.3.2-build/include -isystem /BUILD/3rdparty/protobuf-3.5.0/src/protobuf-3.5.0/src -isystem /BUILD/3rdparty/http_parser-2.6.2/src/http_parser-2.6.2 -isystem /BUILD/3rdparty/googletest-1.8.0/src/googletest-1.8.0/googlemock/include -isystem /BUILD/3rdparty/googletest-1.8.0/src/googletest-1.8.0/googletest/include -O3 -DNDEBUG -fPIE -Wall -Wsign-compare -Wformat-security -fstack-protector-strong -Wno-unused-local-typedefs -std=c++11 -o CMakeFiles/libprocess-tests.dir/grpc_tests.cpp.o -c /tmp/SRC/3rdparty/libprocess/src/tests/grpc_tests.cpp
[ 88%] Building CXX object 3rdparty/libprocess/src/tests/CMakeFiles/libprocess-tests.dir/http_tests.cpp.o
cd /BUILD/3rdparty/libprocess/src/tests && /usr/bin/c++ -DBUILD_DIR=\"/BUILD/3rdparty/libprocess/src/tests\" -DHAVE_LIBZ -DLIBDIR=\"/usr/local/lib\" -DPKGDATADIR=\"/usr/local/share/mesos\" -DPKGLIBEXECDIR=\"/usr/local/libexec/mesos\" -DVERSION=\"1.12.0\" -D__STDC_FORMAT_MACROS -I/BUILD/3rdparty/libprocess/src/tests -I/tmp/SRC/3rdparty/libprocess/src/tests/.. -I/tmp/SRC/3rdparty/libprocess/src/../include -I/tmp/SRC/3rdparty/stout/include -I/BUILD/3rdparty/boost-1.81.0/src/boost-1.81.0 -I/BUILD/3rdparty/elfio-3.2/src/elfio-3.2 -I/BUILD/3rdparty/picojson-1.3.0/src/picojson-1.3.0 -I/BUILD/3rdparty/rapidjson-1.1.0/src/rapidjson-1.1.0/include -I/usr/include/subversion-1 -I/BUILD/3rdparty/grpc-1.11.1/src/grpc-1.11.1/include -isystem /usr/include/apr-1.0 -isystem /BUILD/3rdparty/glog-0.4.0/src/glog-0.4.0-install/include -isystem /BUILD/3rdparty/libarchive-3.3.2/src/libarchive-3.3.2-build/include -isystem /BUILD/3rdparty/protobuf-3.5.0/src/protobuf-3.5.0/src -isystem /BUILD/3rdparty/http_parser-2.6.2/src/http_parser-2.6.2 -isystem /BUILD/3rdparty/googletest-1.8.0/src/googletest-1.8.0/googlemock/include -isystem /BUILD/3rdparty/googletest-1.8.0/src/googletest-1.8.0/googletest/include -O3 -DNDEBUG -fPIE -Wall -Wsign-compare -Wformat-security -fstack-protector-strong -Wno-unused-local-typedefs -std=c++11 -o CMakeFiles/libprocess-tests.dir/http_tests.cpp.o -c /tmp/SRC/3rdparty/libprocess/src/tests/http_tests.cpp
[ 88%] Building CXX object 3rdparty/libprocess/src/tests/CMakeFiles/libprocess-tests.dir/io_tests.cpp.o
cd /BUILD/3rdparty/libprocess/src/tests && /usr/bin/c++ -DBUILD_DIR=\"/BUILD/3rdparty/libprocess/src/tests\" -DHAVE_LIBZ -DLIBDIR=\"/usr/local/lib\" -DPKGDATADIR=\"/usr/local/share/mesos\" -DPKGLIBEXECDIR=\"/usr/local/libexec/mesos\" -DVERSION=\"1.12.0\" -D__STDC_FORMAT_MACROS -I/BUILD/3rdparty/libprocess/src/tests -I/tmp/SRC/3rdparty/libprocess/src/tests/.. -I/tmp/SRC/3rdparty/libprocess/src/../include -I/tmp/SRC/3rdparty/stout/include -I/BUILD/3rdparty/boost-1.81.0/src/boost-1.81.0 -I/BUILD/3rdparty/elfio-3.2/src/elfio-3.2 -I/BUILD/3rdparty/picojson-1.3.0/src/picojson-1.3.0 -I/BUILD/3rdparty/rapidjson-1.1.0/src/rapidjson-1.1.0/include -I/usr/include/subversion-1 -I/BUILD/3rdparty/grpc-1.11.1/src/grpc-1.11.1/include -isystem /usr/include/apr-1.0 -isystem /BUILD/3rdparty/glog-0.4.0/src/glog-0.4.0-install/include -isystem /BUILD/3rdparty/libarchive-3.3.2/src/libarchive-3.3.2-build/include -isystem /BUILD/3rdparty/protobuf-3.5.0/src/protobuf-3.5.0/src -isystem /BUILD/3rdparty/http_parser-2.6.2/src/http_parser-2.6.2 -isystem /BUILD/3rdparty/googletest-1.8.0/src/googletest-1.8.0/googlemock/include -isystem /BUILD/3rdparty/googletest-1.8.0/src/googletest-1.8.0/googletest/include -O3 -DNDEBUG -fPIE -Wall -Wsign-compare -Wformat-security -fstack-protector-strong -Wno-unused-local-typedefs -std=c++11 -o CMakeFiles/libprocess-tests.dir/io_tests.cpp.o -c /tmp/SRC/3rdparty/libprocess/src/tests/io_tests.cpp
[ 88%] Building CXX object 3rdparty/libprocess/src/tests/CMakeFiles/libprocess-tests.dir/limiter_tests.cpp.o
[ 88%] Building CXX object 3rdparty/libprocess/src/tests/CMakeFiles/libprocess-tests.dir/loop_tests.cpp.o
cd /BUILD/3rdparty/libprocess/src/tests && /usr/bin/c++ -DBUILD_DIR=\"/BUILD/3rdparty/libprocess/src/tests\" -DHAVE_LIBZ -DLIBDIR=\"/usr/local/lib\" -DPKGDATADIR=\"/usr/local/share/mesos\" -DPKGLIBEXECDIR=\"/usr/local/libexec/mesos\" -DVERSION=\"1.12.0\" -D__STDC_FORMAT_MACROS -I/BUILD/3rdparty/libprocess/src/tests -I/tmp/SRC/3rdparty/libprocess/src/tests/.. -I/tmp/SRC/3rdparty/libprocess/src/../include -I/tmp/SRC/3rdparty/stout/include -I/BUILD/3rdparty/boost-1.81.0/src/boost-1.81.0 -I/BUILD/3rdparty/elfio-3.2/src/elfio-3.2 -I/BUILD/3rdparty/picojson-1.3.0/src/picojson-1.3.0 -I/BUILD/3rdparty/rapidjson-1.1.0/src/rapidjson-1.1.0/include -I/usr/include/subversion-1 -I/BUILD/3rdparty/grpc-1.11.1/src/grpc-1.11.1/include -isystem /usr/include/apr-1.0 -isystem /BUILD/3rdparty/glog-0.4.0/src/glog-0.4.0-install/include -isystem /BUILD/3rdparty/libarchive-3.3.2/src/libarchive-3.3.2-build/include -isystem /BUILD/3rdparty/protobuf-3.5.0/src/protobuf-3.5.0/src -isystem /BUILD/3rdparty/http_parser-2.6.2/src/http_parser-2.6.2 -isystem /BUILD/3rdparty/googletest-1.8.0/src/googletest-1.8.0/googlemock/include -isystem /BUILD/3rdparty/googletest-1.8.0/src/googletest-1.8.0/googletest/include -O3 -DNDEBUG -fPIE -Wall -Wsign-compare -Wformat-security -fstack-protector-strong -Wno-unused-local-typedefs -std=c++11 -o CMakeFiles/libprocess-tests.dir/limiter_tests.cpp.o -c /tmp/SRC/3rdparty/libprocess/src/tests/limiter_tests.cpp
cd /BUILD/3rdparty/libprocess/src/tests && /usr/bin/c++ -DBUILD_DIR=\"/BUILD/3rdparty/libprocess/src/tests\" -DHAVE_LIBZ -DLIBDIR=\"/usr/local/lib\" -DPKGDATADIR=\"/usr/local/share/mesos\" -DPKGLIBEXECDIR=\"/usr/local/libexec/mesos\" -DVERSION=\"1.12.0\" -D__STDC_FORMAT_MACROS -I/BUILD/3rdparty/libprocess/src/tests -I/tmp/SRC/3rdparty/libprocess/src/tests/.. -I/tmp/SRC/3rdparty/libprocess/src/../include -I/tmp/SRC/3rdparty/stout/include -I/BUILD/3rdparty/boost-1.81.0/src/boost-1.81.0 -I/BUILD/3rdparty/elfio-3.2/src/elfio-3.2 -I/BUILD/3rdparty/picojson-1.3.0/src/picojson-1.3.0 -I/BUILD/3rdparty/rapidjson-1.1.0/src/rapidjson-1.1.0/include -I/usr/include/subversion-1 -I/BUILD/3rdparty/grpc-1.11.1/src/grpc-1.11.1/include -isystem /usr/include/apr-1.0 -isystem /BUILD/3rdparty/glog-0.4.0/src/glog-0.4.0-install/include -isystem /BUILD/3rdparty/libarchive-3.3.2/src/libarchive-3.3.2-build/include -isystem /BUILD/3rdparty/protobuf-3.5.0/src/protobuf-3.5.0/src -isystem /BUILD/3rdparty/http_parser-2.6.2/src/http_parser-2.6.2 -isystem /BUILD/3rdparty/googletest-1.8.0/src/googletest-1.8.0/googlemock/include -isystem /BUILD/3rdparty/googletest-1.8.0/src/googletest-1.8.0/googletest/include -O3 -DNDEBUG -fPIE -Wall -Wsign-compare -Wformat-security -fstack-protector-strong -Wno-unused-local-typedefs -std=c++11 -o CMakeFiles/libprocess-tests.dir/loop_tests.cpp.o -c /tmp/SRC/3rdparty/libprocess/src/tests/loop_tests.cpp
[ 88%] Building CXX object 3rdparty/libprocess/src/tests/CMakeFiles/libprocess-tests.dir/metrics_tests.cpp.o
[ 88%] Building CXX object 3rdparty/libprocess/src/tests/CMakeFiles/libprocess-tests.dir/mpsc_linked_queue_tests.cpp.o
cd /BUILD/3rdparty/libprocess/src/tests && /usr/bin/c++ -DBUILD_DIR=\"/BUILD/3rdparty/libprocess/src/tests\" -DHAVE_LIBZ -DLIBDIR=\"/usr/local/lib\" -DPKGDATADIR=\"/usr/local/share/mesos\" -DPKGLIBEXECDIR=\"/usr/local/libexec/mesos\" -DVERSION=\"1.12.0\" -D__STDC_FORMAT_MACROS -I/BUILD/3rdparty/libprocess/src/tests -I/tmp/SRC/3rdparty/libprocess/src/tests/.. -I/tmp/SRC/3rdparty/libprocess/src/../include -I/tmp/SRC/3rdparty/stout/include -I/BUILD/3rdparty/boost-1.81.0/src/boost-1.81.0 -I/BUILD/3rdparty/elfio-3.2/src/elfio-3.2 -I/BUILD/3rdparty/picojson-1.3.0/src/picojson-1.3.0 -I/BUILD/3rdparty/rapidjson-1.1.0/src/rapidjson-1.1.0/include -I/usr/include/subversion-1 -I/BUILD/3rdparty/grpc-1.11.1/src/grpc-1.11.1/include -isystem /usr/include/apr-1.0 -isystem /BUILD/3rdparty/glog-0.4.0/src/glog-0.4.0-install/include -isystem /BUILD/3rdparty/libarchive-3.3.2/src/libarchive-3.3.2-build/include -isystem /BUILD/3rdparty/protobuf-3.5.0/src/protobuf-3.5.0/src -isystem /BUILD/3rdparty/http_parser-2.6.2/src/http_parser-2.6.2 -isystem /BUILD/3rdparty/googletest-1.8.0/src/googletest-1.8.0/googlemock/include -isystem /BUILD/3rdparty/googletest-1.8.0/src/googletest-1.8.0/googletest/include -O3 -DNDEBUG -fPIE -Wall -Wsign-compare -Wformat-security -fstack-protector-strong -Wno-unused-local-typedefs -std=c++11 -o CMakeFiles/libprocess-tests.dir/metrics_tests.cpp.o -c /tmp/SRC/3rdparty/libprocess/src/tests/metrics_tests.cpp
cd /BUILD/3rdparty/libprocess/src/tests && /usr/bin/c++ -DBUILD_DIR=\"/BUILD/3rdparty/libprocess/src/tests\" -DHAVE_LIBZ -DLIBDIR=\"/usr/local/lib\" -DPKGDATADIR=\"/usr/local/share/mesos\" -DPKGLIBEXECDIR=\"/usr/local/libexec/mesos\" -DVERSION=\"1.12.0\" -D__STDC_FORMAT_MACROS -I/BUILD/3rdparty/libprocess/src/tests -I/tmp/SRC/3rdparty/libprocess/src/tests/.. -I/tmp/SRC/3rdparty/libprocess/src/../include -I/tmp/SRC/3rdparty/stout/include -I/BUILD/3rdparty/boost-1.81.0/src/boost-1.81.0 -I/BUILD/3rdparty/elfio-3.2/src/elfio-3.2 -I/BUILD/3rdparty/picojson-1.3.0/src/picojson-1.3.0 -I/BUILD/3rdparty/rapidjson-1.1.0/src/rapidjson-1.1.0/include -I/usr/include/subversion-1 -I/BUILD/3rdparty/grpc-1.11.1/src/grpc-1.11.1/include -isystem /usr/include/apr-1.0 -isystem /BUILD/3rdparty/glog-0.4.0/src/glog-0.4.0-install/include -isystem /BUILD/3rdparty/libarchive-3.3.2/src/libarchive-3.3.2-build/include -isystem /BUILD/3rdparty/protobuf-3.5.0/src/protobuf-3.5.0/src -isystem /BUILD/3rdparty/http_parser-2.6.2/src/http_parser-2.6.2 -isystem /BUILD/3rdparty/googletest-1.8.0/src/googletest-1.8.0/googlemock/include -isystem /BUILD/3rdparty/googletest-1.8.0/src/googletest-1.8.0/googletest/include -O3 -DNDEBUG -fPIE -Wall -Wsign-compare -Wformat-security -fstack-protector-strong -Wno-unused-local-typedefs -std=c++11 -o CMakeFiles/libprocess-tests.dir/mpsc_linked_queue_tests.cpp.o -c /tmp/SRC/3rdparty/libprocess/src/tests/mpsc_linked_queue_tests.cpp
[ 88%] Building CXX object 3rdparty/libprocess/src/tests/CMakeFiles/libprocess-tests.dir/mutex_tests.cpp.o
cd /BUILD/3rdparty/libprocess/src/tests && /usr/bin/c++ -DBUILD_DIR=\"/BUILD/3rdparty/libprocess/src/tests\" -DHAVE_LIBZ -DLIBDIR=\"/usr/local/lib\" -DPKGDATADIR=\"/usr/local/share/mesos\" -DPKGLIBEXECDIR=\"/usr/local/libexec/mesos\" -DVERSION=\"1.12.0\" -D__STDC_FORMAT_MACROS -I/BUILD/3rdparty/libprocess/src/tests -I/tmp/SRC/3rdparty/libprocess/src/tests/.. -I/tmp/SRC/3rdparty/libprocess/src/../include -I/tmp/SRC/3rdparty/stout/include -I/BUILD/3rdparty/boost-1.81.0/src/boost-1.81.0 -I/BUILD/3rdparty/elfio-3.2/src/elfio-3.2 -I/BUILD/3rdparty/picojson-1.3.0/src/picojson-1.3.0 -I/BUILD/3rdparty/rapidjson-1.1.0/src/rapidjson-1.1.0/include -I/usr/include/subversion-1 -I/BUILD/3rdparty/grpc-1.11.1/src/grpc-1.11.1/include -isystem /usr/include/apr-1.0 -isystem /BUILD/3rdparty/glog-0.4.0/src/glog-0.4.0-install/include -isystem /BUILD/3rdparty/libarchive-3.3.2/src/libarchive-3.3.2-build/include -isystem /BUILD/3rdparty/protobuf-3.5.0/src/protobuf-3.5.0/src -isystem /BUILD/3rdparty/http_parser-2.6.2/src/http_parser-2.6.2 -isystem /BUILD/3rdparty/googletest-1.8.0/src/googletest-1.8.0/googlemock/include -isystem /BUILD/3rdparty/googletest-1.8.0/src/googletest-1.8.0/googletest/include -O3 -DNDEBUG -fPIE -Wall -Wsign-compare -Wformat-security -fstack-protector-strong -Wno-unused-local-typedefs -std=c++11 -o CMakeFiles/libprocess-tests.dir/mutex_tests.cpp.o -c /tmp/SRC/3rdparty/libprocess/src/tests/mutex_tests.cpp
[ 88%] Building CXX object 3rdparty/libprocess/src/tests/CMakeFiles/libprocess-tests.dir/owned_tests.cpp.o
cd /BUILD/3rdparty/libprocess/src/tests && /usr/bin/c++ -DBUILD_DIR=\"/BUILD/3rdparty/libprocess/src/tests\" -DHAVE_LIBZ -DLIBDIR=\"/usr/local/lib\" -DPKGDATADIR=\"/usr/local/share/mesos\" -DPKGLIBEXECDIR=\"/usr/local/libexec/mesos\" -DVERSION=\"1.12.0\" -D__STDC_FORMAT_MACROS -I/BUILD/3rdparty/libprocess/src/tests -I/tmp/SRC/3rdparty/libprocess/src/tests/.. -I/tmp/SRC/3rdparty/libprocess/src/../include -I/tmp/SRC/3rdparty/stout/include -I/BUILD/3rdparty/boost-1.81.0/src/boost-1.81.0 -I/BUILD/3rdparty/elfio-3.2/src/elfio-3.2 -I/BUILD/3rdparty/picojson-1.3.0/src/picojson-1.3.0 -I/BUILD/3rdparty/rapidjson-1.1.0/src/rapidjson-1.1.0/include -I/usr/include/subversion-1 -I/BUILD/3rdparty/grpc-1.11.1/src/grpc-1.11.1/include -isystem /usr/include/apr-1.0 -isystem /BUILD/3rdparty/glog-0.4.0/src/glog-0.4.0-install/include -isystem /BUILD/3rdparty/libarchive-3.3.2/src/libarchive-3.3.2-build/include -isystem /BUILD/3rdparty/protobuf-3.5.0/src/protobuf-3.5.0/src -isystem /BUILD/3rdparty/http_parser-2.6.2/src/http_parser-2.6.2 -isystem /BUILD/3rdparty/googletest-1.8.0/src/googletest-1.8.0/googlemock/include -isystem /BUILD/3rdparty/googletest-1.8.0/src/googletest-1.8.0/googletest/include -O3 -DNDEBUG -fPIE -Wall -Wsign-compare -Wformat-security -fstack-protector-strong -Wno-unused-local-typedefs -std=c++11 -o CMakeFiles/libprocess-tests.dir/owned_tests.cpp.o -c /tmp/SRC/3rdparty/libprocess/src/tests/owned_tests.cpp
[ 88%] Building CXX object 3rdparty/libprocess/src/tests/CMakeFiles/libprocess-tests.dir/process_tests.cpp.o
cd /BUILD/3rdparty/libprocess/src/tests && /usr/bin/c++ -DBUILD_DIR=\"/BUILD/3rdparty/libprocess/src/tests\" -DHAVE_LIBZ -DLIBDIR=\"/usr/local/lib\" -DPKGDATADIR=\"/usr/local/share/mesos\" -DPKGLIBEXECDIR=\"/usr/local/libexec/mesos\" -DVERSION=\"1.12.0\" -D__STDC_FORMAT_MACROS -I/BUILD/3rdparty/libprocess/src/tests -I/tmp/SRC/3rdparty/libprocess/src/tests/.. -I/tmp/SRC/3rdparty/libprocess/src/../include -I/tmp/SRC/3rdparty/stout/include -I/BUILD/3rdparty/boost-1.81.0/src/boost-1.81.0 -I/BUILD/3rdparty/elfio-3.2/src/elfio-3.2 -I/BUILD/3rdparty/picojson-1.3.0/src/picojson-1.3.0 -I/BUILD/3rdparty/rapidjson-1.1.0/src/rapidjson-1.1.0/include -I/usr/include/subversion-1 -I/BUILD/3rdparty/grpc-1.11.1/src/grpc-1.11.1/include -isystem /usr/include/apr-1.0 -isystem /BUILD/3rdparty/glog-0.4.0/src/glog-0.4.0-install/include -isystem /BUILD/3rdparty/libarchive-3.3.2/src/libarchive-3.3.2-build/include -isystem /BUILD/3rdparty/protobuf-3.5.0/src/protobuf-3.5.0/src -isystem /BUILD/3rdparty/http_parser-2.6.2/src/http_parser-2.6.2 -isystem /BUILD/3rdparty/googletest-1.8.0/src/googletest-1.8.0/googlemock/include -isystem /BUILD/3rdparty/googletest-1.8.0/src/googletest-1.8.0/googletest/include -O3 -DNDEBUG -fPIE -Wall -Wsign-compare -Wformat-security -fstack-protector-strong -Wno-unused-local-typedefs -std=c++11 -o CMakeFiles/libprocess-tests.dir/process_tests.cpp.o -c /tmp/SRC/3rdparty/libprocess/src/tests/process_tests.cpp
[ 94%] Building CXX object 3rdparty/libprocess/src/tests/CMakeFiles/libprocess-tests.dir/profiler_tests.cpp.o
cd /BUILD/3rdparty/libprocess/src/tests && /usr/bin/c++ -DBUILD_DIR=\"/BUILD/3rdparty/libprocess/src/tests\" -DHAVE_LIBZ -DLIBDIR=\"/usr/local/lib\" -DPKGDATADIR=\"/usr/local/share/mesos\" -DPKGLIBEXECDIR=\"/usr/local/libexec/mesos\" -DVERSION=\"1.12.0\" -D__STDC_FORMAT_MACROS -I/BUILD/3rdparty/libprocess/src/tests -I/tmp/SRC/3rdparty/libprocess/src/tests/.. -I/tmp/SRC/3rdparty/libprocess/src/../include -I/tmp/SRC/3rdparty/stout/include -I/BUILD/3rdparty/boost-1.81.0/src/boost-1.81.0 -I/BUILD/3rdparty/elfio-3.2/src/elfio-3.2 -I/BUILD/3rdparty/picojson-1.3.0/src/picojson-1.3.0 -I/BUILD/3rdparty/rapidjson-1.1.0/src/rapidjson-1.1.0/include -I/usr/include/subversion-1 -I/BUILD/3rdparty/grpc-1.11.1/src/grpc-1.11.1/include -isystem /usr/include/apr-1.0 -isystem /BUILD/3rdparty/glog-0.4.0/src/glog-0.4.0-install/include -isystem /BUILD/3rdparty/libarchive-3.3.2/src/libarchive-3.3.2-build/include -isystem /BUILD/3rdparty/protobuf-3.5.0/src/protobuf-3.5.0/src -isystem /BUILD/3rdparty/http_parser-2.6.2/src/http_parser-2.6.2 -isystem /BUILD/3rdparty/googletest-1.8.0/src/googletest-1.8.0/googlemock/include -isystem /BUILD/3rdparty/googletest-1.8.0/src/googletest-1.8.0/googletest/include -O3 -DNDEBUG -fPIE -Wall -Wsign-compare -Wformat-security -fstack-protector-strong -Wno-unused-local-typedefs -std=c++11 -o CMakeFiles/libprocess-tests.dir/profiler_tests.cpp.o -c /tmp/SRC/3rdparty/libprocess/src/tests/profiler_tests.cpp
[ 94%] Building CXX object 3rdparty/libprocess/src/tests/CMakeFiles/libprocess-tests.dir/queue_tests.cpp.o
cd /BUILD/3rdparty/libprocess/src/tests && /usr/bin/c++ -DBUILD_DIR=\"/BUILD/3rdparty/libprocess/src/tests\" -DHAVE_LIBZ -DLIBDIR=\"/usr/local/lib\" -DPKGDATADIR=\"/usr/local/share/mesos\" -DPKGLIBEXECDIR=\"/usr/local/libexec/mesos\" -DVERSION=\"1.12.0\" -D__STDC_FORMAT_MACROS -I/BUILD/3rdparty/libprocess/src/tests -I/tmp/SRC/3rdparty/libprocess/src/tests/.. -I/tmp/SRC/3rdparty/libprocess/src/../include -I/tmp/SRC/3rdparty/stout/include -I/BUILD/3rdparty/boost-1.81.0/src/boost-1.81.0 -I/BUILD/3rdparty/elfio-3.2/src/elfio-3.2 -I/BUILD/3rdparty/picojson-1.3.0/src/picojson-1.3.0 -I/BUILD/3rdparty/rapidjson-1.1.0/src/rapidjson-1.1.0/include -I/usr/include/subversion-1 -I/BUILD/3rdparty/grpc-1.11.1/src/grpc-1.11.1/include -isystem /usr/include/apr-1.0 -isystem /BUILD/3rdparty/glog-0.4.0/src/glog-0.4.0-install/include -isystem /BUILD/3rdparty/libarchive-3.3.2/src/libarchive-3.3.2-build/include -isystem /BUILD/3rdparty/protobuf-3.5.0/src/protobuf-3.5.0/src -isystem /BUILD/3rdparty/http_parser-2.6.2/src/http_parser-2.6.2 -isystem /BUILD/3rdparty/googletest-1.8.0/src/googletest-1.8.0/googlemock/include -isystem /BUILD/3rdparty/googletest-1.8.0/src/googletest-1.8.0/googletest/include -O3 -DNDEBUG -fPIE -Wall -Wsign-compare -Wformat-security -fstack-protector-strong -Wno-unused-local-typedefs -std=c++11 -o CMakeFiles/libprocess-tests.dir/queue_tests.cpp.o -c /tmp/SRC/3rdparty/libprocess/src/tests/queue_tests.cpp
[ 94%] Building CXX object 3rdparty/libprocess/src/tests/CMakeFiles/libprocess-tests.dir/rwlock_tests.cpp.o
[ 94%] Building CXX object 3rdparty/libprocess/src/tests/CMakeFiles/libprocess-tests.dir/sequence_tests.cpp.o
cd /BUILD/3rdparty/libprocess/src/tests && /usr/bin/c++ -DBUILD_DIR=\"/BUILD/3rdparty/libprocess/src/tests\" -DHAVE_LIBZ -DLIBDIR=\"/usr/local/lib\" -DPKGDATADIR=\"/usr/local/share/mesos\" -DPKGLIBEXECDIR=\"/usr/local/libexec/mesos\" -DVERSION=\"1.12.0\" -D__STDC_FORMAT_MACROS -I/BUILD/3rdparty/libprocess/src/tests -I/tmp/SRC/3rdparty/libprocess/src/tests/.. -I/tmp/SRC/3rdparty/libprocess/src/../include -I/tmp/SRC/3rdparty/stout/include -I/BUILD/3rdparty/boost-1.81.0/src/boost-1.81.0 -I/BUILD/3rdparty/elfio-3.2/src/elfio-3.2 -I/BUILD/3rdparty/picojson-1.3.0/src/picojson-1.3.0 -I/BUILD/3rdparty/rapidjson-1.1.0/src/rapidjson-1.1.0/include -I/usr/include/subversion-1 -I/BUILD/3rdparty/grpc-1.11.1/src/grpc-1.11.1/include -isystem /usr/include/apr-1.0 -isystem /BUILD/3rdparty/glog-0.4.0/src/glog-0.4.0-install/include -isystem /BUILD/3rdparty/libarchive-3.3.2/src/libarchive-3.3.2-build/include -isystem /BUILD/3rdparty/protobuf-3.5.0/src/protobuf-3.5.0/src -isystem /BUILD/3rdparty/http_parser-2.6.2/src/http_parser-2.6.2 -isystem /BUILD/3rdparty/googletest-1.8.0/src/googletest-1.8.0/googlemock/include -isystem /BUILD/3rdparty/googletest-1.8.0/src/googletest-1.8.0/googletest/include -O3 -DNDEBUG -fPIE -Wall -Wsign-compare -Wformat-security -fstack-protector-strong -Wno-unused-local-typedefs -std=c++11 -o CMakeFiles/libprocess-tests.dir/rwlock_tests.cpp.o -c /tmp/SRC/3rdparty/libprocess/src/tests/rwlock_tests.cpp
cd /BUILD/3rdparty/libprocess/src/tests && /usr/bin/c++ -DBUILD_DIR=\"/BUILD/3rdparty/libprocess/src/tests\" -DHAVE_LIBZ -DLIBDIR=\"/usr/local/lib\" -DPKGDATADIR=\"/usr/local/share/mesos\" -DPKGLIBEXECDIR=\"/usr/local/libexec/mesos\" -DVERSION=\"1.12.0\" -D__STDC_FORMAT_MACROS -I/BUILD/3rdparty/libprocess/src/tests -I/tmp/SRC/3rdparty/libprocess/src/tests/.. -I/tmp/SRC/3rdparty/libprocess/src/../include -I/tmp/SRC/3rdparty/stout/include -I/BUILD/3rdparty/boost-1.81.0/src/boost-1.81.0 -I/BUILD/3rdparty/elfio-3.2/src/elfio-3.2 -I/BUILD/3rdparty/picojson-1.3.0/src/picojson-1.3.0 -I/BUILD/3rdparty/rapidjson-1.1.0/src/rapidjson-1.1.0/include -I/usr/include/subversion-1 -I/BUILD/3rdparty/grpc-1.11.1/src/grpc-1.11.1/include -isystem /usr/include/apr-1.0 -isystem /BUILD/3rdparty/glog-0.4.0/src/glog-0.4.0-install/include -isystem /BUILD/3rdparty/libarchive-3.3.2/src/libarchive-3.3.2-build/include -isystem /BUILD/3rdparty/protobuf-3.5.0/src/protobuf-3.5.0/src -isystem /BUILD/3rdparty/http_parser-2.6.2/src/http_parser-2.6.2 -isystem /BUILD/3rdparty/googletest-1.8.0/src/googletest-1.8.0/googlemock/include -isystem /BUILD/3rdparty/googletest-1.8.0/src/googletest-1.8.0/googletest/include -O3 -DNDEBUG -fPIE -Wall -Wsign-compare -Wformat-security -fstack-protector-strong -Wno-unused-local-typedefs -std=c++11 -o CMakeFiles/libprocess-tests.dir/sequence_tests.cpp.o -c /tmp/SRC/3rdparty/libprocess/src/tests/sequence_tests.cpp
[ 94%] Building CXX object 3rdparty/libprocess/src/tests/CMakeFiles/libprocess-tests.dir/shared_tests.cpp.o
cd /BUILD/3rdparty/libprocess/src/tests && /usr/bin/c++ -DBUILD_DIR=\"/BUILD/3rdparty/libprocess/src/tests\" -DHAVE_LIBZ -DLIBDIR=\"/usr/local/lib\" -DPKGDATADIR=\"/usr/local/share/mesos\" -DPKGLIBEXECDIR=\"/usr/local/libexec/mesos\" -DVERSION=\"1.12.0\" -D__STDC_FORMAT_MACROS -I/BUILD/3rdparty/libprocess/src/tests -I/tmp/SRC/3rdparty/libprocess/src/tests/.. -I/tmp/SRC/3rdparty/libprocess/src/../include -I/tmp/SRC/3rdparty/stout/include -I/BUILD/3rdparty/boost-1.81.0/src/boost-1.81.0 -I/BUILD/3rdparty/elfio-3.2/src/elfio-3.2 -I/BUILD/3rdparty/picojson-1.3.0/src/picojson-1.3.0 -I/BUILD/3rdparty/rapidjson-1.1.0/src/rapidjson-1.1.0/include -I/usr/include/subversion-1 -I/BUILD/3rdparty/grpc-1.11.1/src/grpc-1.11.1/include -isystem /usr/include/apr-1.0 -isystem /BUILD/3rdparty/glog-0.4.0/src/glog-0.4.0-install/include -isystem /BUILD/3rdparty/libarchive-3.3.2/src/libarchive-3.3.2-build/include -isystem /BUILD/3rdparty/protobuf-3.5.0/src/protobuf-3.5.0/src -isystem /BUILD/3rdparty/http_parser-2.6.2/src/http_parser-2.6.2 -isystem /BUILD/3rdparty/googletest-1.8.0/src/googletest-1.8.0/googlemock/include -isystem /BUILD/3rdparty/googletest-1.8.0/src/googletest-1.8.0/googletest/include -O3 -DNDEBUG -fPIE -Wall -Wsign-compare -Wformat-security -fstack-protector-strong -Wno-unused-local-typedefs -std=c++11 -o CMakeFiles/libprocess-tests.dir/shared_tests.cpp.o -c /tmp/SRC/3rdparty/libprocess/src/tests/shared_tests.cpp
[ 94%] Building CXX object 3rdparty/libprocess/src/tests/CMakeFiles/libprocess-tests.dir/socket_tests.cpp.o
cd /BUILD/3rdparty/libprocess/src/tests && /usr/bin/c++ -DBUILD_DIR=\"/BUILD/3rdparty/libprocess/src/tests\" -DHAVE_LIBZ -DLIBDIR=\"/usr/local/lib\" -DPKGDATADIR=\"/usr/local/share/mesos\" -DPKGLIBEXECDIR=\"/usr/local/libexec/mesos\" -DVERSION=\"1.12.0\" -D__STDC_FORMAT_MACROS -I/BUILD/3rdparty/libprocess/src/tests -I/tmp/SRC/3rdparty/libprocess/src/tests/.. -I/tmp/SRC/3rdparty/libprocess/src/../include -I/tmp/SRC/3rdparty/stout/include -I/BUILD/3rdparty/boost-1.81.0/src/boost-1.81.0 -I/BUILD/3rdparty/elfio-3.2/src/elfio-3.2 -I/BUILD/3rdparty/picojson-1.3.0/src/picojson-1.3.0 -I/BUILD/3rdparty/rapidjson-1.1.0/src/rapidjson-1.1.0/include -I/usr/include/subversion-1 -I/BUILD/3rdparty/grpc-1.11.1/src/grpc-1.11.1/include -isystem /usr/include/apr-1.0 -isystem /BUILD/3rdparty/glog-0.4.0/src/glog-0.4.0-install/include -isystem /BUILD/3rdparty/libarchive-3.3.2/src/libarchive-3.3.2-build/include -isystem /BUILD/3rdparty/protobuf-3.5.0/src/protobuf-3.5.0/src -isystem /BUILD/3rdparty/http_parser-2.6.2/src/http_parser-2.6.2 -isystem /BUILD/3rdparty/googletest-1.8.0/src/googletest-1.8.0/googlemock/include -isystem /BUILD/3rdparty/googletest-1.8.0/src/googletest-1.8.0/googletest/include -O3 -DNDEBUG -fPIE -Wall -Wsign-compare -Wformat-security -fstack-protector-strong -Wno-unused-local-typedefs -std=c++11 -o CMakeFiles/libprocess-tests.dir/socket_tests.cpp.o -c /tmp/SRC/3rdparty/libprocess/src/tests/socket_tests.cpp
[ 94%] Building CXX object 3rdparty/libprocess/src/tests/CMakeFiles/libprocess-tests.dir/state_machine_tests.cpp.o
cd /BUILD/3rdparty/libprocess/src/tests && /usr/bin/c++ -DBUILD_DIR=\"/BUILD/3rdparty/libprocess/src/tests\" -DHAVE_LIBZ -DLIBDIR=\"/usr/local/lib\" -DPKGDATADIR=\"/usr/local/share/mesos\" -DPKGLIBEXECDIR=\"/usr/local/libexec/mesos\" -DVERSION=\"1.12.0\" -D__STDC_FORMAT_MACROS -I/BUILD/3rdparty/libprocess/src/tests -I/tmp/SRC/3rdparty/libprocess/src/tests/.. -I/tmp/SRC/3rdparty/libprocess/src/../include -I/tmp/SRC/3rdparty/stout/include -I/BUILD/3rdparty/boost-1.81.0/src/boost-1.81.0 -I/BUILD/3rdparty/elfio-3.2/src/elfio-3.2 -I/BUILD/3rdparty/picojson-1.3.0/src/picojson-1.3.0 -I/BUILD/3rdparty/rapidjson-1.1.0/src/rapidjson-1.1.0/include -I/usr/include/subversion-1 -I/BUILD/3rdparty/grpc-1.11.1/src/grpc-1.11.1/include -isystem /usr/include/apr-1.0 -isystem /BUILD/3rdparty/glog-0.4.0/src/glog-0.4.0-install/include -isystem /BUILD/3rdparty/libarchive-3.3.2/src/libarchive-3.3.2-build/include -isystem /BUILD/3rdparty/protobuf-3.5.0/src/protobuf-3.5.0/src -isystem /BUILD/3rdparty/http_parser-2.6.2/src/http_parser-2.6.2 -isystem /BUILD/3rdparty/googletest-1.8.0/src/googletest-1.8.0/googlemock/include -isystem /BUILD/3rdparty/googletest-1.8.0/src/googletest-1.8.0/googletest/include -O3 -DNDEBUG -fPIE -Wall -Wsign-compare -Wformat-security -fstack-protector-strong -Wno-unused-local-typedefs -std=c++11 -o CMakeFiles/libprocess-tests.dir/state_machine_tests.cpp.o -c /tmp/SRC/3rdparty/libprocess/src/tests/state_machine_tests.cpp
[ 94%] Building CXX object 3rdparty/libprocess/src/tests/CMakeFiles/libprocess-tests.dir/statistics_tests.cpp.o
cd /BUILD/3rdparty/libprocess/src/tests && /usr/bin/c++ -DBUILD_DIR=\"/BUILD/3rdparty/libprocess/src/tests\" -DHAVE_LIBZ -DLIBDIR=\"/usr/local/lib\" -DPKGDATADIR=\"/usr/local/share/mesos\" -DPKGLIBEXECDIR=\"/usr/local/libexec/mesos\" -DVERSION=\"1.12.0\" -D__STDC_FORMAT_MACROS -I/BUILD/3rdparty/libprocess/src/tests -I/tmp/SRC/3rdparty/libprocess/src/tests/.. -I/tmp/SRC/3rdparty/libprocess/src/../include -I/tmp/SRC/3rdparty/stout/include -I/BUILD/3rdparty/boost-1.81.0/src/boost-1.81.0 -I/BUILD/3rdparty/elfio-3.2/src/elfio-3.2 -I/BUILD/3rdparty/picojson-1.3.0/src/picojson-1.3.0 -I/BUILD/3rdparty/rapidjson-1.1.0/src/rapidjson-1.1.0/include -I/usr/include/subversion-1 -I/BUILD/3rdparty/grpc-1.11.1/src/grpc-1.11.1/include -isystem /usr/include/apr-1.0 -isystem /BUILD/3rdparty/glog-0.4.0/src/glog-0.4.0-install/include -isystem /BUILD/3rdparty/libarchive-3.3.2/src/libarchive-3.3.2-build/include -isystem /BUILD/3rdparty/protobuf-3.5.0/src/protobuf-3.5.0/src -isystem /BUILD/3rdparty/http_parser-2.6.2/src/http_parser-2.6.2 -isystem /BUILD/3rdparty/googletest-1.8.0/src/googletest-1.8.0/googlemock/include -isystem /BUILD/3rdparty/googletest-1.8.0/src/googletest-1.8.0/googletest/include -O3 -DNDEBUG -fPIE -Wall -Wsign-compare -Wformat-security -fstack-protector-strong -Wno-unused-local-typedefs -std=c++11 -o CMakeFiles/libprocess-tests.dir/statistics_tests.cpp.o -c /tmp/SRC/3rdparty/libprocess/src/tests/statistics_tests.cpp
[ 94%] Building CXX object 3rdparty/libprocess/src/tests/CMakeFiles/libprocess-tests.dir/subprocess_tests.cpp.o
cd /BUILD/3rdparty/libprocess/src/tests && /usr/bin/c++ -DBUILD_DIR=\"/BUILD/3rdparty/libprocess/src/tests\" -DHAVE_LIBZ -DLIBDIR=\"/usr/local/lib\" -DPKGDATADIR=\"/usr/local/share/mesos\" -DPKGLIBEXECDIR=\"/usr/local/libexec/mesos\" -DVERSION=\"1.12.0\" -D__STDC_FORMAT_MACROS -I/BUILD/3rdparty/libprocess/src/tests -I/tmp/SRC/3rdparty/libprocess/src/tests/.. -I/tmp/SRC/3rdparty/libprocess/src/../include -I/tmp/SRC/3rdparty/stout/include -I/BUILD/3rdparty/boost-1.81.0/src/boost-1.81.0 -I/BUILD/3rdparty/elfio-3.2/src/elfio-3.2 -I/BUILD/3rdparty/picojson-1.3.0/src/picojson-1.3.0 -I/BUILD/3rdparty/rapidjson-1.1.0/src/rapidjson-1.1.0/include -I/usr/include/subversion-1 -I/BUILD/3rdparty/grpc-1.11.1/src/grpc-1.11.1/include -isystem /usr/include/apr-1.0 -isystem /BUILD/3rdparty/glog-0.4.0/src/glog-0.4.0-install/include -isystem /BUILD/3rdparty/libarchive-3.3.2/src/libarchive-3.3.2-build/include -isystem /BUILD/3rdparty/protobuf-3.5.0/src/protobuf-3.5.0/src -isystem /BUILD/3rdparty/http_parser-2.6.2/src/http_parser-2.6.2 -isystem /BUILD/3rdparty/googletest-1.8.0/src/googletest-1.8.0/googlemock/include -isystem /BUILD/3rdparty/googletest-1.8.0/src/googletest-1.8.0/googletest/include -O3 -DNDEBUG -fPIE -Wall -Wsign-compare -Wformat-security -fstack-protector-strong -Wno-unused-local-typedefs -std=c++11 -o CMakeFiles/libprocess-tests.dir/subprocess_tests.cpp.o -c /tmp/SRC/3rdparty/libprocess/src/tests/subprocess_tests.cpp
[100%] Building CXX object 3rdparty/libprocess/src/tests/CMakeFiles/libprocess-tests.dir/system_tests.cpp.o
cd /BUILD/3rdparty/libprocess/src/tests && /usr/bin/c++ -DBUILD_DIR=\"/BUILD/3rdparty/libprocess/src/tests\" -DHAVE_LIBZ -DLIBDIR=\"/usr/local/lib\" -DPKGDATADIR=\"/usr/local/share/mesos\" -DPKGLIBEXECDIR=\"/usr/local/libexec/mesos\" -DVERSION=\"1.12.0\" -D__STDC_FORMAT_MACROS -I/BUILD/3rdparty/libprocess/src/tests -I/tmp/SRC/3rdparty/libprocess/src/tests/.. -I/tmp/SRC/3rdparty/libprocess/src/../include -I/tmp/SRC/3rdparty/stout/include -I/BUILD/3rdparty/boost-1.81.0/src/boost-1.81.0 -I/BUILD/3rdparty/elfio-3.2/src/elfio-3.2 -I/BUILD/3rdparty/picojson-1.3.0/src/picojson-1.3.0 -I/BUILD/3rdparty/rapidjson-1.1.0/src/rapidjson-1.1.0/include -I/usr/include/subversion-1 -I/BUILD/3rdparty/grpc-1.11.1/src/grpc-1.11.1/include -isystem /usr/include/apr-1.0 -isystem /BUILD/3rdparty/glog-0.4.0/src/glog-0.4.0-install/include -isystem /BUILD/3rdparty/libarchive-3.3.2/src/libarchive-3.3.2-build/include -isystem /BUILD/3rdparty/protobuf-3.5.0/src/protobuf-3.5.0/src -isystem /BUILD/3rdparty/http_parser-2.6.2/src/http_parser-2.6.2 -isystem /BUILD/3rdparty/googletest-1.8.0/src/googletest-1.8.0/googlemock/include -isystem /BUILD/3rdparty/googletest-1.8.0/src/googletest-1.8.0/googletest/include -O3 -DNDEBUG -fPIE -Wall -Wsign-compare -Wformat-security -fstack-protector-strong -Wno-unused-local-typedefs -std=c++11 -o CMakeFiles/libprocess-tests.dir/system_tests.cpp.o -c /tmp/SRC/3rdparty/libprocess/src/tests/system_tests.cpp
[100%] Building CXX object 3rdparty/libprocess/src/tests/CMakeFiles/libprocess-tests.dir/time_tests.cpp.o
cd /BUILD/3rdparty/libprocess/src/tests && /usr/bin/c++ -DBUILD_DIR=\"/BUILD/3rdparty/libprocess/src/tests\" -DHAVE_LIBZ -DLIBDIR=\"/usr/local/lib\" -DPKGDATADIR=\"/usr/local/share/mesos\" -DPKGLIBEXECDIR=\"/usr/local/libexec/mesos\" -DVERSION=\"1.12.0\" -D__STDC_FORMAT_MACROS -I/BUILD/3rdparty/libprocess/src/tests -I/tmp/SRC/3rdparty/libprocess/src/tests/.. -I/tmp/SRC/3rdparty/libprocess/src/../include -I/tmp/SRC/3rdparty/stout/include -I/BUILD/3rdparty/boost-1.81.0/src/boost-1.81.0 -I/BUILD/3rdparty/elfio-3.2/src/elfio-3.2 -I/BUILD/3rdparty/picojson-1.3.0/src/picojson-1.3.0 -I/BUILD/3rdparty/rapidjson-1.1.0/src/rapidjson-1.1.0/include -I/usr/include/subversion-1 -I/BUILD/3rdparty/grpc-1.11.1/src/grpc-1.11.1/include -isystem /usr/include/apr-1.0 -isystem /BUILD/3rdparty/glog-0.4.0/src/glog-0.4.0-install/include -isystem /BUILD/3rdparty/libarchive-3.3.2/src/libarchive-3.3.2-build/include -isystem /BUILD/3rdparty/protobuf-3.5.0/src/protobuf-3.5.0/src -isystem /BUILD/3rdparty/http_parser-2.6.2/src/http_parser-2.6.2 -isystem /BUILD/3rdparty/googletest-1.8.0/src/googletest-1.8.0/googlemock/include -isystem /BUILD/3rdparty/googletest-1.8.0/src/googletest-1.8.0/googletest/include -O3 -DNDEBUG -fPIE -Wall -Wsign-compare -Wformat-security -fstack-protector-strong -Wno-unused-local-typedefs -std=c++11 -o CMakeFiles/libprocess-tests.dir/time_tests.cpp.o -c /tmp/SRC/3rdparty/libprocess/src/tests/time_tests.cpp
[100%] Building CXX object 3rdparty/libprocess/src/tests/CMakeFiles/libprocess-tests.dir/timeseries_tests.cpp.o
cd /BUILD/3rdparty/libprocess/src/tests && /usr/bin/c++ -DBUILD_DIR=\"/BUILD/3rdparty/libprocess/src/tests\" -DHAVE_LIBZ -DLIBDIR=\"/usr/local/lib\" -DPKGDATADIR=\"/usr/local/share/mesos\" -DPKGLIBEXECDIR=\"/usr/local/libexec/mesos\" -DVERSION=\"1.12.0\" -D__STDC_FORMAT_MACROS -I/BUILD/3rdparty/libprocess/src/tests -I/tmp/SRC/3rdparty/libprocess/src/tests/.. -I/tmp/SRC/3rdparty/libprocess/src/../include -I/tmp/SRC/3rdparty/stout/include -I/BUILD/3rdparty/boost-1.81.0/src/boost-1.81.0 -I/BUILD/3rdparty/elfio-3.2/src/elfio-3.2 -I/BUILD/3rdparty/picojson-1.3.0/src/picojson-1.3.0 -I/BUILD/3rdparty/rapidjson-1.1.0/src/rapidjson-1.1.0/include -I/usr/include/subversion-1 -I/BUILD/3rdparty/grpc-1.11.1/src/grpc-1.11.1/include -isystem /usr/include/apr-1.0 -isystem /BUILD/3rdparty/glog-0.4.0/src/glog-0.4.0-install/include -isystem /BUILD/3rdparty/libarchive-3.3.2/src/libarchive-3.3.2-build/include -isystem /BUILD/3rdparty/protobuf-3.5.0/src/protobuf-3.5.0/src -isystem /BUILD/3rdparty/http_parser-2.6.2/src/http_parser-2.6.2 -isystem /BUILD/3rdparty/googletest-1.8.0/src/googletest-1.8.0/googlemock/include -isystem /BUILD/3rdparty/googletest-1.8.0/src/googletest-1.8.0/googletest/include -O3 -DNDEBUG -fPIE -Wall -Wsign-compare -Wformat-security -fstack-protector-strong -Wno-unused-local-typedefs -std=c++11 -o CMakeFiles/libprocess-tests.dir/timeseries_tests.cpp.o -c /tmp/SRC/3rdparty/libprocess/src/tests/timeseries_tests.cpp
[100%] Building CXX object 3rdparty/libprocess/src/tests/CMakeFiles/libprocess-tests.dir/reap_tests.cpp.o
cd /BUILD/3rdparty/libprocess/src/tests && /usr/bin/c++ -DBUILD_DIR=\"/BUILD/3rdparty/libprocess/src/tests\" -DHAVE_LIBZ -DLIBDIR=\"/usr/local/lib\" -DPKGDATADIR=\"/usr/local/share/mesos\" -DPKGLIBEXECDIR=\"/usr/local/libexec/mesos\" -DVERSION=\"1.12.0\" -D__STDC_FORMAT_MACROS -I/BUILD/3rdparty/libprocess/src/tests -I/tmp/SRC/3rdparty/libprocess/src/tests/.. -I/tmp/SRC/3rdparty/libprocess/src/../include -I/tmp/SRC/3rdparty/stout/include -I/BUILD/3rdparty/boost-1.81.0/src/boost-1.81.0 -I/BUILD/3rdparty/elfio-3.2/src/elfio-3.2 -I/BUILD/3rdparty/picojson-1.3.0/src/picojson-1.3.0 -I/BUILD/3rdparty/rapidjson-1.1.0/src/rapidjson-1.1.0/include -I/usr/include/subversion-1 -I/BUILD/3rdparty/grpc-1.11.1/src/grpc-1.11.1/include -isystem /usr/include/apr-1.0 -isystem /BUILD/3rdparty/glog-0.4.0/src/glog-0.4.0-install/include -isystem /BUILD/3rdparty/libarchive-3.3.2/src/libarchive-3.3.2-build/include -isystem /BUILD/3rdparty/protobuf-3.5.0/src/protobuf-3.5.0/src -isystem /BUILD/3rdparty/http_parser-2.6.2/src/http_parser-2.6.2 -isystem /BUILD/3rdparty/googletest-1.8.0/src/googletest-1.8.0/googlemock/include -isystem /BUILD/3rdparty/googletest-1.8.0/src/googletest-1.8.0/googletest/include -O3 -DNDEBUG -fPIE -Wall -Wsign-compare -Wformat-security -fstack-protector-strong -Wno-unused-local-typedefs -std=c++11 -o CMakeFiles/libprocess-tests.dir/reap_tests.cpp.o -c /tmp/SRC/3rdparty/libprocess/src/tests/reap_tests.cpp
[100%] Building CXX object 3rdparty/libprocess/src/tests/CMakeFiles/libprocess-tests.dir/grpc_tests.grpc.pb.cc.o
cd /BUILD/3rdparty/libprocess/src/tests && /usr/bin/c++ -DBUILD_DIR=\"/BUILD/3rdparty/libprocess/src/tests\" -DHAVE_LIBZ -DLIBDIR=\"/usr/local/lib\" -DPKGDATADIR=\"/usr/local/share/mesos\" -DPKGLIBEXECDIR=\"/usr/local/libexec/mesos\" -DVERSION=\"1.12.0\" -D__STDC_FORMAT_MACROS -I/BUILD/3rdparty/libprocess/src/tests -I/tmp/SRC/3rdparty/libprocess/src/tests/.. -I/tmp/SRC/3rdparty/libprocess/src/../include -I/tmp/SRC/3rdparty/stout/include -I/BUILD/3rdparty/boost-1.81.0/src/boost-1.81.0 -I/BUILD/3rdparty/elfio-3.2/src/elfio-3.2 -I/BUILD/3rdparty/picojson-1.3.0/src/picojson-1.3.0 -I/BUILD/3rdparty/rapidjson-1.1.0/src/rapidjson-1.1.0/include -I/usr/include/subversion-1 -I/BUILD/3rdparty/grpc-1.11.1/src/grpc-1.11.1/include -isystem /usr/include/apr-1.0 -isystem /BUILD/3rdparty/glog-0.4.0/src/glog-0.4.0-install/include -isystem /BUILD/3rdparty/libarchive-3.3.2/src/libarchive-3.3.2-build/include -isystem /BUILD/3rdparty/protobuf-3.5.0/src/protobuf-3.5.0/src -isystem /BUILD/3rdparty/http_parser-2.6.2/src/http_parser-2.6.2 -isystem /BUILD/3rdparty/googletest-1.8.0/src/googletest-1.8.0/googlemock/include -isystem /BUILD/3rdparty/googletest-1.8.0/src/googletest-1.8.0/googletest/include -O3 -DNDEBUG -fPIE -Wall -Wsign-compare -Wformat-security -fstack-protector-strong -Wno-unused-local-typedefs -std=c++11 -o CMakeFiles/libprocess-tests.dir/grpc_tests.grpc.pb.cc.o -c /BUILD/3rdparty/libprocess/src/tests/grpc_tests.grpc.pb.cc
[100%] Building CXX object 3rdparty/libprocess/src/tests/CMakeFiles/libprocess-tests.dir/grpc_tests.pb.cc.o
cd /BUILD/3rdparty/libprocess/src/tests && /usr/bin/c++ -DBUILD_DIR=\"/BUILD/3rdparty/libprocess/src/tests\" -DHAVE_LIBZ -DLIBDIR=\"/usr/local/lib\" -DPKGDATADIR=\"/usr/local/share/mesos\" -DPKGLIBEXECDIR=\"/usr/local/libexec/mesos\" -DVERSION=\"1.12.0\" -D__STDC_FORMAT_MACROS -I/BUILD/3rdparty/libprocess/src/tests -I/tmp/SRC/3rdparty/libprocess/src/tests/.. -I/tmp/SRC/3rdparty/libprocess/src/../include -I/tmp/SRC/3rdparty/stout/include -I/BUILD/3rdparty/boost-1.81.0/src/boost-1.81.0 -I/BUILD/3rdparty/elfio-3.2/src/elfio-3.2 -I/BUILD/3rdparty/picojson-1.3.0/src/picojson-1.3.0 -I/BUILD/3rdparty/rapidjson-1.1.0/src/rapidjson-1.1.0/include -I/usr/include/subversion-1 -I/BUILD/3rdparty/grpc-1.11.1/src/grpc-1.11.1/include -isystem /usr/include/apr-1.0 -isystem /BUILD/3rdparty/glog-0.4.0/src/glog-0.4.0-install/include -isystem /BUILD/3rdparty/libarchive-3.3.2/src/libarchive-3.3.2-build/include -isystem /BUILD/3rdparty/protobuf-3.5.0/src/protobuf-3.5.0/src -isystem /BUILD/3rdparty/http_parser-2.6.2/src/http_parser-2.6.2 -isystem /BUILD/3rdparty/googletest-1.8.0/src/googletest-1.8.0/googlemock/include -isystem /BUILD/3rdparty/googletest-1.8.0/src/googletest-1.8.0/googletest/include -O3 -DNDEBUG -fPIE -Wall -Wsign-compare -Wformat-security -fstack-protector-strong -Wno-unused-local-typedefs -std=c++11 -o CMakeFiles/libprocess-tests.dir/grpc_tests.pb.cc.o -c /BUILD/3rdparty/libprocess/src/tests/grpc_tests.pb.cc
[100%] Linking CXX executable libprocess-tests
cd /BUILD/3rdparty/libprocess/src/tests && /usr/local/bin/cmake -E cmake_link_script CMakeFiles/libprocess-tests.dir/link.txt --verbose=1
/usr/bin/c++ -O3 -DNDEBUG CMakeFiles/libprocess-tests.dir/main.cpp.o CMakeFiles/libprocess-tests.dir/after_tests.cpp.o CMakeFiles/libprocess-tests.dir/collect_tests.cpp.o CMakeFiles/libprocess-tests.dir/count_down_latch_tests.cpp.o CMakeFiles/libprocess-tests.dir/decoder_tests.cpp.o CMakeFiles/libprocess-tests.dir/encoder_tests.cpp.o CMakeFiles/libprocess-tests.dir/future_tests.cpp.o CMakeFiles/libprocess-tests.dir/grpc_tests.cpp.o CMakeFiles/libprocess-tests.dir/http_tests.cpp.o CMakeFiles/libprocess-tests.dir/io_tests.cpp.o CMakeFiles/libprocess-tests.dir/limiter_tests.cpp.o CMakeFiles/libprocess-tests.dir/loop_tests.cpp.o CMakeFiles/libprocess-tests.dir/metrics_tests.cpp.o CMakeFiles/libprocess-tests.dir/mpsc_linked_queue_tests.cpp.o CMakeFiles/libprocess-tests.dir/mutex_tests.cpp.o CMakeFiles/libprocess-tests.dir/owned_tests.cpp.o CMakeFiles/libprocess-tests.dir/process_tests.cpp.o CMakeFiles/libprocess-tests.dir/profiler_tests.cpp.o CMakeFiles/libprocess-tests.dir/queue_tests.cpp.o CMakeFiles/libprocess-tests.dir/rwlock_tests.cpp.o CMakeFiles/libprocess-tests.dir/sequence_tests.cpp.o CMakeFiles/libprocess-tests.dir/shared_tests.cpp.o CMakeFiles/libprocess-tests.dir/socket_tests.cpp.o CMakeFiles/libprocess-tests.dir/state_machine_tests.cpp.o CMakeFiles/libprocess-tests.dir/statistics_tests.cpp.o CMakeFiles/libprocess-tests.dir/subprocess_tests.cpp.o CMakeFiles/libprocess-tests.dir/system_tests.cpp.o CMakeFiles/libprocess-tests.dir/time_tests.cpp.o CMakeFiles/libprocess-tests.dir/timeseries_tests.cpp.o CMakeFiles/libprocess-tests.dir/reap_tests.cpp.o CMakeFiles/libprocess-tests.dir/grpc_tests.grpc.pb.cc.o CMakeFiles/libprocess-tests.dir/grpc_tests.pb.cc.o -o libprocess-tests -Wl,-rpath,/BUILD/3rdparty/libprocess/src:/BUILD/3rdparty/glog-0.4.0/src/glog-0.4.0-install/lib:/BUILD/3rdparty/protobuf-3.5.0/src/protobuf-3.5.0-build:/BUILD/3rdparty/grpc-1.11.1/src/grpc-1.11.1-build:/BUILD/3rdparty/libev-4.22/src/libev-4.22-build/lib ../libprocess.so /usr/lib/x86_64-linux-gnu/libapr-1.so ../../../glog-0.4.0/src/glog-0.4.0-install/lib/libglog.so ../../../libarchive-3.3.2/src/libarchive-3.3.2-build/lib/libarchive.a /usr/lib/x86_64-linux-gnu/libcurl.so ../../../protobuf-3.5.0/src/protobuf-3.5.0-build/libprotobuf.so -lpthread /usr/lib/x86_64-linux-gnu/libz.so -lrt -ldl /usr/lib/x86_64-linux-gnu/libsvn_delta-1.so /usr/lib/x86_64-linux-gnu/libsvn_diff-1.so /usr/lib/x86_64-linux-gnu/libsvn_subr-1.so ../../../http_parser-2.6.2/src/http_parser-2.6.2-build/libhttp_parser.a ../../../grpc-1.11.1/src/grpc-1.11.1-build/libgrpc++_unsecure.so ../../../grpc-1.11.1/src/grpc-1.11.1-build/libgrpc_unsecure.so ../../../grpc-1.11.1/src/grpc-1.11.1-build/libgpr.so ../../../googletest-1.8.0/src/googletest-1.8.0-build/googlemock/libgmock.a ../../../googletest-1.8.0/src/googletest-1.8.0-build/googlemock/gtest/libgtest.a -Wl,-rpath-link,/BUILD/3rdparty/libev-4.22/src/libev-4.22-build/lib
make[3]: Leaving directory '/BUILD'
[100%] Built target libprocess-tests
make[2]: Leaving directory '/BUILD'
/usr/local/bin/cmake -E cmake_progress_start /BUILD/CMakeFiles 0
make[1]: Leaving directory '/BUILD'
cd /BUILD && /usr/bin/make -f CMakeFiles/Makefile2 3rdparty/libprocess/src/tests/CMakeFiles/benchmarks.dir/rule
make[1]: Entering directory '/BUILD'
/usr/local/bin/cmake -S/tmp/SRC -B/BUILD --check-build-system CMakeFiles/Makefile.cmake 0
/usr/local/bin/cmake -E cmake_progress_start /BUILD/CMakeFiles 13
/usr/bin/make -f CMakeFiles/Makefile2 3rdparty/libprocess/src/tests/CMakeFiles/benchmarks.dir/all
make[2]: Entering directory '/BUILD'
/usr/bin/make -f 3rdparty/CMakeFiles/picojson-1.3.0.dir/build.make 3rdparty/CMakeFiles/picojson-1.3.0.dir/depend
/usr/bin/make -f 3rdparty/CMakeFiles/protobuf-3.5.0.dir/build.make 3rdparty/CMakeFiles/protobuf-3.5.0.dir/depend
/usr/bin/make -f 3rdparty/CMakeFiles/elfio-3.2.dir/build.make 3rdparty/CMakeFiles/elfio-3.2.dir/depend
/usr/bin/make -f 3rdparty/CMakeFiles/rapidjson-1.1.0.dir/build.make 3rdparty/CMakeFiles/rapidjson-1.1.0.dir/depend
/usr/bin/make -f 3rdparty/CMakeFiles/concurrentqueue-7b69a8f.dir/build.make 3rdparty/CMakeFiles/concurrentqueue-7b69a8f.dir/depend
/usr/bin/make -f 3rdparty/CMakeFiles/glog-0.4.0.dir/build.make 3rdparty/CMakeFiles/glog-0.4.0.dir/depend
make[3]: Entering directory '/BUILD'
cd /BUILD && /usr/local/bin/cmake -E cmake_depends "Unix Makefiles" /tmp/SRC /tmp/SRC/3rdparty /BUILD /BUILD/3rdparty /BUILD/3rdparty/CMakeFiles/picojson-1.3.0.dir/DependInfo.cmake --color=
/usr/bin/make -f 3rdparty/CMakeFiles/boost-1.81.0.dir/build.make 3rdparty/CMakeFiles/boost-1.81.0.dir/depend
/usr/bin/make -f 3rdparty/CMakeFiles/http_parser-2.6.2.dir/build.make 3rdparty/CMakeFiles/http_parser-2.6.2.dir/depend
make[3]: Entering directory '/BUILD'
cd /BUILD && /usr/local/bin/cmake -E cmake_depends "Unix Makefiles" /tmp/SRC /tmp/SRC/3rdparty /BUILD /BUILD/3rdparty /BUILD/3rdparty/CMakeFiles/protobuf-3.5.0.dir/DependInfo.cmake --color=
make[3]: Entering directory '/BUILD'
/usr/bin/make -f 3rdparty/CMakeFiles/libarchive-3.3.2.dir/build.make 3rdparty/CMakeFiles/libarchive-3.3.2.dir/depend
cd /BUILD && /usr/local/bin/cmake -E cmake_depends "Unix Makefiles" /tmp/SRC /tmp/SRC/3rdparty /BUILD /BUILD/3rdparty /BUILD/3rdparty/CMakeFiles/elfio-3.2.dir/DependInfo.cmake --color=
make[3]: Entering directory '/BUILD'
cd /BUILD && /usr/local/bin/cmake -E cmake_depends "Unix Makefiles" /tmp/SRC /tmp/SRC/3rdparty /BUILD /BUILD/3rdparty /BUILD/3rdparty/CMakeFiles/rapidjson-1.1.0.dir/DependInfo.cmake --color=
/usr/bin/make -f 3rdparty/CMakeFiles/libev-4.22.dir/build.make 3rdparty/CMakeFiles/libev-4.22.dir/depend
/usr/bin/make -f 3rdparty/CMakeFiles/googletest-1.8.0.dir/build.make 3rdparty/CMakeFiles/googletest-1.8.0.dir/depend
make[3]: Entering directory '/BUILD'
cd /BUILD && /usr/local/bin/cmake -E cmake_depends "Unix Makefiles" /tmp/SRC /tmp/SRC/3rdparty /BUILD /BUILD/3rdparty /BUILD/3rdparty/CMakeFiles/concurrentqueue-7b69a8f.dir/DependInfo.cmake --color=
make[3]: Entering directory '/BUILD'
cd /BUILD && /usr/local/bin/cmake -E cmake_depends "Unix Makefiles" /tmp/SRC /tmp/SRC/3rdparty /BUILD /BUILD/3rdparty /BUILD/3rdparty/CMakeFiles/glog-0.4.0.dir/DependInfo.cmake --color=
make[3]: Entering directory '/BUILD'
cd /BUILD && /usr/local/bin/cmake -E cmake_depends "Unix Makefiles" /tmp/SRC /tmp/SRC/3rdparty /BUILD /BUILD/3rdparty /BUILD/3rdparty/CMakeFiles/boost-1.81.0.dir/DependInfo.cmake --color=
make[3]: Entering directory '/BUILD'
cd /BUILD && /usr/local/bin/cmake -E cmake_depends "Unix Makefiles" /tmp/SRC /tmp/SRC/3rdparty /BUILD /BUILD/3rdparty /BUILD/3rdparty/CMakeFiles/http_parser-2.6.2.dir/DependInfo.cmake --color=
make[3]: Entering directory '/BUILD'
cd /BUILD && /usr/local/bin/cmake -E cmake_depends "Unix Makefiles" /tmp/SRC /tmp/SRC/3rdparty /BUILD /BUILD/3rdparty /BUILD/3rdparty/CMakeFiles/libarchive-3.3.2.dir/DependInfo.cmake --color=
make[3]: Entering directory '/BUILD'
cd /BUILD && /usr/local/bin/cmake -E cmake_depends "Unix Makefiles" /tmp/SRC /tmp/SRC/3rdparty /BUILD /BUILD/3rdparty /BUILD/3rdparty/CMakeFiles/googletest-1.8.0.dir/DependInfo.cmake --color=
make[3]: Entering directory '/BUILD'
cd /BUILD && /usr/local/bin/cmake -E cmake_depends "Unix Makefiles" /tmp/SRC /tmp/SRC/3rdparty /BUILD /BUILD/3rdparty /BUILD/3rdparty/CMakeFiles/libev-4.22.dir/DependInfo.cmake --color=
make[3]: Leaving directory '/BUILD'
/usr/bin/make -f 3rdparty/CMakeFiles/picojson-1.3.0.dir/build.make 3rdparty/CMakeFiles/picojson-1.3.0.dir/build
make[3]: Leaving directory '/BUILD'
/usr/bin/make -f 3rdparty/CMakeFiles/protobuf-3.5.0.dir/build.make 3rdparty/CMakeFiles/protobuf-3.5.0.dir/build
make[3]: Leaving directory '/BUILD'
make[3]: Leaving directory '/BUILD'
/usr/bin/make -f 3rdparty/CMakeFiles/elfio-3.2.dir/build.make 3rdparty/CMakeFiles/elfio-3.2.dir/build
make[3]: Leaving directory '/BUILD'
/usr/bin/make -f 3rdparty/CMakeFiles/rapidjson-1.1.0.dir/build.make 3rdparty/CMakeFiles/rapidjson-1.1.0.dir/build
/usr/bin/make -f 3rdparty/CMakeFiles/concurrentqueue-7b69a8f.dir/build.make 3rdparty/CMakeFiles/concurrentqueue-7b69a8f.dir/build
make[3]: Leaving directory '/BUILD'
make[3]: Leaving directory '/BUILD'
make[3]: Leaving directory '/BUILD'
/usr/bin/make -f 3rdparty/CMakeFiles/glog-0.4.0.dir/build.make 3rdparty/CMakeFiles/glog-0.4.0.dir/build
make[3]: Entering directory '/BUILD'
make[3]: Nothing to be done for '3rdparty/CMakeFiles/picojson-1.3.0.dir/build'.
make[3]: Leaving directory '/BUILD'
make[3]: Leaving directory '/BUILD'
/usr/bin/make -f 3rdparty/CMakeFiles/boost-1.81.0.dir/build.make 3rdparty/CMakeFiles/boost-1.81.0.dir/build
make[3]: Leaving directory '/BUILD'
make[3]: Entering directory '/BUILD'
make[3]: Nothing to be done for '3rdparty/CMakeFiles/protobuf-3.5.0.dir/build'.
make[3]: Leaving directory '/BUILD'
/usr/bin/make -f 3rdparty/CMakeFiles/http_parser-2.6.2.dir/build.make 3rdparty/CMakeFiles/http_parser-2.6.2.dir/build
/usr/bin/make -f 3rdparty/CMakeFiles/libarchive-3.3.2.dir/build.make 3rdparty/CMakeFiles/libarchive-3.3.2.dir/build
make[3]: Entering directory '/BUILD'
make[3]: Nothing to be done for '3rdparty/CMakeFiles/elfio-3.2.dir/build'.
make[3]: Leaving directory '/BUILD'
/usr/bin/make -f 3rdparty/CMakeFiles/googletest-1.8.0.dir/build.make 3rdparty/CMakeFiles/googletest-1.8.0.dir/build
make[3]: Leaving directory '/BUILD'
make[3]: Entering directory '/BUILD'
make[3]: Nothing to be done for '3rdparty/CMakeFiles/rapidjson-1.1.0.dir/build'.
make[3]: Leaving directory '/BUILD'
/usr/bin/make -f 3rdparty/CMakeFiles/libev-4.22.dir/build.make 3rdparty/CMakeFiles/libev-4.22.dir/build
make[3]: Entering directory '/BUILD'
make[3]: Nothing to be done for '3rdparty/CMakeFiles/concurrentqueue-7b69a8f.dir/build'.
make[3]: Leaving directory '/BUILD'
make[3]: Entering directory '/BUILD'
make[3]: Nothing to be done for '3rdparty/CMakeFiles/glog-0.4.0.dir/build'.
make[3]: Leaving directory '/BUILD'
make[3]: Entering directory '/BUILD'
make[3]: Nothing to be done for '3rdparty/CMakeFiles/boost-1.81.0.dir/build'.
make[3]: Leaving directory '/BUILD'
make[3]: Entering directory '/BUILD'
make[3]: Nothing to be done for '3rdparty/CMakeFiles/http_parser-2.6.2.dir/build'.
make[3]: Leaving directory '/BUILD'
make[3]: Entering directory '/BUILD'
make[3]: Nothing to be done for '3rdparty/CMakeFiles/googletest-1.8.0.dir/build'.
make[3]: Leaving directory '/BUILD'
make[3]: Entering directory '/BUILD'
make[3]: Nothing to be done for '3rdparty/CMakeFiles/libarchive-3.3.2.dir/build'.
make[3]: Leaving directory '/BUILD'
make[3]: Entering directory '/BUILD'
make[3]: Nothing to be done for '3rdparty/CMakeFiles/libev-4.22.dir/build'.
make[3]: Leaving directory '/BUILD'
[ 15%] Built target picojson-1.3.0
[ 15%] Built target elfio-3.2
[ 23%] Built target protobuf-3.5.0
[ 23%] Built target rapidjson-1.1.0
[ 38%] Built target concurrentqueue-7b69a8f
/usr/bin/make -f 3rdparty/CMakeFiles/grpc-1.11.1.dir/build.make 3rdparty/CMakeFiles/grpc-1.11.1.dir/depend
[ 46%] Built target glog-0.4.0
[ 46%] Built target boost-1.81.0
[ 53%] Built target http_parser-2.6.2
[ 69%] Built target libarchive-3.3.2
[ 69%] Built target googletest-1.8.0
[ 69%] Built target libev-4.22
make[3]: Entering directory '/BUILD'
cd /BUILD && /usr/local/bin/cmake -E cmake_depends "Unix Makefiles" /tmp/SRC /tmp/SRC/3rdparty /BUILD /BUILD/3rdparty /BUILD/3rdparty/CMakeFiles/grpc-1.11.1.dir/DependInfo.cmake --color=
make[3]: Leaving directory '/BUILD'
/usr/bin/make -f 3rdparty/CMakeFiles/grpc-1.11.1.dir/build.make 3rdparty/CMakeFiles/grpc-1.11.1.dir/build
make[3]: Entering directory '/BUILD'
make[3]: Nothing to be done for '3rdparty/CMakeFiles/grpc-1.11.1.dir/build'.
make[3]: Leaving directory '/BUILD'
[ 76%] Built target grpc-1.11.1
/usr/bin/make -f 3rdparty/libprocess/src/CMakeFiles/process.dir/build.make 3rdparty/libprocess/src/CMakeFiles/process.dir/depend
make[3]: Entering directory '/BUILD'
cd /BUILD && /usr/local/bin/cmake -E cmake_depends "Unix Makefiles" /tmp/SRC /tmp/SRC/3rdparty/libprocess/src /BUILD /BUILD/3rdparty/libprocess/src /BUILD/3rdparty/libprocess/src/CMakeFiles/process.dir/DependInfo.cmake --color=
make[3]: Leaving directory '/BUILD'
/usr/bin/make -f 3rdparty/libprocess/src/CMakeFiles/process.dir/build.make 3rdparty/libprocess/src/CMakeFiles/process.dir/build
make[3]: Entering directory '/BUILD'
make[3]: Nothing to be done for '3rdparty/libprocess/src/CMakeFiles/process.dir/build'.
make[3]: Leaving directory '/BUILD'
[100%] Built target process
/usr/bin/make -f 3rdparty/libprocess/src/tests/CMakeFiles/benchmarks.dir/build.make 3rdparty/libprocess/src/tests/CMakeFiles/benchmarks.dir/depend
make[3]: Entering directory '/BUILD'
cd /BUILD && /usr/local/bin/cmake -E cmake_depends "Unix Makefiles" /tmp/SRC /tmp/SRC/3rdparty/libprocess/src/tests /BUILD /BUILD/3rdparty/libprocess/src/tests /BUILD/3rdparty/libprocess/src/tests/CMakeFiles/benchmarks.dir/DependInfo.cmake --color=
make[3]: Leaving directory '/BUILD'
/usr/bin/make -f 3rdparty/libprocess/src/tests/CMakeFiles/benchmarks.dir/build.make 3rdparty/libprocess/src/tests/CMakeFiles/benchmarks.dir/build
make[3]: Entering directory '/BUILD'
make[3]: Nothing to be done for '3rdparty/libprocess/src/tests/CMakeFiles/benchmarks.dir/build'.
make[3]: Leaving directory '/BUILD'
[100%] Built target benchmarks
make[2]: Leaving directory '/BUILD'
/usr/local/bin/cmake -E cmake_progress_start /BUILD/CMakeFiles 0
make[1]: Leaving directory '/BUILD'
/tmp/SRC/src/linux/cgroups2.cpp:1213:7: warning: Value stored to 'jmp_size' is never read [clang-analyzer-deadcode.DeadStores]
jmp_size -= 3;
^
/tmp/SRC/src/linux/cgroups2.cpp:1213:7: note: Value stored to 'jmp_size' is never read
Untagged: mesos/mesos-tidy:latest
Untagged: mesos/mesos-tidy@sha256:53069d5c97c350c8e34aa35beda3f31115f40408c035a1e0d2b5333548e2d5ea
Deleted: sha256:0de0b84fb66c41087630b544b7e11adcd54f06e60086d739064b7bc9a81b5de4
Deleted: sha256:040a6c17b441f5e894164fcf0781086ad15fc9da68b8581e990c2a733d3f4024
Deleted: sha256:121cbcd3e50b7d3b1141bb8d7a94689d6e42c3788134b8fa468dbe9be6b7b172
Deleted: sha256:445acabe8b6bad160ffbcbf5ade85353a51afa1afb466e047e3d73b07d1f441a
Deleted: sha256:5d26559e81cbc9fbb95e88569354fcba11f83db259dd1aaca4e618fd007833b1
Deleted: sha256:0d710e6a7af7fc371f237eb80dd3ce820ae428d2ee2518f58692500e79185704
Deleted: sha256:ac6a1fdf61585e87b069f9f53e6f3d2cf57cf1752d688722665e598648ff6de3
Deleted: sha256:1f98a22c0f5a34eec222429b74401fb5fa74b1b3b0d59372a342b96969bdb5fe
Deleted: sha256:0efaad81063a1aa78430494fb898e4ad160163f86ad7e0cd31ec316182e0b258
Deleted: sha256:3ec3ded77c0ce89e931f92aed086b2a2c774a6fbd51617853decc8afa4e1087a
Build step 'Execute shell' marked build as failure