You are viewing a plain text version of this content. The canonical link for it is here.
Posted to notifications@maven.apache.org by Apache Jenkins Server <je...@builds.apache.org> on 2018/07/21 05:20:39 UTC

Build failed in Jenkins: Maven TLP » maven-enforcer » MENFORCER-276 #6

See https://builds.apache.org/job/maven-box/job/maven-enforcer/job/MENFORCER-276/6/

Changes:

* Add jenkinsEnv#nodeSelection to globally finetune node selection
* Try another expression
* INFRA-16749, INFRA-16768  - Trying to keep workspace clean
* INFRA-16749, INFRA-16768  - Followup
* INFRA-16749, INFRA-16768  - Followup temporarily failFast = false.
* Used the wrong comment style.
* Exclude ubuntu-eu2 due to lack of disk space
* Apply jenkinsEnv.nodeSelection

No tests ran.

Build log:
[...truncated 2.13 MB...]
[windows-jdk10] [INFO] Downloaded: https://repo.maven.apache.org/maven2/com/thoughtworks/qdox/qdox/2.0-M7/qdox-2.0-M7.jar (315 kB at 1.6 MB/s)
[windows-jdk10] [INFO] Downloading: https://repo.maven.apache.org/maven2/org/apache/maven/shared/maven-shared-incremental/1.1/maven-shared-incremental-1.1.jar
[windows-jdk10] [INFO] Downloaded: https://repo.maven.apache.org/maven2/org/apache/maven/shared/maven-shared-incremental/1.1/maven-shared-incremental-1.1.jar (14 kB at 40 kB/s)
[windows-jdk10] [INFO] Downloaded: https://repo.maven.apache.org/maven2/org/codehaus/plexus/plexus-compiler-api/2.8.2/plexus-compiler-api-2.8.2.jar (26 kB at 74 kB/s)
[windows-jdk10] [INFO] Changes detected - recompiling the module!
[windows-jdk10] [INFO] Compiling 5 source files to F:\jenkins\jenkins-slave\workspace\aven-enforcer_MENFORCER-276-ARAEEUQ3DZKGP7LK65FX6C75KHKIJYNAPASQYCZKRS4IVUWL44FA\m\enforcer-api\target\classes
[windows-jdk10] [INFO] 
[windows-jdk10] [INFO] --- maven-resources-plugin:3.0.2:testResources (default-testResources) @ enforcer-api ---
[windows-jdk10] [INFO] Using 'UTF-8' encoding to copy filtered resources.
[windows-jdk10] [INFO] skip non existing resourceDirectory F:\jenkins\jenkins-slave\workspace\aven-enforcer_MENFORCER-276-ARAEEUQ3DZKGP7LK65FX6C75KHKIJYNAPASQYCZKRS4IVUWL44FA\m\enforcer-api\src\test\resources
[windows-jdk10] [INFO] Copying 3 resources
[windows-jdk10] [INFO] 
[windows-jdk10] [INFO] --- maven-compiler-plugin:3.7.0:testCompile (default-testCompile) @ enforcer-api ---
[windows-jdk10] [INFO] No sources to compile
[windows-jdk10] [INFO] 
[windows-jdk10] [INFO] --- maven-surefire-plugin:2.21.0:test (default-test) @ enforcer-api ---
[windows-jdk10] [INFO] Downloading: https://repo.maven.apache.org/maven2/org/apache/maven/surefire/maven-surefire-common/2.21.0/maven-surefire-common-2.21.0.pom
[windows-jdk10] [INFO] Downloaded: https://repo.maven.apache.org/maven2/org/apache/maven/surefire/maven-surefire-common/2.21.0/maven-surefire-common-2.21.0.pom (11 kB at 1.4 MB/s)
[windows-jdk10] [INFO] Downloading: https://repo.maven.apache.org/maven2/org/apache/maven/plugin-tools/maven-plugin-annotations/3.5/maven-plugin-annotations-3.5.pom
[windows-jdk10] [INFO] Downloaded: https://repo.maven.apache.org/maven2/org/apache/maven/plugin-tools/maven-plugin-annotations/3.5/maven-plugin-annotations-3.5.pom (1.7 kB at 152 kB/s)
[windows-jdk10] [INFO] Downloading: https://repo.maven.apache.org/maven2/org/apache/maven/plugin-tools/maven-plugin-tools/3.5/maven-plugin-tools-3.5.pom
[windows-jdk10] [INFO] Downloaded: https://repo.maven.apache.org/maven2/org/apache/maven/plugin-tools/maven-plugin-tools/3.5/maven-plugin-tools-3.5.pom (16 kB at 2.3 MB/s)
[windows-jdk10] [INFO] Downloading: https://repo.maven.apache.org/maven2/org/apache/maven/surefire/surefire-api/2.21.0/surefire-api-2.21.0.pom
[windows-jdk10] [INFO] Downloaded: https://repo.maven.apache.org/maven2/org/apache/maven/surefire/surefire-api/2.21.0/surefire-api-2.21.0.pom (3.5 kB at 590 kB/s)
[windows-jdk10] [INFO] Downloading: https://repo.maven.apache.org/maven2/org/apache/maven/surefire/surefire-logger-api/2.21.0/surefire-logger-api-2.21.0.pom
[windows-jdk10] [INFO] Downloaded: https://repo.maven.apache.org/maven2/org/apache/maven/surefire/surefire-logger-api/2.21.0/surefire-logger-api-2.21.0.pom (2.0 kB at 28 kB/s)
[windows-jdk10] [INFO] Downloading: https://repo.maven.apache.org/maven2/org/apache/maven/surefire/surefire-booter/2.21.0/surefire-booter-2.21.0.pom
[windows-jdk10] [INFO] Downloaded: https://repo.maven.apache.org/maven2/org/apache/maven/surefire/surefire-booter/2.21.0/surefire-booter-2.21.0.pom (7.4 kB at 433 kB/s)
[windows-jdk10] [INFO] Downloading: https://repo.maven.apache.org/maven2/org/apache/maven/maven-toolchain/2.2.1/maven-toolchain-2.2.1.pom
[windows-jdk10] [INFO] Downloaded: https://repo.maven.apache.org/maven2/org/apache/maven/maven-toolchain/2.2.1/maven-toolchain-2.2.1.pom (3.3 kB at 257 kB/s)
[windows-jdk10] [INFO] Downloading: https://repo.maven.apache.org/maven2/org/codehaus/plexus/plexus-java/0.9.3/plexus-java-0.9.3.pom
[windows-jdk10] [INFO] Downloaded: https://repo.maven.apache.org/maven2/org/codehaus/plexus/plexus-java/0.9.3/plexus-java-0.9.3.pom (2.4 kB at 91 kB/s)
[windows-jdk10] [INFO] Downloading: https://repo.maven.apache.org/maven2/org/codehaus/plexus/plexus-languages/0.9.3/plexus-languages-0.9.3.pom
[windows-jdk10] [INFO] Downloaded: https://repo.maven.apache.org/maven2/org/codehaus/plexus/plexus-languages/0.9.3/plexus-languages-0.9.3.pom (2.2 kB at 105 kB/s)
[windows-jdk10] [INFO] Downloading: https://repo.maven.apache.org/maven2/org/apache/maven/surefire/surefire-booter/2.21.0/surefire-booter-2.21.0.jar
[windows-jdk10] [INFO] Downloading: https://repo.maven.apache.org/maven2/org/apache/maven/surefire/maven-surefire-common/2.21.0/maven-surefire-common-2.21.0.jar
[windows-jdk10] [INFO] Downloading: https://repo.maven.apache.org/maven2/org/apache/maven/plugin-tools/maven-plugin-annotations/3.5/maven-plugin-annotations-3.5.jar
[windows-jdk10] [INFO] Downloaded: https://repo.maven.apache.org/maven2/org/apache/maven/surefire/surefire-booter/2.21.0/surefire-booter-2.21.0.jar (273 kB at 17 MB/s)
[windows-jdk10] [INFO] Downloading: https://repo.maven.apache.org/maven2/junit/junit/4.12/junit-4.12.jar
[windows-jdk10] [INFO] Downloaded: https://repo.maven.apache.org/maven2/junit/junit/4.12/junit-4.12.jar (315 kB at 11 MB/s)
[windows-jdk10] [INFO] Downloading: https://repo.maven.apache.org/maven2/org/apache/maven/maven-toolchain/2.2.1/maven-toolchain-2.2.1.jar
[windows-jdk10] [INFO] Downloaded: https://repo.maven.apache.org/maven2/org/apache/maven/maven-toolchain/2.2.1/maven-toolchain-2.2.1.jar (38 kB at 1.0 MB/s)
[windows-jdk10] [INFO] Downloading: https://repo.maven.apache.org/maven2/org/codehaus/plexus/plexus-java/0.9.3/plexus-java-0.9.3.jar
[windows-jdk10] [INFO] Downloaded: https://repo.maven.apache.org/maven2/org/apache/maven/plugin-tools/maven-plugin-annotations/3.5/maven-plugin-annotations-3.5.jar (14 kB at 255 kB/s)
[windows-jdk10] [INFO] Downloaded: https://repo.maven.apache.org/maven2/org/codehaus/plexus/plexus-java/0.9.3/plexus-java-0.9.3.jar (32 kB at 488 kB/s)
[windows-jdk10] [INFO] Downloaded: https://repo.maven.apache.org/maven2/org/apache/maven/surefire/maven-surefire-common/2.21.0/maven-surefire-common-2.21.0.jar (521 kB at 7.6 MB/s)
[windows-jdk10] [INFO] Downloading: https://repo.maven.apache.org/maven2/org/apache/maven/surefire/surefire-api/2.21.0/surefire-api-2.21.0.jar
[windows-jdk10] [INFO] Downloading: https://repo.maven.apache.org/maven2/org/apache/maven/surefire/surefire-logger-api/2.21.0/surefire-logger-api-2.21.0.jar
[windows-jdk10] [INFO] Downloaded: https://repo.maven.apache.org/maven2/org/apache/maven/surefire/surefire-logger-api/2.21.0/surefire-logger-api-2.21.0.jar (13 kB at 156 kB/s)
[windows-jdk10] [INFO] Downloaded: https://repo.maven.apache.org/maven2/org/apache/maven/surefire/surefire-api/2.21.0/surefire-api-2.21.0.jar (185 kB at 1.8 MB/s)
[windows-jdk10] [INFO] 
[windows-jdk10] [INFO] --- maven-jar-plugin:3.0.2:jar (default-jar) @ enforcer-api ---
[windows-jdk10] [INFO] Downloading: https://repo.maven.apache.org/maven2/org/apache/maven/shared/maven-shared-utils/3.0.1/maven-shared-utils-3.0.1.jar
[windows-jdk10] [INFO] Downloaded: https://repo.maven.apache.org/maven2/org/apache/maven/shared/maven-shared-utils/3.0.1/maven-shared-utils-3.0.1.jar (154 kB at 15 MB/s)
[windows-jdk10] [INFO] Building jar: F:\jenkins\jenkins-slave\workspace\aven-enforcer_MENFORCER-276-ARAEEUQ3DZKGP7LK65FX6C75KHKIJYNAPASQYCZKRS4IVUWL44FA\m\enforcer-api\target\enforcer-api-3.0.0-SNAPSHOT.jar
[windows-jdk10] [INFO] 
[windows-jdk10] [INFO] --- maven-site-plugin:3.7:attach-descriptor (attach-descriptor) @ enforcer-api ---
[windows-jdk10] [INFO] Skipping because packaging 'jar' is not pom.
[windows-jdk10] [INFO] 
[windows-jdk10] [INFO] --- maven-checkstyle-plugin:3.0.0:check (checkstyle-check) @ enforcer-api ---
[windows-jdk10] [INFO] 
[windows-jdk10] [INFO] ------------------------------------------------------------------------
[windows-jdk10] [INFO] Building Apache Maven Enforcer Built-In Rules 3.0.0-SNAPSHOT
[windows-jdk10] [INFO] ------------------------------------------------------------------------
[windows-jdk10] [INFO] Downloading: https://repo.maven.apache.org/maven2/org/apache/maven/shared/maven-common-artifact-filters/3.0.1/maven-common-artifact-filters-3.0.1.pom
[windows-jdk10] [INFO] Downloaded: https://repo.maven.apache.org/maven2/org/apache/maven/shared/maven-common-artifact-filters/3.0.1/maven-common-artifact-filters-3.0.1.pom (4.8 kB at 537 kB/s)
[windows-jdk10] [INFO] Downloading: https://repo.maven.apache.org/maven2/org/apache/maven/plugin-testing/maven-plugin-testing-harness/2.1/maven-plugin-testing-harness-2.1.pom
[windows-jdk10] [INFO] Downloaded: https://repo.maven.apache.org/maven2/org/apache/maven/plugin-testing/maven-plugin-testing-harness/2.1/maven-plugin-testing-harness-2.1.pom (3.2 kB at 202 kB/s)
[windows-jdk10] [INFO] Downloading: https://repo.maven.apache.org/maven2/org/apache/maven/plugin-testing/maven-plugin-testing/2.1/maven-plugin-testing-2.1.pom
[windows-jdk10] [INFO] Downloaded: https://repo.maven.apache.org/maven2/org/apache/maven/plugin-testing/maven-plugin-testing/2.1/maven-plugin-testing-2.1.pom (10 kB at 251 kB/s)
[windows-jdk10] [INFO] Downloading: https://repo.maven.apache.org/maven2/commons-codec/commons-codec/1.6/commons-codec-1.6.pom
[windows-jdk10] [INFO] Downloaded: https://repo.maven.apache.org/maven2/commons-codec/commons-codec/1.6/commons-codec-1.6.pom (11 kB at 1.9 MB/s)
[windows-jdk10] [INFO] Downloading: https://repo.maven.apache.org/maven2/org/apache/commons/commons-parent/22/commons-parent-22.pom
[windows-jdk10] [INFO] Downloaded: https://repo.maven.apache.org/maven2/org/apache/commons/commons-parent/22/commons-parent-22.pom (42 kB at 5.2 MB/s)
[windows-jdk10] [INFO] Downloading: https://repo.maven.apache.org/maven2/org/mockito/mockito-core/2.18.3/mockito-core-2.18.3.pom
[windows-jdk10] [INFO] Downloaded: https://repo.maven.apache.org/maven2/org/mockito/mockito-core/2.18.3/mockito-core-2.18.3.pom (16 kB at 2.3 MB/s)
[windows-jdk10] [INFO] Downloading: https://repo.maven.apache.org/maven2/net/bytebuddy/byte-buddy/1.8.5/byte-buddy-1.8.5.pom
[windows-jdk10] [INFO] Downloaded: https://repo.maven.apache.org/maven2/net/bytebuddy/byte-buddy/1.8.5/byte-buddy-1.8.5.pom (12 kB at 2.0 MB/s)
[windows-jdk10] [INFO] Downloading: https://repo.maven.apache.org/maven2/net/bytebuddy/byte-buddy-parent/1.8.5/byte-buddy-parent-1.8.5.pom
[windows-jdk10] [INFO] Downloaded: https://repo.maven.apache.org/maven2/net/bytebuddy/byte-buddy-parent/1.8.5/byte-buddy-parent-1.8.5.pom (27 kB at 4.5 MB/s)
[windows-jdk10] [INFO] Downloading: https://repo.maven.apache.org/maven2/net/bytebuddy/byte-buddy-agent/1.8.5/byte-buddy-agent-1.8.5.pom
[windows-jdk10] [INFO] Downloaded: https://repo.maven.apache.org/maven2/net/bytebuddy/byte-buddy-agent/1.8.5/byte-buddy-agent-1.8.5.pom (4.9 kB at 820 kB/s)
[windows-jdk10] [INFO] Downloading: https://repo.maven.apache.org/maven2/org/objenesis/objenesis/2.6/objenesis-2.6.pom
[windows-jdk10] [INFO] Downloaded: https://repo.maven.apache.org/maven2/org/objenesis/objenesis/2.6/objenesis-2.6.pom (2.8 kB at 464 kB/s)
[windows-jdk10] [INFO] Downloading: https://repo.maven.apache.org/maven2/org/objenesis/objenesis-parent/2.6/objenesis-parent-2.6.pom
[windows-jdk10] [INFO] Downloaded: https://repo.maven.apache.org/maven2/org/objenesis/objenesis-parent/2.6/objenesis-parent-2.6.pom (17 kB at 2.4 MB/s)
[windows-jdk10] [INFO] Downloading: https://repo.maven.apache.org/maven2/org/apache/maven/maven-compat/3.0/maven-compat-3.0.pom
[windows-jdk10] [INFO] Downloaded: https://repo.maven.apache.org/maven2/org/apache/maven/maven-compat/3.0/maven-compat-3.0.pom (4.0 kB at 670 kB/s)
[windows-jdk10] [INFO] Downloading: https://repo.maven.apache.org/maven2/org/apache/maven/wagon/wagon-provider-api/1.0-beta-6/wagon-provider-api-1.0-beta-6.pom
[windows-jdk10] [INFO] Downloaded: https://repo.maven.apache.org/maven2/org/apache/maven/wagon/wagon-provider-api/1.0-beta-6/wagon-provider-api-1.0-beta-6.pom (1.8 kB at 293 kB/s)
[windows-jdk10] [INFO] Downloading: https://repo.maven.apache.org/maven2/org/apache/maven/wagon/wagon/1.0-beta-6/wagon-1.0-beta-6.pom
[windows-jdk10] [INFO] Downloaded: https://repo.maven.apache.org/maven2/org/apache/maven/wagon/wagon/1.0-beta-6/wagon-1.0-beta-6.pom (12 kB at 1.8 MB/s)
[windows-jdk10] [INFO] Downloading: https://repo.maven.apache.org/maven2/org/assertj/assertj-core/1.7.1/assertj-core-1.7.1.pom
[windows-jdk10] [INFO] Downloaded: https://repo.maven.apache.org/maven2/org/assertj/assertj-core/1.7.1/assertj-core-1.7.1.pom (4.7 kB at 668 kB/s)
[windows-jdk10] [INFO] Downloading: https://repo.maven.apache.org/maven2/org/assertj/assertj-parent-pom/1.2.6/assertj-parent-pom-1.2.6.pom
[windows-jdk10] [INFO] Downloaded: https://repo.maven.apache.org/maven2/org/assertj/assertj-parent-pom/1.2.6/assertj-parent-pom-1.2.6.pom (13 kB at 1.9 MB/s)
[windows-jdk10] [INFO] Downloading: https://repo.maven.apache.org/maven2/commons-codec/commons-codec/1.6/commons-codec-1.6.jar
[windows-jdk10] [INFO] Downloading: https://repo.maven.apache.org/maven2/org/apache/maven/shared/maven-common-artifact-filters/3.0.1/maven-common-artifact-filters-3.0.1.jar
[windows-jdk10] [INFO] Downloading: https://repo.maven.apache.org/maven2/org/mockito/mockito-core/2.18.3/mockito-core-2.18.3.jar
[windows-jdk10] [INFO] Downloading: https://repo.maven.apache.org/maven2/org/apache/maven/plugin-testing/maven-plugin-testing-harness/2.1/maven-plugin-testing-harness-2.1.jar
[windows-jdk10] [INFO] Downloading: https://repo.maven.apache.org/maven2/org/apache/commons/commons-lang3/3.5/commons-lang3-3.5.jar
[windows-jdk10] [INFO] Downloaded: https://repo.maven.apache.org/maven2/org/apache/maven/plugin-testing/maven-plugin-testing-harness/2.1/maven-plugin-testing-harness-2.1.jar (39 kB at 2.6 MB/s)
[windows-jdk10] [INFO] Downloaded: https://repo.maven.apache.org/maven2/org/apache/maven/shared/maven-common-artifact-filters/3.0.1/maven-common-artifact-filters-3.0.1.jar (61 kB at 4.1 MB/s)
[windows-jdk10] [INFO] Downloading: https://repo.maven.apache.org/maven2/net/bytebuddy/byte-buddy-agent/1.8.5/byte-buddy-agent-1.8.5.jar
[windows-jdk10] [INFO] Downloading: https://repo.maven.apache.org/maven2/net/bytebuddy/byte-buddy/1.8.5/byte-buddy-1.8.5.jar
[windows-jdk10] [INFO] Downloaded: https://repo.maven.apache.org/maven2/org/mockito/mockito-core/2.18.3/mockito-core-2.18.3.jar (556 kB at 17 MB/s)
[windows-jdk10] [INFO] Downloading: https://repo.maven.apache.org/maven2/org/objenesis/objenesis/2.6/objenesis-2.6.jar
[windows-jdk10] [INFO] Downloaded: https://repo.maven.apache.org/maven2/commons-codec/commons-codec/1.6/commons-codec-1.6.jar (233 kB at 3.6 MB/s)
[windows-jdk10] [INFO] Downloading: https://repo.maven.apache.org/maven2/org/apache/maven/maven-compat/3.0/maven-compat-3.0.jar
[windows-jdk10] [INFO] Downloaded: https://repo.maven.apache.org/maven2/org/apache/commons/commons-lang3/3.5/commons-lang3-3.5.jar (480 kB at 5.3 MB/s)
[windows-jdk10] [INFO] Downloading: https://repo.maven.apache.org/maven2/org/apache/maven/wagon/wagon-provider-api/1.0-beta-6/wagon-provider-api-1.0-beta-6.jar
[windows-jdk10] [INFO] Downloaded: https://repo.maven.apache.org/maven2/net/bytebuddy/byte-buddy-agent/1.8.5/byte-buddy-agent-1.8.5.jar (40 kB at 440 kB/s)
[windows-jdk10] [INFO] Downloading: https://repo.maven.apache.org/maven2/org/assertj/assertj-core/1.7.1/assertj-core-1.7.1.jar
[windows-jdk10] [INFO] Downloaded: https://repo.maven.apache.org/maven2/org/apache/maven/maven-compat/3.0/maven-compat-3.0.jar (285 kB at 2.4 MB/s)
[windows-jdk10] [INFO] Downloaded: https://repo.maven.apache.org/maven2/net/bytebuddy/byte-buddy/1.8.5/byte-buddy-1.8.5.jar (3.0 MB at 25 MB/s)
[windows-jdk10] [INFO] Downloaded: https://repo.maven.apache.org/maven2/org/objenesis/objenesis/2.6/objenesis-2.6.jar (56 kB at 389 kB/s)
[windows-jdk10] [INFO] Downloaded: https://repo.maven.apache.org/maven2/org/apache/maven/wagon/wagon-provider-api/1.0-beta-6/wagon-provider-api-1.0-beta-6.jar (53 kB at 372 kB/s)
[windows-jdk10] [INFO] Downloaded: https://repo.maven.apache.org/maven2/org/assertj/assertj-core/1.7.1/assertj-core-1.7.1.jar (619 kB at 4.3 MB/s)
[windows-jdk10] [INFO] 
[windows-jdk10] [INFO] --- maven-clean-plugin:3.0.0:clean (default-clean) @ enforcer-rules ---
[windows-jdk10] [INFO] 
[windows-jdk10] [INFO] --- maven-enforcer-plugin:1.4.1:enforce (enforce-maven-version) @ enforcer-rules ---
[windows-jdk10] [INFO] 
[windows-jdk10] [INFO] --- maven-enforcer-plugin:1.4.1:enforce (enforce-bytecode-version) @ enforcer-rules ---
[windows-jdk10] [INFO] 
[windows-jdk10] [INFO] --- maven-enforcer-plugin:1.4.1:enforce (ban-known-bad-maven-versions) @ enforcer-rules ---
[windows-jdk10] [INFO] 
[windows-jdk10] [INFO] --- apache-rat-plugin:0.12:check (rat-check) @ enforcer-rules ---
[windows-jdk10] [INFO] Enabled default license matchers.
[windows-jdk10] [INFO] Will parse SCM ignores for exclusions...
[windows-jdk10] [INFO] Finished adding exclusions from SCM ignore files.
[windows-jdk10] [INFO] 61 implicit excludes (use -debug for more details).
[windows-jdk10] [INFO] Exclude: .repository/**
[windows-jdk10] [INFO] Exclude: .maven/spy.log
[windows-jdk10] [INFO] Exclude: dependency-reduced-pom.xml
[windows-jdk10] [INFO] Exclude: .java-version
[windows-jdk10] [INFO] 130 resources included (use -debug for more details)
[windows-jdk10] [INFO] Rat check: Summary over all files. Unapproved: 0, unknown: 0, generated: 0, approved: 124 licenses.
[windows-jdk10] [INFO] 
[windows-jdk10] [INFO] --- maven-remote-resources-plugin:1.5:process (process-resource-bundles) @ enforcer-rules ---
[windows-jdk10] [INFO] 
[windows-jdk10] [INFO] --- maven-resources-plugin:3.0.2:resources (default-resources) @ enforcer-rules ---
[windows-jdk10] [INFO] Using 'UTF-8' encoding to copy filtered resources.
[windows-jdk10] [INFO] skip non existing resourceDirectory F:\jenkins\jenkins-slave\workspace\aven-enforcer_MENFORCER-276-ARAEEUQ3DZKGP7LK65FX6C75KHKIJYNAPASQYCZKRS4IVUWL44FA\m\enforcer-rules\src\main\resources
[windows-jdk10] [INFO] Copying 3 resources
[windows-jdk10] [INFO] 
[windows-jdk10] [INFO] --- maven-compiler-plugin:3.7.0:compile (default-compile) @ enforcer-rules ---
[windows-jdk10] [INFO] Changes detected - recompiling the module!
[windows-jdk10] [INFO] Compiling 43 source files to F:\jenkins\jenkins-slave\workspace\aven-enforcer_MENFORCER-276-ARAEEUQ3DZKGP7LK65FX6C75KHKIJYNAPASQYCZKRS4IVUWL44FA\m\enforcer-rules\target\classes
[windows-jdk10] [INFO] /F:/jenkins/jenkins-slave/workspace/aven-enforcer_MENFORCER-276-ARAEEUQ3DZKGP7LK65FX6C75KHKIJYNAPASQYCZKRS4IVUWL44FA/m/enforcer-rules/src/main/java/org/apache/maven/plugins/enforcer/RequirePluginVersions.java: Some input files use or override a deprecated API.
[windows-jdk10] [INFO] /F:/jenkins/jenkins-slave/workspace/aven-enforcer_MENFORCER-276-ARAEEUQ3DZKGP7LK65FX6C75KHKIJYNAPASQYCZKRS4IVUWL44FA/m/enforcer-rules/src/main/java/org/apache/maven/plugins/enforcer/RequirePluginVersions.java: Recompile with -Xlint:deprecation for details.
[windows-jdk10] [INFO] /F:/jenkins/jenkins-slave/workspace/aven-enforcer_MENFORCER-276-ARAEEUQ3DZKGP7LK65FX6C75KHKIJYNAPASQYCZKRS4IVUWL44FA/m/enforcer-rules/src/main/java/org/apache/maven/plugins/enforcer/RequirePluginVersions.java: F:\jenkins\jenkins-slave\workspace\aven-enforcer_MENFORCER-276-ARAEEUQ3DZKGP7LK65FX6C75KHKIJYNAPASQYCZKRS4IVUWL44FA\m\enforcer-rules\src\main\java\org\apache\maven\plugins\enforcer\RequirePluginVersions.java uses unchecked or unsafe operations.
[windows-jdk10] [INFO] /F:/jenkins/jenkins-slave/workspace/aven-enforcer_MENFORCER-276-ARAEEUQ3DZKGP7LK65FX6C75KHKIJYNAPASQYCZKRS4IVUWL44FA/m/enforcer-rules/src/main/java/org/apache/maven/plugins/enforcer/RequirePluginVersions.java: Recompile with -Xlint:unchecked for details.
[windows-jdk10] [INFO] 
[windows-jdk10] [INFO] --- maven-resources-plugin:3.0.2:testResources (default-testResources) @ enforcer-rules ---
[windows-jdk10] [INFO] Using 'UTF-8' encoding to copy filtered resources.
[windows-jdk10] [INFO] Copying 11 resources
[windows-jdk10] [INFO] Copying 3 resources
[windows-jdk10] [INFO] 
[windows-jdk10] [INFO] --- maven-compiler-plugin:3.7.0:testCompile (default-testCompile) @ enforcer-rules ---
[windows-jdk10] [INFO] Changes detected - recompiling the module!
[windows-jdk10] [INFO] Compiling 35 source files to F:\jenkins\jenkins-slave\workspace\aven-enforcer_MENFORCER-276-ARAEEUQ3DZKGP7LK65FX6C75KHKIJYNAPASQYCZKRS4IVUWL44FA\m\enforcer-rules\target\test-classes
[windows-jdk10] [INFO] /F:/jenkins/jenkins-slave/workspace/aven-enforcer_MENFORCER-276-ARAEEUQ3DZKGP7LK65FX6C75KHKIJYNAPASQYCZKRS4IVUWL44FA/m/enforcer-rules/src/test/java/org/apache/maven/plugins/enforcer/TestRequireUpperBoundDeps.java: Some input files use or override a deprecated API.
[windows-jdk10] [INFO] /F:/jenkins/jenkins-slave/workspace/aven-enforcer_MENFORCER-276-ARAEEUQ3DZKGP7LK65FX6C75KHKIJYNAPASQYCZKRS4IVUWL44FA/m/enforcer-rules/src/test/java/org/apache/maven/plugins/enforcer/TestRequireUpperBoundDeps.java: Recompile with -Xlint:deprecation for details.
[windows-jdk10] [INFO] /F:/jenkins/jenkins-slave/workspace/aven-enforcer_MENFORCER-276-ARAEEUQ3DZKGP7LK65FX6C75KHKIJYNAPASQYCZKRS4IVUWL44FA/m/enforcer-rules/src/test/java/org/apache/maven/plugins/enforcer/MockPlexusContainer.java: Some input files use unchecked or unsafe operations.
[windows-jdk10] [INFO] /F:/jenkins/jenkins-slave/workspace/aven-enforcer_MENFORCER-276-ARAEEUQ3DZKGP7LK65FX6C75KHKIJYNAPASQYCZKRS4IVUWL44FA/m/enforcer-rules/src/test/java/org/apache/maven/plugins/enforcer/MockPlexusContainer.java: Recompile with -Xlint:unchecked for details.
[windows-jdk10] [INFO] -------------------------------------------------------------
[windows-jdk10] [ERROR] COMPILATION ERROR : 
[windows-jdk10] [INFO] -------------------------------------------------------------
[windows-jdk10] [ERROR] /F:/jenkins/jenkins-slave/workspace/aven-enforcer_MENFORCER-276-ARAEEUQ3DZKGP7LK65FX6C75KHKIJYNAPASQYCZKRS4IVUWL44FA/m/enforcer-rules/src/test/java/org/apache/maven/plugins/enforcer/TestRequireUpperBoundDeps.java:[14,47] cannot find symbol
[windows-jdk10]   symbol:   class TestEnforcerRuleUtils
[windows-jdk10]   location: package org.apache.maven.plugins.enforcer.utils
[windows-jdk10] [ERROR] /F:/jenkins/jenkins-slave/workspace/aven-enforcer_MENFORCER-276-ARAEEUQ3DZKGP7LK65FX6C75KHKIJYNAPASQYCZKRS4IVUWL44FA/m/enforcer-rules/src/test/java/org/apache/maven/plugins/enforcer/TestRequireUpperBoundDeps.java:[87,9] cannot find symbol
[windows-jdk10]   symbol:   variable TestEnforcerRuleUtils
[windows-jdk10]   location: class org.apache.maven.plugins.enforcer.TestRequireUpperBoundDeps
[windows-jdk10] [ERROR] /F:/jenkins/jenkins-slave/workspace/aven-enforcer_MENFORCER-276-ARAEEUQ3DZKGP7LK65FX6C75KHKIJYNAPASQYCZKRS4IVUWL44FA/m/enforcer-rules/src/test/java/org/apache/maven/plugins/enforcer/TestRequireUpperBoundDeps.java:[97,9] cannot find symbol
[windows-jdk10]   symbol:   variable TestEnforcerRuleUtils
[windows-jdk10]   location: class org.apache.maven.plugins.enforcer.TestRequireUpperBoundDeps
[windows-jdk10] [ERROR] /F:/jenkins/jenkins-slave/workspace/aven-enforcer_MENFORCER-276-ARAEEUQ3DZKGP7LK65FX6C75KHKIJYNAPASQYCZKRS4IVUWL44FA/m/enforcer-rules/src/test/java/org/apache/maven/plugins/enforcer/TestRequireUpperBoundDeps.java:[107,9] cannot find symbol
[windows-jdk10]   symbol:   variable TestEnforcerRuleUtils
[windows-jdk10]   location: class org.apache.maven.plugins.enforcer.TestRequireUpperBoundDeps
[windows-jdk10] [ERROR] /F:/jenkins/jenkins-slave/workspace/aven-enforcer_MENFORCER-276-ARAEEUQ3DZKGP7LK65FX6C75KHKIJYNAPASQYCZKRS4IVUWL44FA/m/enforcer-rules/src/test/java/org/apache/maven/plugins/enforcer/TestRequireUpperBoundDeps.java:[118,9] cannot find symbol
[windows-jdk10]   symbol:   variable TestEnforcerRuleUtils
[windows-jdk10]   location: class org.apache.maven.plugins.enforcer.TestRequireUpperBoundDeps
[windows-jdk10] [INFO] 5 errors 
[windows-jdk10] [INFO] -------------------------------------------------------------
[windows-jdk10] [INFO] ------------------------------------------------------------------------
[windows-jdk10] [INFO] Reactor Summary:
[windows-jdk10] [INFO] 
[windows-jdk10] [INFO] Apache Maven Enforcer .............................. SUCCESS [ 15.448 s]
[windows-jdk10] [INFO] Apache Maven Enforcer API .......................... SUCCESS [  5.342 s]
[windows-jdk10] [INFO] Apache Maven Enforcer Built-In Rules ............... FAILURE [  4.883 s]
[windows-jdk10] [INFO] Apache Maven Enforcer Plugin ....................... SKIPPED
[windows-jdk10] [INFO] ------------------------------------------------------------------------
[windows-jdk10] [INFO] BUILD FAILURE
[windows-jdk10] [INFO] ------------------------------------------------------------------------
[windows-jdk10] [INFO] Total time: 27.490 s
[windows-jdk10] [INFO] Finished at: 2018-07-21T05:20:36Z
[windows-jdk10] [INFO] Final Memory: 39M/137M
[windows-jdk10] [INFO] ------------------------------------------------------------------------
[windows-jdk10] [INFO] [jenkins-event-spy] Generated F:\jenkins\jenkins-slave\workspace\aven-enforcer_MENFORCER-276-ARAEEUQ3DZKGP7LK65FX6C75KHKIJYNAPASQYCZKRS4IVUWL44FA@tmp\withMaven3aa095cd\maven-spy-20180721-052008-4716831382757405758254.log
[windows-jdk10] [ERROR] Failed to execute goal org.apache.maven.plugins:maven-compiler-plugin:3.7.0:testCompile (default-testCompile) on project enforcer-rules: Compilation failure: Compilation failure: 
[windows-jdk10] [ERROR] /F:/jenkins/jenkins-slave/workspace/aven-enforcer_MENFORCER-276-ARAEEUQ3DZKGP7LK65FX6C75KHKIJYNAPASQYCZKRS4IVUWL44FA/m/enforcer-rules/src/test/java/org/apache/maven/plugins/enforcer/TestRequireUpperBoundDeps.java:[14,47] cannot find symbol
[windows-jdk10] [ERROR]   symbol:   class TestEnforcerRuleUtils
[windows-jdk10] [ERROR]   location: package org.apache.maven.plugins.enforcer.utils
[windows-jdk10] [ERROR] /F:/jenkins/jenkins-slave/workspace/aven-enforcer_MENFORCER-276-ARAEEUQ3DZKGP7LK65FX6C75KHKIJYNAPASQYCZKRS4IVUWL44FA/m/enforcer-rules/src/test/java/org/apache/maven/plugins/enforcer/TestRequireUpperBoundDeps.java:[87,9] cannot find symbol
[windows-jdk10] [ERROR]   symbol:   variable TestEnforcerRuleUtils
[windows-jdk10] [ERROR]   location: class org.apache.maven.plugins.enforcer.TestRequireUpperBoundDeps
[windows-jdk10] [ERROR] /F:/jenkins/jenkins-slave/workspace/aven-enforcer_MENFORCER-276-ARAEEUQ3DZKGP7LK65FX6C75KHKIJYNAPASQYCZKRS4IVUWL44FA/m/enforcer-rules/src/test/java/org/apache/maven/plugins/enforcer/TestRequireUpperBoundDeps.java:[97,9] cannot find symbol
[windows-jdk10] [ERROR]   symbol:   variable TestEnforcerRuleUtils
[windows-jdk10] [ERROR]   location: class org.apache.maven.plugins.enforcer.TestRequireUpperBoundDeps
[windows-jdk10] [ERROR] /F:/jenkins/jenkins-slave/workspace/aven-enforcer_MENFORCER-276-ARAEEUQ3DZKGP7LK65FX6C75KHKIJYNAPASQYCZKRS4IVUWL44FA/m/enforcer-rules/src/test/java/org/apache/maven/plugins/enforcer/TestRequireUpperBoundDeps.java:[107,9] cannot find symbol
[windows-jdk10] [ERROR]   symbol:   variable TestEnforcerRuleUtils
[windows-jdk10] [ERROR]   location: class org.apache.maven.plugins.enforcer.TestRequireUpperBoundDeps
[windows-jdk10] [ERROR] /F:/jenkins/jenkins-slave/workspace/aven-enforcer_MENFORCER-276-ARAEEUQ3DZKGP7LK65FX6C75KHKIJYNAPASQYCZKRS4IVUWL44FA/m/enforcer-rules/src/test/java/org/apache/maven/plugins/enforcer/TestRequireUpperBoundDeps.java:[118,9] cannot find symbol
[windows-jdk10] [ERROR]   symbol:   variable TestEnforcerRuleUtils
[windows-jdk10] [ERROR]   location: class org.apache.maven.plugins.enforcer.TestRequireUpperBoundDeps
[windows-jdk10] [ERROR] -> [Help 1]
[windows-jdk10] [ERROR] 
[windows-jdk10] [ERROR] To see the full stack trace of the errors, re-run Maven with the -e switch.
[windows-jdk10] [ERROR] Re-run Maven using the -X switch to enable full debug logging.
[windows-jdk10] [ERROR] 
[windows-jdk10] [ERROR] For more information about the errors and possible solutions, please read the following articles:
[windows-jdk10] [ERROR] [Help 1] http://cwiki.apache.org/confluence/display/MAVEN/MojoFailureException
[windows-jdk10] [ERROR] 
[windows-jdk10] [ERROR] After correcting the problems, you can resume the build with the command
[windows-jdk10] [ERROR]   mvn <goals> -rf :enforcer-rules
[Pipeline] [windows-jdk10] }
[Pipeline] [windows-jdk10] // dir
[Pipeline] [windows-jdk10] }
[windows-jdk10] [withMaven] junitPublisher - Archive test results for Maven artifact org.apache.maven.enforcer:enforcer-api:3.0.0-SNAPSHOT generated by maven-surefire-plugin:test (default-test): m\enforcer-api\target\surefire-reports\*.xml
[windows-jdk10] Recording test results
[windows-jdk10] None of the test reports contained any result
[Pipeline] [windows-jdk10] // withMaven
[Pipeline] [windows-jdk10] cleanWs
[windows-jdk10] [WS-CLEANUP] Deleting project workspace...[WS-CLEANUP] done
[Pipeline] [windows-jdk10] }
[Pipeline] [windows-jdk10] // stage
[Pipeline] [windows-jdk10] }
[Pipeline] [windows-jdk10] // node
[Pipeline] [windows-jdk10] }
[windows-jdk10] Failed in branch windows-jdk10
[Pipeline] // parallel
[Pipeline] stage
[Pipeline] { (Notifications)
[Pipeline] echo
Build result: FAILURE
[Pipeline] jiraIssueSelector
[Pipeline] emailext

Build failed in Jenkins: Maven TLP » maven-enforcer » MENFORCER-276 #11

Posted by Apache Jenkins Server <je...@builds.apache.org>.
See https://builds.apache.org/job/maven-box/job/maven-enforcer/job/MENFORCER-276/11/

No changes.

No tests ran.

Build log:
[...truncated 2.19 MB...]
[windows-jdk10] [INFO] Downloaded from central: https://repo.maven.apache.org/maven2/com/thoughtworks/qdox/qdox/2.0-M7/qdox-2.0-M7.jar (315 kB at 2.3 MB/s)
[windows-jdk10] [INFO] Downloaded from central: https://repo.maven.apache.org/maven2/org/codehaus/plexus/plexus-java/0.9.2/plexus-java-0.9.2.jar (31 kB at 136 kB/s)
[windows-jdk10] [INFO] Changes detected - recompiling the module!
[windows-jdk10] [INFO] Compiling 5 source files to F:\jenkins\jenkins-slave\workspace\aven-enforcer_MENFORCER-276-ARAEEUQ3DZKGP7LK65FX6C75KHKIJYNAPASQYCZKRS4IVUWL44FA\m\enforcer-api\target\classes
[windows-jdk10] [INFO] 
[windows-jdk10] [INFO] --- maven-resources-plugin:3.0.2:testResources (default-testResources) @ enforcer-api ---
[windows-jdk10] [INFO] Using 'UTF-8' encoding to copy filtered resources.
[windows-jdk10] [INFO] skip non existing resourceDirectory F:\jenkins\jenkins-slave\workspace\aven-enforcer_MENFORCER-276-ARAEEUQ3DZKGP7LK65FX6C75KHKIJYNAPASQYCZKRS4IVUWL44FA\m\enforcer-api\src\test\resources
[windows-jdk10] [INFO] Copying 3 resources
[windows-jdk10] [INFO] 
[windows-jdk10] [INFO] --- maven-compiler-plugin:3.7.0:testCompile (default-testCompile) @ enforcer-api ---
[windows-jdk10] [INFO] No sources to compile
[windows-jdk10] [INFO] 
[windows-jdk10] [INFO] --- maven-surefire-plugin:2.21.0:test (default-test) @ enforcer-api ---
[windows-jdk10] [INFO] Downloading from central: https://repo.maven.apache.org/maven2/org/apache/maven/surefire/maven-surefire-common/2.21.0/maven-surefire-common-2.21.0.pom
[windows-jdk10] [INFO] Downloaded from central: https://repo.maven.apache.org/maven2/org/apache/maven/surefire/maven-surefire-common/2.21.0/maven-surefire-common-2.21.0.pom (11 kB at 568 kB/s)
[windows-jdk10] [INFO] Downloading from central: https://repo.maven.apache.org/maven2/org/apache/maven/plugin-tools/maven-plugin-annotations/3.5/maven-plugin-annotations-3.5.pom
[windows-jdk10] [INFO] Downloaded from central: https://repo.maven.apache.org/maven2/org/apache/maven/plugin-tools/maven-plugin-annotations/3.5/maven-plugin-annotations-3.5.pom (1.7 kB at 152 kB/s)
[windows-jdk10] [INFO] Downloading from central: https://repo.maven.apache.org/maven2/org/apache/maven/plugin-tools/maven-plugin-tools/3.5/maven-plugin-tools-3.5.pom
[windows-jdk10] [INFO] Downloaded from central: https://repo.maven.apache.org/maven2/org/apache/maven/plugin-tools/maven-plugin-tools/3.5/maven-plugin-tools-3.5.pom (16 kB at 1.2 MB/s)
[windows-jdk10] [INFO] Downloading from central: https://repo.maven.apache.org/maven2/org/apache/maven/surefire/surefire-api/2.21.0/surefire-api-2.21.0.pom
[windows-jdk10] [INFO] Downloaded from central: https://repo.maven.apache.org/maven2/org/apache/maven/surefire/surefire-api/2.21.0/surefire-api-2.21.0.pom (3.5 kB at 322 kB/s)
[windows-jdk10] [INFO] Downloading from central: https://repo.maven.apache.org/maven2/org/apache/maven/surefire/surefire-logger-api/2.21.0/surefire-logger-api-2.21.0.pom
[windows-jdk10] [INFO] Downloaded from central: https://repo.maven.apache.org/maven2/org/apache/maven/surefire/surefire-logger-api/2.21.0/surefire-logger-api-2.21.0.pom (2.0 kB at 183 kB/s)
[windows-jdk10] [INFO] Downloading from central: https://repo.maven.apache.org/maven2/org/apache/maven/surefire/surefire-booter/2.21.0/surefire-booter-2.21.0.pom
[windows-jdk10] [INFO] Downloaded from central: https://repo.maven.apache.org/maven2/org/apache/maven/surefire/surefire-booter/2.21.0/surefire-booter-2.21.0.pom (7.4 kB at 669 kB/s)
[windows-jdk10] [INFO] Downloading from central: https://repo.maven.apache.org/maven2/org/apache/maven/maven-toolchain/2.2.1/maven-toolchain-2.2.1.pom
[windows-jdk10] [INFO] Downloaded from central: https://repo.maven.apache.org/maven2/org/apache/maven/maven-toolchain/2.2.1/maven-toolchain-2.2.1.pom (3.3 kB at 304 kB/s)
[windows-jdk10] [INFO] Downloading from central: https://repo.maven.apache.org/maven2/org/codehaus/plexus/plexus-java/0.9.3/plexus-java-0.9.3.pom
[windows-jdk10] [INFO] Downloaded from central: https://repo.maven.apache.org/maven2/org/codehaus/plexus/plexus-java/0.9.3/plexus-java-0.9.3.pom (2.4 kB at 214 kB/s)
[windows-jdk10] [INFO] Downloading from central: https://repo.maven.apache.org/maven2/org/codehaus/plexus/plexus-languages/0.9.3/plexus-languages-0.9.3.pom
[windows-jdk10] [INFO] Downloaded from central: https://repo.maven.apache.org/maven2/org/codehaus/plexus/plexus-languages/0.9.3/plexus-languages-0.9.3.pom (2.2 kB at 200 kB/s)
[windows-jdk10] [INFO] Downloading from central: https://repo.maven.apache.org/maven2/org/apache/maven/surefire/maven-surefire-common/2.21.0/maven-surefire-common-2.21.0.jar
[windows-jdk10] [INFO] Downloading from central: https://repo.maven.apache.org/maven2/org/apache/maven/plugin-tools/maven-plugin-annotations/3.5/maven-plugin-annotations-3.5.jar
[windows-jdk10] [INFO] Downloading from central: https://repo.maven.apache.org/maven2/org/apache/maven/surefire/surefire-api/2.21.0/surefire-api-2.21.0.jar
[windows-jdk10] [INFO] Downloading from central: https://repo.maven.apache.org/maven2/org/apache/maven/surefire/surefire-logger-api/2.21.0/surefire-logger-api-2.21.0.jar
[windows-jdk10] [INFO] Downloading from central: https://repo.maven.apache.org/maven2/org/apache/maven/surefire/surefire-booter/2.21.0/surefire-booter-2.21.0.jar
[windows-jdk10] [INFO] Downloaded from central: https://repo.maven.apache.org/maven2/org/apache/maven/surefire/surefire-booter/2.21.0/surefire-booter-2.21.0.jar (273 kB at 11 MB/s)
[windows-jdk10] [INFO] Downloading from central: https://repo.maven.apache.org/maven2/junit/junit/4.12/junit-4.12.jar
[windows-jdk10] [INFO] Downloaded from central: https://repo.maven.apache.org/maven2/org/apache/maven/surefire/surefire-api/2.21.0/surefire-api-2.21.0.jar (185 kB at 6.8 MB/s)
[windows-jdk10] [INFO] Downloading from central: https://repo.maven.apache.org/maven2/org/apache/maven/maven-toolchain/2.2.1/maven-toolchain-2.2.1.jar
[windows-jdk10] [INFO] Downloaded from central: https://repo.maven.apache.org/maven2/org/apache/maven/surefire/maven-surefire-common/2.21.0/maven-surefire-common-2.21.0.jar (521 kB at 16 MB/s)
[windows-jdk10] [INFO] Downloading from central: https://repo.maven.apache.org/maven2/org/codehaus/plexus/plexus-java/0.9.3/plexus-java-0.9.3.jar
[windows-jdk10] [INFO] Downloaded from central: https://repo.maven.apache.org/maven2/org/apache/maven/plugin-tools/maven-plugin-annotations/3.5/maven-plugin-annotations-3.5.jar (14 kB at 188 kB/s)
[windows-jdk10] [INFO] Downloaded from central: https://repo.maven.apache.org/maven2/org/apache/maven/surefire/surefire-logger-api/2.21.0/surefire-logger-api-2.21.0.jar (13 kB at 168 kB/s)
[windows-jdk10] [INFO] Downloaded from central: https://repo.maven.apache.org/maven2/junit/junit/4.12/junit-4.12.jar (315 kB at 3.8 MB/s)
[windows-jdk10] [INFO] Downloaded from central: https://repo.maven.apache.org/maven2/org/codehaus/plexus/plexus-java/0.9.3/plexus-java-0.9.3.jar (32 kB at 206 kB/s)
[windows-jdk10] [INFO] Downloaded from central: https://repo.maven.apache.org/maven2/org/apache/maven/maven-toolchain/2.2.1/maven-toolchain-2.2.1.jar (38 kB at 210 kB/s)
[windows-jdk10] [INFO] 
[windows-jdk10] [INFO] --- maven-jar-plugin:3.0.2:jar (default-jar) @ enforcer-api ---
[windows-jdk10] [INFO] Downloading from central: https://repo.maven.apache.org/maven2/org/apache/maven/shared/maven-shared-utils/3.0.1/maven-shared-utils-3.0.1.jar
[windows-jdk10] [INFO] Downloaded from central: https://repo.maven.apache.org/maven2/org/apache/maven/shared/maven-shared-utils/3.0.1/maven-shared-utils-3.0.1.jar (154 kB at 8.6 MB/s)
[windows-jdk10] [INFO] Building jar: F:\jenkins\jenkins-slave\workspace\aven-enforcer_MENFORCER-276-ARAEEUQ3DZKGP7LK65FX6C75KHKIJYNAPASQYCZKRS4IVUWL44FA\m\enforcer-api\target\enforcer-api-3.0.0-SNAPSHOT.jar
[windows-jdk10] [INFO] 
[windows-jdk10] [INFO] --- maven-site-plugin:3.7:attach-descriptor (attach-descriptor) @ enforcer-api ---
[windows-jdk10] [INFO] Skipping because packaging 'jar' is not pom.
[windows-jdk10] [INFO] 
[windows-jdk10] [INFO] --- maven-checkstyle-plugin:3.0.0:check (checkstyle-check) @ enforcer-api ---
[windows-jdk10] [INFO] 
[windows-jdk10] [INFO] ------------------------------------------------------------------------
[windows-jdk10] [INFO] Building Apache Maven Enforcer Built-In Rules 3.0.0-SNAPSHOT
[windows-jdk10] [INFO] ------------------------------------------------------------------------
[windows-jdk10] [INFO] Downloading from central: https://repo.maven.apache.org/maven2/org/apache/maven/shared/maven-common-artifact-filters/3.0.1/maven-common-artifact-filters-3.0.1.pom
[windows-jdk10] [INFO] Downloaded from central: https://repo.maven.apache.org/maven2/org/apache/maven/shared/maven-common-artifact-filters/3.0.1/maven-common-artifact-filters-3.0.1.pom (4.8 kB at 242 kB/s)
[windows-jdk10] [INFO] Downloading from central: https://repo.maven.apache.org/maven2/org/apache/maven/plugin-testing/maven-plugin-testing-harness/2.1/maven-plugin-testing-harness-2.1.pom
[windows-jdk10] [INFO] Downloaded from central: https://repo.maven.apache.org/maven2/org/apache/maven/plugin-testing/maven-plugin-testing-harness/2.1/maven-plugin-testing-harness-2.1.pom (3.2 kB at 231 kB/s)
[windows-jdk10] [INFO] Downloading from central: https://repo.maven.apache.org/maven2/org/apache/maven/plugin-testing/maven-plugin-testing/2.1/maven-plugin-testing-2.1.pom
[windows-jdk10] [INFO] Downloaded from central: https://repo.maven.apache.org/maven2/org/apache/maven/plugin-testing/maven-plugin-testing/2.1/maven-plugin-testing-2.1.pom (10 kB at 670 kB/s)
[windows-jdk10] [INFO] Downloading from central: https://repo.maven.apache.org/maven2/commons-codec/commons-codec/1.6/commons-codec-1.6.pom
[windows-jdk10] [INFO] Downloaded from central: https://repo.maven.apache.org/maven2/commons-codec/commons-codec/1.6/commons-codec-1.6.pom (11 kB at 797 kB/s)
[windows-jdk10] [INFO] Downloading from central: https://repo.maven.apache.org/maven2/org/apache/commons/commons-parent/22/commons-parent-22.pom
[windows-jdk10] [INFO] Downloaded from central: https://repo.maven.apache.org/maven2/org/apache/commons/commons-parent/22/commons-parent-22.pom (42 kB at 2.8 MB/s)
[windows-jdk10] [INFO] Downloading from central: https://repo.maven.apache.org/maven2/org/mockito/mockito-core/2.18.3/mockito-core-2.18.3.pom
[windows-jdk10] [INFO] Downloaded from central: https://repo.maven.apache.org/maven2/org/mockito/mockito-core/2.18.3/mockito-core-2.18.3.pom (16 kB at 997 kB/s)
[windows-jdk10] [INFO] Downloading from central: https://repo.maven.apache.org/maven2/net/bytebuddy/byte-buddy/1.8.5/byte-buddy-1.8.5.pom
[windows-jdk10] [INFO] Downloaded from central: https://repo.maven.apache.org/maven2/net/bytebuddy/byte-buddy/1.8.5/byte-buddy-1.8.5.pom (12 kB at 809 kB/s)
[windows-jdk10] [INFO] Downloading from central: https://repo.maven.apache.org/maven2/net/bytebuddy/byte-buddy-parent/1.8.5/byte-buddy-parent-1.8.5.pom
[windows-jdk10] [INFO] Downloaded from central: https://repo.maven.apache.org/maven2/net/bytebuddy/byte-buddy-parent/1.8.5/byte-buddy-parent-1.8.5.pom (27 kB at 1.9 MB/s)
[windows-jdk10] [INFO] Downloading from central: https://repo.maven.apache.org/maven2/net/bytebuddy/byte-buddy-agent/1.8.5/byte-buddy-agent-1.8.5.pom
[windows-jdk10] [INFO] Downloaded from central: https://repo.maven.apache.org/maven2/net/bytebuddy/byte-buddy-agent/1.8.5/byte-buddy-agent-1.8.5.pom (4.9 kB at 378 kB/s)
[windows-jdk10] [INFO] Downloading from central: https://repo.maven.apache.org/maven2/org/objenesis/objenesis/2.6/objenesis-2.6.pom
[windows-jdk10] [INFO] Downloaded from central: https://repo.maven.apache.org/maven2/org/objenesis/objenesis/2.6/objenesis-2.6.pom (2.8 kB at 232 kB/s)
[windows-jdk10] [INFO] Downloading from central: https://repo.maven.apache.org/maven2/org/objenesis/objenesis-parent/2.6/objenesis-parent-2.6.pom
[windows-jdk10] [INFO] Downloaded from central: https://repo.maven.apache.org/maven2/org/objenesis/objenesis-parent/2.6/objenesis-parent-2.6.pom (17 kB at 1.4 MB/s)
[windows-jdk10] [INFO] Downloading from central: https://repo.maven.apache.org/maven2/org/apache/maven/maven-compat/3.0/maven-compat-3.0.pom
[windows-jdk10] [INFO] Downloaded from central: https://repo.maven.apache.org/maven2/org/apache/maven/maven-compat/3.0/maven-compat-3.0.pom (4.0 kB at 366 kB/s)
[windows-jdk10] [INFO] Downloading from central: https://repo.maven.apache.org/maven2/org/apache/maven/wagon/wagon-provider-api/1.0-beta-6/wagon-provider-api-1.0-beta-6.pom
[windows-jdk10] [INFO] Downloaded from central: https://repo.maven.apache.org/maven2/org/apache/maven/wagon/wagon-provider-api/1.0-beta-6/wagon-provider-api-1.0-beta-6.pom (1.8 kB at 160 kB/s)
[windows-jdk10] [INFO] Downloading from central: https://repo.maven.apache.org/maven2/org/apache/maven/wagon/wagon/1.0-beta-6/wagon-1.0-beta-6.pom
[windows-jdk10] [INFO] Downloaded from central: https://repo.maven.apache.org/maven2/org/apache/maven/wagon/wagon/1.0-beta-6/wagon-1.0-beta-6.pom (12 kB at 1.0 MB/s)
[windows-jdk10] [INFO] Downloading from central: https://repo.maven.apache.org/maven2/org/assertj/assertj-core/1.7.1/assertj-core-1.7.1.pom
[windows-jdk10] [INFO] Downloaded from central: https://repo.maven.apache.org/maven2/org/assertj/assertj-core/1.7.1/assertj-core-1.7.1.pom (4.7 kB at 360 kB/s)
[windows-jdk10] [INFO] Downloading from central: https://repo.maven.apache.org/maven2/org/assertj/assertj-parent-pom/1.2.6/assertj-parent-pom-1.2.6.pom
[windows-jdk10] [INFO] Downloaded from central: https://repo.maven.apache.org/maven2/org/assertj/assertj-parent-pom/1.2.6/assertj-parent-pom-1.2.6.pom (13 kB at 1.0 MB/s)
[windows-jdk10] [INFO] Downloading from central: https://repo.maven.apache.org/maven2/org/apache/maven/shared/maven-common-artifact-filters/3.0.1/maven-common-artifact-filters-3.0.1.jar
[windows-jdk10] [INFO] Downloading from central: https://repo.maven.apache.org/maven2/commons-codec/commons-codec/1.6/commons-codec-1.6.jar
[windows-jdk10] [INFO] Downloading from central: https://repo.maven.apache.org/maven2/org/mockito/mockito-core/2.18.3/mockito-core-2.18.3.jar
[windows-jdk10] [INFO] Downloading from central: https://repo.maven.apache.org/maven2/org/apache/maven/plugin-testing/maven-plugin-testing-harness/2.1/maven-plugin-testing-harness-2.1.jar
[windows-jdk10] [INFO] Downloading from central: https://repo.maven.apache.org/maven2/org/apache/commons/commons-lang3/3.5/commons-lang3-3.5.jar
[windows-jdk10] [INFO] Downloaded from central: https://repo.maven.apache.org/maven2/org/apache/maven/shared/maven-common-artifact-filters/3.0.1/maven-common-artifact-filters-3.0.1.jar (61 kB at 2.9 MB/s)
[windows-jdk10] [INFO] Downloading from central: https://repo.maven.apache.org/maven2/net/bytebuddy/byte-buddy/1.8.5/byte-buddy-1.8.5.jar
[windows-jdk10] [INFO] Downloaded from central: https://repo.maven.apache.org/maven2/commons-codec/commons-codec/1.6/commons-codec-1.6.jar (233 kB at 9.3 MB/s)
[windows-jdk10] [INFO] Downloading from central: https://repo.maven.apache.org/maven2/net/bytebuddy/byte-buddy-agent/1.8.5/byte-buddy-agent-1.8.5.jar
[windows-jdk10] [INFO] Downloaded from central: https://repo.maven.apache.org/maven2/org/apache/commons/commons-lang3/3.5/commons-lang3-3.5.jar (480 kB at 7.5 MB/s)
[windows-jdk10] [INFO] Downloading from central: https://repo.maven.apache.org/maven2/org/objenesis/objenesis/2.6/objenesis-2.6.jar
[windows-jdk10] [INFO] Downloaded from central: https://repo.maven.apache.org/maven2/org/mockito/mockito-core/2.18.3/mockito-core-2.18.3.jar (556 kB at 6.3 MB/s)
[windows-jdk10] [INFO] Downloading from central: https://repo.maven.apache.org/maven2/org/apache/maven/maven-compat/3.0/maven-compat-3.0.jar
[windows-jdk10] [INFO] Downloaded from central: https://repo.maven.apache.org/maven2/org/apache/maven/maven-compat/3.0/maven-compat-3.0.jar (285 kB at 2.5 MB/s)
[windows-jdk10] [INFO] Downloading from central: https://repo.maven.apache.org/maven2/org/apache/maven/wagon/wagon-provider-api/1.0-beta-6/wagon-provider-api-1.0-beta-6.jar
[windows-jdk10] [INFO] Downloaded from central: https://repo.maven.apache.org/maven2/net/bytebuddy/byte-buddy/1.8.5/byte-buddy-1.8.5.jar (3.0 MB at 24 MB/s)
[windows-jdk10] [INFO] Downloading from central: https://repo.maven.apache.org/maven2/org/assertj/assertj-core/1.7.1/assertj-core-1.7.1.jar
[windows-jdk10] [INFO] Downloaded from central: https://repo.maven.apache.org/maven2/org/objenesis/objenesis/2.6/objenesis-2.6.jar (56 kB at 432 kB/s)
[windows-jdk10] [INFO] Downloaded from central: https://repo.maven.apache.org/maven2/org/apache/maven/wagon/wagon-provider-api/1.0-beta-6/wagon-provider-api-1.0-beta-6.jar (53 kB at 397 kB/s)
[windows-jdk10] [INFO] Downloaded from central: https://repo.maven.apache.org/maven2/org/apache/maven/plugin-testing/maven-plugin-testing-harness/2.1/maven-plugin-testing-harness-2.1.jar (39 kB at 282 kB/s)
[windows-jdk10] [INFO] Downloaded from central: https://repo.maven.apache.org/maven2/org/assertj/assertj-core/1.7.1/assertj-core-1.7.1.jar (619 kB at 4.0 MB/s)
[windows-jdk10] [INFO] Downloaded from central: https://repo.maven.apache.org/maven2/net/bytebuddy/byte-buddy-agent/1.8.5/byte-buddy-agent-1.8.5.jar (40 kB at 214 kB/s)
[windows-jdk10] [INFO] 
[windows-jdk10] [INFO] --- maven-clean-plugin:3.0.0:clean (default-clean) @ enforcer-rules ---
[windows-jdk10] [INFO] 
[windows-jdk10] [INFO] --- maven-enforcer-plugin:1.4.1:enforce (enforce-maven-version) @ enforcer-rules ---
[windows-jdk10] [INFO] 
[windows-jdk10] [INFO] --- maven-enforcer-plugin:1.4.1:enforce (enforce-bytecode-version) @ enforcer-rules ---
[windows-jdk10] [INFO] 
[windows-jdk10] [INFO] --- maven-enforcer-plugin:1.4.1:enforce (ban-known-bad-maven-versions) @ enforcer-rules ---
[windows-jdk10] [INFO] 
[windows-jdk10] [INFO] --- apache-rat-plugin:0.12:check (rat-check) @ enforcer-rules ---
[windows-jdk10] [INFO] Enabled default license matchers.
[windows-jdk10] [INFO] Will parse SCM ignores for exclusions...
[windows-jdk10] [INFO] Finished adding exclusions from SCM ignore files.
[windows-jdk10] [INFO] 61 implicit excludes (use -debug for more details).
[windows-jdk10] [INFO] Exclude: .repository/**
[windows-jdk10] [INFO] Exclude: .maven/spy.log
[windows-jdk10] [INFO] Exclude: dependency-reduced-pom.xml
[windows-jdk10] [INFO] Exclude: .java-version
[windows-jdk10] [INFO] 130 resources included (use -debug for more details)
[windows-jdk10] [INFO] Rat check: Summary over all files. Unapproved: 0, unknown: 0, generated: 0, approved: 124 licenses.
[windows-jdk10] [INFO] 
[windows-jdk10] [INFO] --- maven-remote-resources-plugin:1.5:process (process-resource-bundles) @ enforcer-rules ---
[windows-jdk10] [INFO] 
[windows-jdk10] [INFO] --- maven-resources-plugin:3.0.2:resources (default-resources) @ enforcer-rules ---
[windows-jdk10] [INFO] Using 'UTF-8' encoding to copy filtered resources.
[windows-jdk10] [INFO] skip non existing resourceDirectory F:\jenkins\jenkins-slave\workspace\aven-enforcer_MENFORCER-276-ARAEEUQ3DZKGP7LK65FX6C75KHKIJYNAPASQYCZKRS4IVUWL44FA\m\enforcer-rules\src\main\resources
[windows-jdk10] [INFO] Copying 3 resources
[windows-jdk10] [INFO] 
[windows-jdk10] [INFO] --- maven-compiler-plugin:3.7.0:compile (default-compile) @ enforcer-rules ---
[windows-jdk10] [INFO] Changes detected - recompiling the module!
[windows-jdk10] [INFO] Compiling 43 source files to F:\jenkins\jenkins-slave\workspace\aven-enforcer_MENFORCER-276-ARAEEUQ3DZKGP7LK65FX6C75KHKIJYNAPASQYCZKRS4IVUWL44FA\m\enforcer-rules\target\classes
[windows-jdk10] [INFO] /F:/jenkins/jenkins-slave/workspace/aven-enforcer_MENFORCER-276-ARAEEUQ3DZKGP7LK65FX6C75KHKIJYNAPASQYCZKRS4IVUWL44FA/m/enforcer-rules/src/main/java/org/apache/maven/plugins/enforcer/RequirePluginVersions.java: Some input files use or override a deprecated API.
[windows-jdk10] [INFO] /F:/jenkins/jenkins-slave/workspace/aven-enforcer_MENFORCER-276-ARAEEUQ3DZKGP7LK65FX6C75KHKIJYNAPASQYCZKRS4IVUWL44FA/m/enforcer-rules/src/main/java/org/apache/maven/plugins/enforcer/RequirePluginVersions.java: Recompile with -Xlint:deprecation for details.
[windows-jdk10] [INFO] /F:/jenkins/jenkins-slave/workspace/aven-enforcer_MENFORCER-276-ARAEEUQ3DZKGP7LK65FX6C75KHKIJYNAPASQYCZKRS4IVUWL44FA/m/enforcer-rules/src/main/java/org/apache/maven/plugins/enforcer/RequirePluginVersions.java: F:\jenkins\jenkins-slave\workspace\aven-enforcer_MENFORCER-276-ARAEEUQ3DZKGP7LK65FX6C75KHKIJYNAPASQYCZKRS4IVUWL44FA\m\enforcer-rules\src\main\java\org\apache\maven\plugins\enforcer\RequirePluginVersions.java uses unchecked or unsafe operations.
[windows-jdk10] [INFO] /F:/jenkins/jenkins-slave/workspace/aven-enforcer_MENFORCER-276-ARAEEUQ3DZKGP7LK65FX6C75KHKIJYNAPASQYCZKRS4IVUWL44FA/m/enforcer-rules/src/main/java/org/apache/maven/plugins/enforcer/RequirePluginVersions.java: Recompile with -Xlint:unchecked for details.
[windows-jdk10] [INFO] 
[windows-jdk10] [INFO] --- maven-resources-plugin:3.0.2:testResources (default-testResources) @ enforcer-rules ---
[windows-jdk10] [INFO] Using 'UTF-8' encoding to copy filtered resources.
[windows-jdk10] [INFO] Copying 11 resources
[windows-jdk10] [INFO] Copying 3 resources
[windows-jdk10] [INFO] 
[windows-jdk10] [INFO] --- maven-compiler-plugin:3.7.0:testCompile (default-testCompile) @ enforcer-rules ---
[windows-jdk10] [INFO] Changes detected - recompiling the module!
[windows-jdk10] [INFO] Compiling 35 source files to F:\jenkins\jenkins-slave\workspace\aven-enforcer_MENFORCER-276-ARAEEUQ3DZKGP7LK65FX6C75KHKIJYNAPASQYCZKRS4IVUWL44FA\m\enforcer-rules\target\test-classes
[windows-jdk10] [INFO] /F:/jenkins/jenkins-slave/workspace/aven-enforcer_MENFORCER-276-ARAEEUQ3DZKGP7LK65FX6C75KHKIJYNAPASQYCZKRS4IVUWL44FA/m/enforcer-rules/src/test/java/org/apache/maven/plugins/enforcer/TestRequireUpperBoundDeps.java: Some input files use or override a deprecated API.
[windows-jdk10] [INFO] /F:/jenkins/jenkins-slave/workspace/aven-enforcer_MENFORCER-276-ARAEEUQ3DZKGP7LK65FX6C75KHKIJYNAPASQYCZKRS4IVUWL44FA/m/enforcer-rules/src/test/java/org/apache/maven/plugins/enforcer/TestRequireUpperBoundDeps.java: Recompile with -Xlint:deprecation for details.
[windows-jdk10] [INFO] /F:/jenkins/jenkins-slave/workspace/aven-enforcer_MENFORCER-276-ARAEEUQ3DZKGP7LK65FX6C75KHKIJYNAPASQYCZKRS4IVUWL44FA/m/enforcer-rules/src/test/java/org/apache/maven/plugins/enforcer/MockPlexusContainer.java: Some input files use unchecked or unsafe operations.
[windows-jdk10] [INFO] /F:/jenkins/jenkins-slave/workspace/aven-enforcer_MENFORCER-276-ARAEEUQ3DZKGP7LK65FX6C75KHKIJYNAPASQYCZKRS4IVUWL44FA/m/enforcer-rules/src/test/java/org/apache/maven/plugins/enforcer/MockPlexusContainer.java: Recompile with -Xlint:unchecked for details.
[windows-jdk10] [INFO] -------------------------------------------------------------
[windows-jdk10] [ERROR] COMPILATION ERROR : 
[windows-jdk10] [INFO] -------------------------------------------------------------
[windows-jdk10] [ERROR] /F:/jenkins/jenkins-slave/workspace/aven-enforcer_MENFORCER-276-ARAEEUQ3DZKGP7LK65FX6C75KHKIJYNAPASQYCZKRS4IVUWL44FA/m/enforcer-rules/src/test/java/org/apache/maven/plugins/enforcer/TestRequireUpperBoundDeps.java:[14,47] cannot find symbol
[windows-jdk10]   symbol:   class TestEnforcerRuleUtils
[windows-jdk10]   location: package org.apache.maven.plugins.enforcer.utils
[windows-jdk10] [ERROR] /F:/jenkins/jenkins-slave/workspace/aven-enforcer_MENFORCER-276-ARAEEUQ3DZKGP7LK65FX6C75KHKIJYNAPASQYCZKRS4IVUWL44FA/m/enforcer-rules/src/test/java/org/apache/maven/plugins/enforcer/TestRequireUpperBoundDeps.java:[87,9] cannot find symbol
[windows-jdk10]   symbol:   variable TestEnforcerRuleUtils
[windows-jdk10]   location: class org.apache.maven.plugins.enforcer.TestRequireUpperBoundDeps
[windows-jdk10] [ERROR] /F:/jenkins/jenkins-slave/workspace/aven-enforcer_MENFORCER-276-ARAEEUQ3DZKGP7LK65FX6C75KHKIJYNAPASQYCZKRS4IVUWL44FA/m/enforcer-rules/src/test/java/org/apache/maven/plugins/enforcer/TestRequireUpperBoundDeps.java:[97,9] cannot find symbol
[windows-jdk10]   symbol:   variable TestEnforcerRuleUtils
[windows-jdk10]   location: class org.apache.maven.plugins.enforcer.TestRequireUpperBoundDeps
[windows-jdk10] [ERROR] /F:/jenkins/jenkins-slave/workspace/aven-enforcer_MENFORCER-276-ARAEEUQ3DZKGP7LK65FX6C75KHKIJYNAPASQYCZKRS4IVUWL44FA/m/enforcer-rules/src/test/java/org/apache/maven/plugins/enforcer/TestRequireUpperBoundDeps.java:[107,9] cannot find symbol
[windows-jdk10]   symbol:   variable TestEnforcerRuleUtils
[windows-jdk10]   location: class org.apache.maven.plugins.enforcer.TestRequireUpperBoundDeps
[windows-jdk10] [ERROR] /F:/jenkins/jenkins-slave/workspace/aven-enforcer_MENFORCER-276-ARAEEUQ3DZKGP7LK65FX6C75KHKIJYNAPASQYCZKRS4IVUWL44FA/m/enforcer-rules/src/test/java/org/apache/maven/plugins/enforcer/TestRequireUpperBoundDeps.java:[118,9] cannot find symbol
[windows-jdk10]   symbol:   variable TestEnforcerRuleUtils
[windows-jdk10]   location: class org.apache.maven.plugins.enforcer.TestRequireUpperBoundDeps
[windows-jdk10] [INFO] 5 errors 
[windows-jdk10] [INFO] -------------------------------------------------------------
[windows-jdk10] [INFO] ------------------------------------------------------------------------
[windows-jdk10] [INFO] Reactor Summary:
[windows-jdk10] [INFO] 
[windows-jdk10] [INFO] Apache Maven Enforcer .............................. SUCCESS [ 18.566 s]
[windows-jdk10] [INFO] Apache Maven Enforcer API .......................... SUCCESS [  3.640 s]
[windows-jdk10] [INFO] Apache Maven Enforcer Built-In Rules ............... FAILURE [  3.373 s]
[windows-jdk10] [INFO] Apache Maven Enforcer Plugin ....................... SKIPPED
[windows-jdk10] [INFO] ------------------------------------------------------------------------
[windows-jdk10] [INFO] BUILD FAILURE
[windows-jdk10] [INFO] ------------------------------------------------------------------------
[windows-jdk10] [INFO] Total time: 26.226 s
[windows-jdk10] [INFO] Finished at: 2018-08-20T05:24:12Z
[windows-jdk10] [INFO] Final Memory: 39M/140M
[windows-jdk10] [INFO] ------------------------------------------------------------------------
[windows-jdk10] [INFO] [jenkins-event-spy] Generated F:\jenkins\jenkins-slave\workspace\aven-enforcer_MENFORCER-276-ARAEEUQ3DZKGP7LK65FX6C75KHKIJYNAPASQYCZKRS4IVUWL44FA@tmp\withMaven271b1e89\maven-spy-20180820-052346-4419458324838506362482.log
[windows-jdk10] [ERROR] Failed to execute goal org.apache.maven.plugins:maven-compiler-plugin:3.7.0:testCompile (default-testCompile) on project enforcer-rules: Compilation failure: Compilation failure: 
[windows-jdk10] [ERROR] /F:/jenkins/jenkins-slave/workspace/aven-enforcer_MENFORCER-276-ARAEEUQ3DZKGP7LK65FX6C75KHKIJYNAPASQYCZKRS4IVUWL44FA/m/enforcer-rules/src/test/java/org/apache/maven/plugins/enforcer/TestRequireUpperBoundDeps.java:[14,47] cannot find symbol
[windows-jdk10] [ERROR]   symbol:   class TestEnforcerRuleUtils
[windows-jdk10] [ERROR]   location: package org.apache.maven.plugins.enforcer.utils
[windows-jdk10] [ERROR] /F:/jenkins/jenkins-slave/workspace/aven-enforcer_MENFORCER-276-ARAEEUQ3DZKGP7LK65FX6C75KHKIJYNAPASQYCZKRS4IVUWL44FA/m/enforcer-rules/src/test/java/org/apache/maven/plugins/enforcer/TestRequireUpperBoundDeps.java:[87,9] cannot find symbol
[windows-jdk10] [ERROR]   symbol:   variable TestEnforcerRuleUtils
[windows-jdk10] [ERROR]   location: class org.apache.maven.plugins.enforcer.TestRequireUpperBoundDeps
[windows-jdk10] [ERROR] /F:/jenkins/jenkins-slave/workspace/aven-enforcer_MENFORCER-276-ARAEEUQ3DZKGP7LK65FX6C75KHKIJYNAPASQYCZKRS4IVUWL44FA/m/enforcer-rules/src/test/java/org/apache/maven/plugins/enforcer/TestRequireUpperBoundDeps.java:[97,9] cannot find symbol
[windows-jdk10] [ERROR]   symbol:   variable TestEnforcerRuleUtils
[windows-jdk10] [ERROR]   location: class org.apache.maven.plugins.enforcer.TestRequireUpperBoundDeps
[windows-jdk10] [ERROR] /F:/jenkins/jenkins-slave/workspace/aven-enforcer_MENFORCER-276-ARAEEUQ3DZKGP7LK65FX6C75KHKIJYNAPASQYCZKRS4IVUWL44FA/m/enforcer-rules/src/test/java/org/apache/maven/plugins/enforcer/TestRequireUpperBoundDeps.java:[107,9] cannot find symbol
[windows-jdk10] [ERROR]   symbol:   variable TestEnforcerRuleUtils
[windows-jdk10] [ERROR]   location: class org.apache.maven.plugins.enforcer.TestRequireUpperBoundDeps
[windows-jdk10] [ERROR] /F:/jenkins/jenkins-slave/workspace/aven-enforcer_MENFORCER-276-ARAEEUQ3DZKGP7LK65FX6C75KHKIJYNAPASQYCZKRS4IVUWL44FA/m/enforcer-rules/src/test/java/org/apache/maven/plugins/enforcer/TestRequireUpperBoundDeps.java:[118,9] cannot find symbol
[windows-jdk10] [ERROR]   symbol:   variable TestEnforcerRuleUtils
[windows-jdk10] [ERROR]   location: class org.apache.maven.plugins.enforcer.TestRequireUpperBoundDeps
[windows-jdk10] [ERROR] -> [Help 1]
[windows-jdk10] [ERROR] 
[windows-jdk10] [ERROR] To see the full stack trace of the errors, re-run Maven with the -e switch.
[windows-jdk10] [ERROR] Re-run Maven using the -X switch to enable full debug logging.
[windows-jdk10] [ERROR] 
[windows-jdk10] [ERROR] For more information about the errors and possible solutions, please read the following articles:
[windows-jdk10] [ERROR] [Help 1] http://cwiki.apache.org/confluence/display/MAVEN/MojoFailureException
[windows-jdk10] [ERROR] 
[windows-jdk10] [ERROR] After correcting the problems, you can resume the build with the command
[windows-jdk10] [ERROR]   mvn <goals> -rf :enforcer-rules
[Pipeline] [windows-jdk10] }
[Pipeline] [windows-jdk10] // dir
[Pipeline] [windows-jdk10] }
[windows-jdk10] [withMaven] junitPublisher - Archive test results for Maven artifact org.apache.maven.enforcer:enforcer-api:3.0.0-SNAPSHOT generated by maven-surefire-plugin:test (default-test): m\enforcer-api\target\surefire-reports\*.xml
[windows-jdk10] Recording test results
[windows-jdk10] None of the test reports contained any result
[Pipeline] [windows-jdk10] // withMaven
[Pipeline] [windows-jdk10] cleanWs
[windows-jdk10] [WS-CLEANUP] Deleting project workspace...[WS-CLEANUP] done
[Pipeline] [windows-jdk10] cleanWs
[windows-jdk10] [WS-CLEANUP] Deleting project workspace...[WS-CLEANUP] done
[Pipeline] [windows-jdk10] }
[Pipeline] [windows-jdk10] // stage
[Pipeline] [windows-jdk10] }
[Pipeline] [windows-jdk10] // node
[Pipeline] [windows-jdk10] }
[windows-jdk10] Failed in branch windows-jdk10
[Pipeline] // parallel
[Pipeline] stage
[Pipeline] { (Notifications)
[Pipeline] echo
Build result: FAILURE
[Pipeline] jiraIssueSelector
[Pipeline] emailext

Build failed in Jenkins: Maven TLP » maven-enforcer » MENFORCER-276 #10

Posted by Apache Jenkins Server <je...@builds.apache.org>.
See https://builds.apache.org/job/maven-box/job/maven-enforcer/job/MENFORCER-276/10/

Changes:

* Upgrade latest version of Maven
* [INFRA-16893] set Windows to windows-2016-1 node
* Back to Windows label
* Windows + M3.5.x = M3.5.2
* [INFRA-16893] Trying workaround
* Revert "[INFRA-16893] Trying workaround"
* Try to display PATH value

No tests ran.

Build log:
[...truncated 2.19 MB...]
[windows-jdk10] [INFO] Downloaded from central: https://repo.maven.apache.org/maven2/org/apache/maven/shared/maven-shared-incremental/1.1/maven-shared-incremental-1.1.jar (14 kB at 40 kB/s)
[windows-jdk10] [INFO] Downloaded from central: https://repo.maven.apache.org/maven2/org/codehaus/plexus/plexus-java/0.9.2/plexus-java-0.9.2.jar (31 kB at 78 kB/s)
[windows-jdk10] [INFO] Changes detected - recompiling the module!
[windows-jdk10] [INFO] Compiling 5 source files to F:\jenkins\jenkins-slave\workspace\aven-enforcer_MENFORCER-276-ARAEEUQ3DZKGP7LK65FX6C75KHKIJYNAPASQYCZKRS4IVUWL44FA\m\enforcer-api\target\classes
[windows-jdk10] [INFO] 
[windows-jdk10] [INFO] --- maven-resources-plugin:3.0.2:testResources (default-testResources) @ enforcer-api ---
[windows-jdk10] [INFO] Using 'UTF-8' encoding to copy filtered resources.
[windows-jdk10] [INFO] skip non existing resourceDirectory F:\jenkins\jenkins-slave\workspace\aven-enforcer_MENFORCER-276-ARAEEUQ3DZKGP7LK65FX6C75KHKIJYNAPASQYCZKRS4IVUWL44FA\m\enforcer-api\src\test\resources
[windows-jdk10] [INFO] Copying 3 resources
[windows-jdk10] [INFO] 
[windows-jdk10] [INFO] --- maven-compiler-plugin:3.7.0:testCompile (default-testCompile) @ enforcer-api ---
[windows-jdk10] [INFO] No sources to compile
[windows-jdk10] [INFO] 
[windows-jdk10] [INFO] --- maven-surefire-plugin:2.21.0:test (default-test) @ enforcer-api ---
[windows-jdk10] [INFO] Downloading from central: https://repo.maven.apache.org/maven2/org/apache/maven/surefire/maven-surefire-common/2.21.0/maven-surefire-common-2.21.0.pom
[windows-jdk10] [INFO] Downloaded from central: https://repo.maven.apache.org/maven2/org/apache/maven/surefire/maven-surefire-common/2.21.0/maven-surefire-common-2.21.0.pom (11 kB at 516 kB/s)
[windows-jdk10] [INFO] Downloading from central: https://repo.maven.apache.org/maven2/org/apache/maven/plugin-tools/maven-plugin-annotations/3.5/maven-plugin-annotations-3.5.pom
[windows-jdk10] [INFO] Downloaded from central: https://repo.maven.apache.org/maven2/org/apache/maven/plugin-tools/maven-plugin-annotations/3.5/maven-plugin-annotations-3.5.pom (1.7 kB at 25 kB/s)
[windows-jdk10] [INFO] Downloading from central: https://repo.maven.apache.org/maven2/org/apache/maven/plugin-tools/maven-plugin-tools/3.5/maven-plugin-tools-3.5.pom
[windows-jdk10] [INFO] Downloaded from central: https://repo.maven.apache.org/maven2/org/apache/maven/plugin-tools/maven-plugin-tools/3.5/maven-plugin-tools-3.5.pom (16 kB at 952 kB/s)
[windows-jdk10] [INFO] Downloading from central: https://repo.maven.apache.org/maven2/org/apache/maven/surefire/surefire-api/2.21.0/surefire-api-2.21.0.pom
[windows-jdk10] [INFO] Downloaded from central: https://repo.maven.apache.org/maven2/org/apache/maven/surefire/surefire-api/2.21.0/surefire-api-2.21.0.pom (3.5 kB at 197 kB/s)
[windows-jdk10] [INFO] Downloading from central: https://repo.maven.apache.org/maven2/org/apache/maven/surefire/surefire-logger-api/2.21.0/surefire-logger-api-2.21.0.pom
[windows-jdk10] [INFO] Downloaded from central: https://repo.maven.apache.org/maven2/org/apache/maven/surefire/surefire-logger-api/2.21.0/surefire-logger-api-2.21.0.pom (2.0 kB at 80 kB/s)
[windows-jdk10] [INFO] Downloading from central: https://repo.maven.apache.org/maven2/org/apache/maven/surefire/surefire-booter/2.21.0/surefire-booter-2.21.0.pom
[windows-jdk10] [INFO] Downloaded from central: https://repo.maven.apache.org/maven2/org/apache/maven/surefire/surefire-booter/2.21.0/surefire-booter-2.21.0.pom (7.4 kB at 818 kB/s)
[windows-jdk10] [INFO] Downloading from central: https://repo.maven.apache.org/maven2/org/apache/maven/maven-toolchain/2.2.1/maven-toolchain-2.2.1.pom
[windows-jdk10] [INFO] Downloaded from central: https://repo.maven.apache.org/maven2/org/apache/maven/maven-toolchain/2.2.1/maven-toolchain-2.2.1.pom (3.3 kB at 257 kB/s)
[windows-jdk10] [INFO] Downloading from central: https://repo.maven.apache.org/maven2/org/codehaus/plexus/plexus-java/0.9.3/plexus-java-0.9.3.pom
[windows-jdk10] [INFO] Downloaded from central: https://repo.maven.apache.org/maven2/org/codehaus/plexus/plexus-java/0.9.3/plexus-java-0.9.3.pom (2.4 kB at 214 kB/s)
[windows-jdk10] [INFO] Downloading from central: https://repo.maven.apache.org/maven2/org/codehaus/plexus/plexus-languages/0.9.3/plexus-languages-0.9.3.pom
[windows-jdk10] [INFO] Downloaded from central: https://repo.maven.apache.org/maven2/org/codehaus/plexus/plexus-languages/0.9.3/plexus-languages-0.9.3.pom (2.2 kB at 200 kB/s)
[windows-jdk10] [INFO] Downloading from central: https://repo.maven.apache.org/maven2/org/apache/maven/surefire/maven-surefire-common/2.21.0/maven-surefire-common-2.21.0.jar
[windows-jdk10] [INFO] Downloading from central: https://repo.maven.apache.org/maven2/org/apache/maven/surefire/surefire-logger-api/2.21.0/surefire-logger-api-2.21.0.jar
[windows-jdk10] [INFO] Downloading from central: https://repo.maven.apache.org/maven2/org/apache/maven/plugin-tools/maven-plugin-annotations/3.5/maven-plugin-annotations-3.5.jar
[windows-jdk10] [INFO] Downloading from central: https://repo.maven.apache.org/maven2/org/apache/maven/surefire/surefire-api/2.21.0/surefire-api-2.21.0.jar
[windows-jdk10] [INFO] Downloading from central: https://repo.maven.apache.org/maven2/org/apache/maven/surefire/surefire-booter/2.21.0/surefire-booter-2.21.0.jar
[windows-jdk10] [INFO] Downloaded from central: https://repo.maven.apache.org/maven2/org/apache/maven/surefire/surefire-api/2.21.0/surefire-api-2.21.0.jar (185 kB at 6.6 MB/s)
[windows-jdk10] [INFO] Downloading from central: https://repo.maven.apache.org/maven2/junit/junit/4.12/junit-4.12.jar
[windows-jdk10] [INFO] Downloaded from central: https://repo.maven.apache.org/maven2/org/apache/maven/surefire/maven-surefire-common/2.21.0/maven-surefire-common-2.21.0.jar (521 kB at 19 MB/s)
[windows-jdk10] [INFO] Downloading from central: https://repo.maven.apache.org/maven2/org/apache/maven/maven-toolchain/2.2.1/maven-toolchain-2.2.1.jar
[windows-jdk10] [INFO] Downloaded from central: https://repo.maven.apache.org/maven2/org/apache/maven/surefire/surefire-booter/2.21.0/surefire-booter-2.21.0.jar (273 kB at 3.1 MB/s)
[windows-jdk10] [INFO] Downloading from central: https://repo.maven.apache.org/maven2/org/codehaus/plexus/plexus-java/0.9.3/plexus-java-0.9.3.jar
[windows-jdk10] [INFO] Downloaded from central: https://repo.maven.apache.org/maven2/org/apache/maven/surefire/surefire-logger-api/2.21.0/surefire-logger-api-2.21.0.jar (13 kB at 143 kB/s)
[windows-jdk10] [INFO] Downloaded from central: https://repo.maven.apache.org/maven2/org/apache/maven/plugin-tools/maven-plugin-annotations/3.5/maven-plugin-annotations-3.5.jar (14 kB at 139 kB/s)
[windows-jdk10] [INFO] Downloaded from central: https://repo.maven.apache.org/maven2/junit/junit/4.12/junit-4.12.jar (315 kB at 3.0 MB/s)
[windows-jdk10] [INFO] Downloaded from central: https://repo.maven.apache.org/maven2/org/codehaus/plexus/plexus-java/0.9.3/plexus-java-0.9.3.jar (32 kB at 122 kB/s)
[windows-jdk10] [INFO] Downloaded from central: https://repo.maven.apache.org/maven2/org/apache/maven/maven-toolchain/2.2.1/maven-toolchain-2.2.1.jar (38 kB at 135 kB/s)
[windows-jdk10] [INFO] 
[windows-jdk10] [INFO] --- maven-jar-plugin:3.0.2:jar (default-jar) @ enforcer-api ---
[windows-jdk10] [INFO] Downloading from central: https://repo.maven.apache.org/maven2/org/apache/maven/shared/maven-shared-utils/3.0.1/maven-shared-utils-3.0.1.jar
[windows-jdk10] [INFO] Downloaded from central: https://repo.maven.apache.org/maven2/org/apache/maven/shared/maven-shared-utils/3.0.1/maven-shared-utils-3.0.1.jar (154 kB at 5.0 MB/s)
[windows-jdk10] [INFO] Building jar: F:\jenkins\jenkins-slave\workspace\aven-enforcer_MENFORCER-276-ARAEEUQ3DZKGP7LK65FX6C75KHKIJYNAPASQYCZKRS4IVUWL44FA\m\enforcer-api\target\enforcer-api-3.0.0-SNAPSHOT.jar
[windows-jdk10] [INFO] 
[windows-jdk10] [INFO] --- maven-site-plugin:3.7:attach-descriptor (attach-descriptor) @ enforcer-api ---
[windows-jdk10] [INFO] Skipping because packaging 'jar' is not pom.
[windows-jdk10] [INFO] 
[windows-jdk10] [INFO] --- maven-checkstyle-plugin:3.0.0:check (checkstyle-check) @ enforcer-api ---
[windows-jdk10] [INFO] 
[windows-jdk10] [INFO] ------------------------------------------------------------------------
[windows-jdk10] [INFO] Building Apache Maven Enforcer Built-In Rules 3.0.0-SNAPSHOT
[windows-jdk10] [INFO] ------------------------------------------------------------------------
[windows-jdk10] [INFO] Downloading from central: https://repo.maven.apache.org/maven2/org/apache/maven/shared/maven-common-artifact-filters/3.0.1/maven-common-artifact-filters-3.0.1.pom
[windows-jdk10] [INFO] Downloaded from central: https://repo.maven.apache.org/maven2/org/apache/maven/shared/maven-common-artifact-filters/3.0.1/maven-common-artifact-filters-3.0.1.pom (4.8 kB at 537 kB/s)
[windows-jdk10] [INFO] Downloading from central: https://repo.maven.apache.org/maven2/org/apache/maven/plugin-testing/maven-plugin-testing-harness/2.1/maven-plugin-testing-harness-2.1.pom
[windows-jdk10] [INFO] Downloaded from central: https://repo.maven.apache.org/maven2/org/apache/maven/plugin-testing/maven-plugin-testing-harness/2.1/maven-plugin-testing-harness-2.1.pom (3.2 kB at 248 kB/s)
[windows-jdk10] [INFO] Downloading from central: https://repo.maven.apache.org/maven2/org/apache/maven/plugin-testing/maven-plugin-testing/2.1/maven-plugin-testing-2.1.pom
[windows-jdk10] [INFO] Downloaded from central: https://repo.maven.apache.org/maven2/org/apache/maven/plugin-testing/maven-plugin-testing/2.1/maven-plugin-testing-2.1.pom (10 kB at 170 kB/s)
[windows-jdk10] [INFO] Downloading from central: https://repo.maven.apache.org/maven2/commons-codec/commons-codec/1.6/commons-codec-1.6.pom
[windows-jdk10] [INFO] Downloaded from central: https://repo.maven.apache.org/maven2/commons-codec/commons-codec/1.6/commons-codec-1.6.pom (11 kB at 465 kB/s)
[windows-jdk10] [INFO] Downloading from central: https://repo.maven.apache.org/maven2/org/apache/commons/commons-parent/22/commons-parent-22.pom
[windows-jdk10] [INFO] Downloaded from central: https://repo.maven.apache.org/maven2/org/apache/commons/commons-parent/22/commons-parent-22.pom (42 kB at 1.3 MB/s)
[windows-jdk10] [INFO] Downloading from central: https://repo.maven.apache.org/maven2/org/mockito/mockito-core/2.18.3/mockito-core-2.18.3.pom
[windows-jdk10] [INFO] Downloaded from central: https://repo.maven.apache.org/maven2/org/mockito/mockito-core/2.18.3/mockito-core-2.18.3.pom (16 kB at 1.1 MB/s)
[windows-jdk10] [INFO] Downloading from central: https://repo.maven.apache.org/maven2/net/bytebuddy/byte-buddy/1.8.5/byte-buddy-1.8.5.pom
[windows-jdk10] [INFO] Downloaded from central: https://repo.maven.apache.org/maven2/net/bytebuddy/byte-buddy/1.8.5/byte-buddy-1.8.5.pom (12 kB at 467 kB/s)
[windows-jdk10] [INFO] Downloading from central: https://repo.maven.apache.org/maven2/net/bytebuddy/byte-buddy-parent/1.8.5/byte-buddy-parent-1.8.5.pom
[windows-jdk10] [INFO] Downloaded from central: https://repo.maven.apache.org/maven2/net/bytebuddy/byte-buddy-parent/1.8.5/byte-buddy-parent-1.8.5.pom (27 kB at 897 kB/s)
[windows-jdk10] [INFO] Downloading from central: https://repo.maven.apache.org/maven2/net/bytebuddy/byte-buddy-agent/1.8.5/byte-buddy-agent-1.8.5.pom
[windows-jdk10] [INFO] Downloaded from central: https://repo.maven.apache.org/maven2/net/bytebuddy/byte-buddy-agent/1.8.5/byte-buddy-agent-1.8.5.pom (4.9 kB at 205 kB/s)
[windows-jdk10] [INFO] Downloading from central: https://repo.maven.apache.org/maven2/org/objenesis/objenesis/2.6/objenesis-2.6.pom
[windows-jdk10] [INFO] Downloaded from central: https://repo.maven.apache.org/maven2/org/objenesis/objenesis/2.6/objenesis-2.6.pom (2.8 kB at 253 kB/s)
[windows-jdk10] [INFO] Downloading from central: https://repo.maven.apache.org/maven2/org/objenesis/objenesis-parent/2.6/objenesis-parent-2.6.pom
[windows-jdk10] [INFO] Downloaded from central: https://repo.maven.apache.org/maven2/org/objenesis/objenesis-parent/2.6/objenesis-parent-2.6.pom (17 kB at 1.4 MB/s)
[windows-jdk10] [INFO] Downloading from central: https://repo.maven.apache.org/maven2/org/apache/maven/maven-compat/3.0/maven-compat-3.0.pom
[windows-jdk10] [INFO] Downloaded from central: https://repo.maven.apache.org/maven2/org/apache/maven/maven-compat/3.0/maven-compat-3.0.pom (4.0 kB at 287 kB/s)
[windows-jdk10] [INFO] Downloading from central: https://repo.maven.apache.org/maven2/org/apache/maven/wagon/wagon-provider-api/1.0-beta-6/wagon-provider-api-1.0-beta-6.pom
[windows-jdk10] [INFO] Downloaded from central: https://repo.maven.apache.org/maven2/org/apache/maven/wagon/wagon-provider-api/1.0-beta-6/wagon-provider-api-1.0-beta-6.pom (1.8 kB at 126 kB/s)
[windows-jdk10] [INFO] Downloading from central: https://repo.maven.apache.org/maven2/org/apache/maven/wagon/wagon/1.0-beta-6/wagon-1.0-beta-6.pom
[windows-jdk10] [INFO] Downloaded from central: https://repo.maven.apache.org/maven2/org/apache/maven/wagon/wagon/1.0-beta-6/wagon-1.0-beta-6.pom (12 kB at 885 kB/s)
[windows-jdk10] [INFO] Downloading from central: https://repo.maven.apache.org/maven2/org/assertj/assertj-core/1.7.1/assertj-core-1.7.1.pom
[windows-jdk10] [INFO] Downloaded from central: https://repo.maven.apache.org/maven2/org/assertj/assertj-core/1.7.1/assertj-core-1.7.1.pom (4.7 kB at 390 kB/s)
[windows-jdk10] [INFO] Downloading from central: https://repo.maven.apache.org/maven2/org/assertj/assertj-parent-pom/1.2.6/assertj-parent-pom-1.2.6.pom
[windows-jdk10] [INFO] Downloaded from central: https://repo.maven.apache.org/maven2/org/assertj/assertj-parent-pom/1.2.6/assertj-parent-pom-1.2.6.pom (13 kB at 1.1 MB/s)
[windows-jdk10] [INFO] Downloading from central: https://repo.maven.apache.org/maven2/org/apache/commons/commons-lang3/3.5/commons-lang3-3.5.jar
[windows-jdk10] [INFO] Downloading from central: https://repo.maven.apache.org/maven2/commons-codec/commons-codec/1.6/commons-codec-1.6.jar
[windows-jdk10] [INFO] Downloading from central: https://repo.maven.apache.org/maven2/org/mockito/mockito-core/2.18.3/mockito-core-2.18.3.jar
[windows-jdk10] [INFO] Downloading from central: https://repo.maven.apache.org/maven2/org/apache/maven/shared/maven-common-artifact-filters/3.0.1/maven-common-artifact-filters-3.0.1.jar
[windows-jdk10] [INFO] Downloading from central: https://repo.maven.apache.org/maven2/org/apache/maven/plugin-testing/maven-plugin-testing-harness/2.1/maven-plugin-testing-harness-2.1.jar
[windows-jdk10] [INFO] Downloaded from central: https://repo.maven.apache.org/maven2/org/apache/commons/commons-lang3/3.5/commons-lang3-3.5.jar (480 kB at 7.7 MB/s)
[windows-jdk10] [INFO] Downloading from central: https://repo.maven.apache.org/maven2/net/bytebuddy/byte-buddy/1.8.5/byte-buddy-1.8.5.jar
[windows-jdk10] [INFO] Downloaded from central: https://repo.maven.apache.org/maven2/org/apache/maven/shared/maven-common-artifact-filters/3.0.1/maven-common-artifact-filters-3.0.1.jar (61 kB at 891 kB/s)
[windows-jdk10] [INFO] Downloading from central: https://repo.maven.apache.org/maven2/net/bytebuddy/byte-buddy-agent/1.8.5/byte-buddy-agent-1.8.5.jar
[windows-jdk10] [INFO] Downloaded from central: https://repo.maven.apache.org/maven2/org/mockito/mockito-core/2.18.3/mockito-core-2.18.3.jar (556 kB at 7.5 MB/s)
[windows-jdk10] [INFO] Downloading from central: https://repo.maven.apache.org/maven2/org/objenesis/objenesis/2.6/objenesis-2.6.jar
[windows-jdk10] [INFO] Downloaded from central: https://repo.maven.apache.org/maven2/org/objenesis/objenesis/2.6/objenesis-2.6.jar (56 kB at 480 kB/s)
[windows-jdk10] [INFO] Downloading from central: https://repo.maven.apache.org/maven2/org/apache/maven/maven-compat/3.0/maven-compat-3.0.jar
[windows-jdk10] [INFO] Downloaded from central: https://repo.maven.apache.org/maven2/commons-codec/commons-codec/1.6/commons-codec-1.6.jar (233 kB at 1.9 MB/s)
[windows-jdk10] [INFO] Downloading from central: https://repo.maven.apache.org/maven2/org/apache/maven/wagon/wagon-provider-api/1.0-beta-6/wagon-provider-api-1.0-beta-6.jar
[windows-jdk10] [INFO] Downloaded from central: https://repo.maven.apache.org/maven2/org/apache/maven/wagon/wagon-provider-api/1.0-beta-6/wagon-provider-api-1.0-beta-6.jar (53 kB at 383 kB/s)
[windows-jdk10] [INFO] Downloading from central: https://repo.maven.apache.org/maven2/org/assertj/assertj-core/1.7.1/assertj-core-1.7.1.jar
[windows-jdk10] [INFO] Downloaded from central: https://repo.maven.apache.org/maven2/org/apache/maven/maven-compat/3.0/maven-compat-3.0.jar (285 kB at 1.7 MB/s)
[windows-jdk10] [INFO] Downloaded from central: https://repo.maven.apache.org/maven2/org/assertj/assertj-core/1.7.1/assertj-core-1.7.1.jar (619 kB at 3.7 MB/s)
[windows-jdk10] [INFO] Downloaded from central: https://repo.maven.apache.org/maven2/net/bytebuddy/byte-buddy/1.8.5/byte-buddy-1.8.5.jar (3.0 MB at 18 MB/s)
[windows-jdk10] [INFO] Downloaded from central: https://repo.maven.apache.org/maven2/org/apache/maven/plugin-testing/maven-plugin-testing-harness/2.1/maven-plugin-testing-harness-2.1.jar (39 kB at 222 kB/s)
[windows-jdk10] [INFO] Downloaded from central: https://repo.maven.apache.org/maven2/net/bytebuddy/byte-buddy-agent/1.8.5/byte-buddy-agent-1.8.5.jar (40 kB at 162 kB/s)
[windows-jdk10] [INFO] 
[windows-jdk10] [INFO] --- maven-clean-plugin:3.0.0:clean (default-clean) @ enforcer-rules ---
[windows-jdk10] [INFO] 
[windows-jdk10] [INFO] --- maven-enforcer-plugin:1.4.1:enforce (enforce-maven-version) @ enforcer-rules ---
[windows-jdk10] [INFO] 
[windows-jdk10] [INFO] --- maven-enforcer-plugin:1.4.1:enforce (enforce-bytecode-version) @ enforcer-rules ---
[windows-jdk10] [INFO] 
[windows-jdk10] [INFO] --- maven-enforcer-plugin:1.4.1:enforce (ban-known-bad-maven-versions) @ enforcer-rules ---
[windows-jdk10] [INFO] 
[windows-jdk10] [INFO] --- apache-rat-plugin:0.12:check (rat-check) @ enforcer-rules ---
[windows-jdk10] [INFO] Enabled default license matchers.
[windows-jdk10] [INFO] Will parse SCM ignores for exclusions...
[windows-jdk10] [INFO] Finished adding exclusions from SCM ignore files.
[windows-jdk10] [INFO] 61 implicit excludes (use -debug for more details).
[windows-jdk10] [INFO] Exclude: .repository/**
[windows-jdk10] [INFO] Exclude: .maven/spy.log
[windows-jdk10] [INFO] Exclude: dependency-reduced-pom.xml
[windows-jdk10] [INFO] Exclude: .java-version
[windows-jdk10] [INFO] 130 resources included (use -debug for more details)
[windows-jdk10] [INFO] Rat check: Summary over all files. Unapproved: 0, unknown: 0, generated: 0, approved: 124 licenses.
[windows-jdk10] [INFO] 
[windows-jdk10] [INFO] --- maven-remote-resources-plugin:1.5:process (process-resource-bundles) @ enforcer-rules ---
[windows-jdk10] [INFO] 
[windows-jdk10] [INFO] --- maven-resources-plugin:3.0.2:resources (default-resources) @ enforcer-rules ---
[windows-jdk10] [INFO] Using 'UTF-8' encoding to copy filtered resources.
[windows-jdk10] [INFO] skip non existing resourceDirectory F:\jenkins\jenkins-slave\workspace\aven-enforcer_MENFORCER-276-ARAEEUQ3DZKGP7LK65FX6C75KHKIJYNAPASQYCZKRS4IVUWL44FA\m\enforcer-rules\src\main\resources
[windows-jdk10] [INFO] Copying 3 resources
[windows-jdk10] [INFO] 
[windows-jdk10] [INFO] --- maven-compiler-plugin:3.7.0:compile (default-compile) @ enforcer-rules ---
[windows-jdk10] [INFO] Changes detected - recompiling the module!
[windows-jdk10] [INFO] Compiling 43 source files to F:\jenkins\jenkins-slave\workspace\aven-enforcer_MENFORCER-276-ARAEEUQ3DZKGP7LK65FX6C75KHKIJYNAPASQYCZKRS4IVUWL44FA\m\enforcer-rules\target\classes
[windows-jdk10] [INFO] /F:/jenkins/jenkins-slave/workspace/aven-enforcer_MENFORCER-276-ARAEEUQ3DZKGP7LK65FX6C75KHKIJYNAPASQYCZKRS4IVUWL44FA/m/enforcer-rules/src/main/java/org/apache/maven/plugins/enforcer/RequirePluginVersions.java: Some input files use or override a deprecated API.
[windows-jdk10] [INFO] /F:/jenkins/jenkins-slave/workspace/aven-enforcer_MENFORCER-276-ARAEEUQ3DZKGP7LK65FX6C75KHKIJYNAPASQYCZKRS4IVUWL44FA/m/enforcer-rules/src/main/java/org/apache/maven/plugins/enforcer/RequirePluginVersions.java: Recompile with -Xlint:deprecation for details.
[windows-jdk10] [INFO] /F:/jenkins/jenkins-slave/workspace/aven-enforcer_MENFORCER-276-ARAEEUQ3DZKGP7LK65FX6C75KHKIJYNAPASQYCZKRS4IVUWL44FA/m/enforcer-rules/src/main/java/org/apache/maven/plugins/enforcer/RequirePluginVersions.java: F:\jenkins\jenkins-slave\workspace\aven-enforcer_MENFORCER-276-ARAEEUQ3DZKGP7LK65FX6C75KHKIJYNAPASQYCZKRS4IVUWL44FA\m\enforcer-rules\src\main\java\org\apache\maven\plugins\enforcer\RequirePluginVersions.java uses unchecked or unsafe operations.
[windows-jdk10] [INFO] /F:/jenkins/jenkins-slave/workspace/aven-enforcer_MENFORCER-276-ARAEEUQ3DZKGP7LK65FX6C75KHKIJYNAPASQYCZKRS4IVUWL44FA/m/enforcer-rules/src/main/java/org/apache/maven/plugins/enforcer/RequirePluginVersions.java: Recompile with -Xlint:unchecked for details.
[windows-jdk10] [INFO] 
[windows-jdk10] [INFO] --- maven-resources-plugin:3.0.2:testResources (default-testResources) @ enforcer-rules ---
[windows-jdk10] [INFO] Using 'UTF-8' encoding to copy filtered resources.
[windows-jdk10] [INFO] Copying 11 resources
[windows-jdk10] [INFO] Copying 3 resources
[windows-jdk10] [INFO] 
[windows-jdk10] [INFO] --- maven-compiler-plugin:3.7.0:testCompile (default-testCompile) @ enforcer-rules ---
[windows-jdk10] [INFO] Changes detected - recompiling the module!
[windows-jdk10] [INFO] Compiling 35 source files to F:\jenkins\jenkins-slave\workspace\aven-enforcer_MENFORCER-276-ARAEEUQ3DZKGP7LK65FX6C75KHKIJYNAPASQYCZKRS4IVUWL44FA\m\enforcer-rules\target\test-classes
[windows-jdk10] [INFO] /F:/jenkins/jenkins-slave/workspace/aven-enforcer_MENFORCER-276-ARAEEUQ3DZKGP7LK65FX6C75KHKIJYNAPASQYCZKRS4IVUWL44FA/m/enforcer-rules/src/test/java/org/apache/maven/plugins/enforcer/TestRequireUpperBoundDeps.java: Some input files use or override a deprecated API.
[windows-jdk10] [INFO] /F:/jenkins/jenkins-slave/workspace/aven-enforcer_MENFORCER-276-ARAEEUQ3DZKGP7LK65FX6C75KHKIJYNAPASQYCZKRS4IVUWL44FA/m/enforcer-rules/src/test/java/org/apache/maven/plugins/enforcer/TestRequireUpperBoundDeps.java: Recompile with -Xlint:deprecation for details.
[windows-jdk10] [INFO] /F:/jenkins/jenkins-slave/workspace/aven-enforcer_MENFORCER-276-ARAEEUQ3DZKGP7LK65FX6C75KHKIJYNAPASQYCZKRS4IVUWL44FA/m/enforcer-rules/src/test/java/org/apache/maven/plugins/enforcer/MockPlexusContainer.java: Some input files use unchecked or unsafe operations.
[windows-jdk10] [INFO] /F:/jenkins/jenkins-slave/workspace/aven-enforcer_MENFORCER-276-ARAEEUQ3DZKGP7LK65FX6C75KHKIJYNAPASQYCZKRS4IVUWL44FA/m/enforcer-rules/src/test/java/org/apache/maven/plugins/enforcer/MockPlexusContainer.java: Recompile with -Xlint:unchecked for details.
[windows-jdk10] [INFO] -------------------------------------------------------------
[windows-jdk10] [ERROR] COMPILATION ERROR : 
[windows-jdk10] [INFO] -------------------------------------------------------------
[windows-jdk10] [ERROR] /F:/jenkins/jenkins-slave/workspace/aven-enforcer_MENFORCER-276-ARAEEUQ3DZKGP7LK65FX6C75KHKIJYNAPASQYCZKRS4IVUWL44FA/m/enforcer-rules/src/test/java/org/apache/maven/plugins/enforcer/TestRequireUpperBoundDeps.java:[14,47] cannot find symbol
[windows-jdk10]   symbol:   class TestEnforcerRuleUtils
[windows-jdk10]   location: package org.apache.maven.plugins.enforcer.utils
[windows-jdk10] [ERROR] /F:/jenkins/jenkins-slave/workspace/aven-enforcer_MENFORCER-276-ARAEEUQ3DZKGP7LK65FX6C75KHKIJYNAPASQYCZKRS4IVUWL44FA/m/enforcer-rules/src/test/java/org/apache/maven/plugins/enforcer/TestRequireUpperBoundDeps.java:[87,9] cannot find symbol
[windows-jdk10]   symbol:   variable TestEnforcerRuleUtils
[windows-jdk10]   location: class org.apache.maven.plugins.enforcer.TestRequireUpperBoundDeps
[windows-jdk10] [ERROR] /F:/jenkins/jenkins-slave/workspace/aven-enforcer_MENFORCER-276-ARAEEUQ3DZKGP7LK65FX6C75KHKIJYNAPASQYCZKRS4IVUWL44FA/m/enforcer-rules/src/test/java/org/apache/maven/plugins/enforcer/TestRequireUpperBoundDeps.java:[97,9] cannot find symbol
[windows-jdk10]   symbol:   variable TestEnforcerRuleUtils
[windows-jdk10]   location: class org.apache.maven.plugins.enforcer.TestRequireUpperBoundDeps
[windows-jdk10] [ERROR] /F:/jenkins/jenkins-slave/workspace/aven-enforcer_MENFORCER-276-ARAEEUQ3DZKGP7LK65FX6C75KHKIJYNAPASQYCZKRS4IVUWL44FA/m/enforcer-rules/src/test/java/org/apache/maven/plugins/enforcer/TestRequireUpperBoundDeps.java:[107,9] cannot find symbol
[windows-jdk10]   symbol:   variable TestEnforcerRuleUtils
[windows-jdk10]   location: class org.apache.maven.plugins.enforcer.TestRequireUpperBoundDeps
[windows-jdk10] [ERROR] /F:/jenkins/jenkins-slave/workspace/aven-enforcer_MENFORCER-276-ARAEEUQ3DZKGP7LK65FX6C75KHKIJYNAPASQYCZKRS4IVUWL44FA/m/enforcer-rules/src/test/java/org/apache/maven/plugins/enforcer/TestRequireUpperBoundDeps.java:[118,9] cannot find symbol
[windows-jdk10]   symbol:   variable TestEnforcerRuleUtils
[windows-jdk10]   location: class org.apache.maven.plugins.enforcer.TestRequireUpperBoundDeps
[windows-jdk10] [INFO] 5 errors 
[windows-jdk10] [INFO] -------------------------------------------------------------
[windows-jdk10] [INFO] ------------------------------------------------------------------------
[windows-jdk10] [INFO] Reactor Summary:
[windows-jdk10] [INFO] 
[windows-jdk10] [INFO] Apache Maven Enforcer .............................. SUCCESS [ 28.098 s]
[windows-jdk10] [INFO] Apache Maven Enforcer API .......................... SUCCESS [  6.589 s]
[windows-jdk10] [INFO] Apache Maven Enforcer Built-In Rules ............... FAILURE [  6.127 s]
[windows-jdk10] [INFO] Apache Maven Enforcer Plugin ....................... SKIPPED
[windows-jdk10] [INFO] ------------------------------------------------------------------------
[windows-jdk10] [INFO] BUILD FAILURE
[windows-jdk10] [INFO] ------------------------------------------------------------------------
[windows-jdk10] [INFO] Total time: 41.475 s
[windows-jdk10] [INFO] Finished at: 2018-08-17T05:35:10Z
[windows-jdk10] [INFO] Final Memory: 38M/137M
[windows-jdk10] [INFO] ------------------------------------------------------------------------
[windows-jdk10] [INFO] [jenkins-event-spy] Generated F:\jenkins\jenkins-slave\workspace\aven-enforcer_MENFORCER-276-ARAEEUQ3DZKGP7LK65FX6C75KHKIJYNAPASQYCZKRS4IVUWL44FA@tmp\withMaven0d7127a4\maven-spy-20180817-053428-8273186047668503276382.log
[windows-jdk10] [ERROR] Failed to execute goal org.apache.maven.plugins:maven-compiler-plugin:3.7.0:testCompile (default-testCompile) on project enforcer-rules: Compilation failure: Compilation failure: 
[windows-jdk10] [ERROR] /F:/jenkins/jenkins-slave/workspace/aven-enforcer_MENFORCER-276-ARAEEUQ3DZKGP7LK65FX6C75KHKIJYNAPASQYCZKRS4IVUWL44FA/m/enforcer-rules/src/test/java/org/apache/maven/plugins/enforcer/TestRequireUpperBoundDeps.java:[14,47] cannot find symbol
[windows-jdk10] [ERROR]   symbol:   class TestEnforcerRuleUtils
[windows-jdk10] [ERROR]   location: package org.apache.maven.plugins.enforcer.utils
[windows-jdk10] [ERROR] /F:/jenkins/jenkins-slave/workspace/aven-enforcer_MENFORCER-276-ARAEEUQ3DZKGP7LK65FX6C75KHKIJYNAPASQYCZKRS4IVUWL44FA/m/enforcer-rules/src/test/java/org/apache/maven/plugins/enforcer/TestRequireUpperBoundDeps.java:[87,9] cannot find symbol
[windows-jdk10] [ERROR]   symbol:   variable TestEnforcerRuleUtils
[windows-jdk10] [ERROR]   location: class org.apache.maven.plugins.enforcer.TestRequireUpperBoundDeps
[windows-jdk10] [ERROR] /F:/jenkins/jenkins-slave/workspace/aven-enforcer_MENFORCER-276-ARAEEUQ3DZKGP7LK65FX6C75KHKIJYNAPASQYCZKRS4IVUWL44FA/m/enforcer-rules/src/test/java/org/apache/maven/plugins/enforcer/TestRequireUpperBoundDeps.java:[97,9] cannot find symbol
[windows-jdk10] [ERROR]   symbol:   variable TestEnforcerRuleUtils
[windows-jdk10] [ERROR]   location: class org.apache.maven.plugins.enforcer.TestRequireUpperBoundDeps
[windows-jdk10] [ERROR] /F:/jenkins/jenkins-slave/workspace/aven-enforcer_MENFORCER-276-ARAEEUQ3DZKGP7LK65FX6C75KHKIJYNAPASQYCZKRS4IVUWL44FA/m/enforcer-rules/src/test/java/org/apache/maven/plugins/enforcer/TestRequireUpperBoundDeps.java:[107,9] cannot find symbol
[windows-jdk10] [ERROR]   symbol:   variable TestEnforcerRuleUtils
[windows-jdk10] [ERROR]   location: class org.apache.maven.plugins.enforcer.TestRequireUpperBoundDeps
[windows-jdk10] [ERROR] /F:/jenkins/jenkins-slave/workspace/aven-enforcer_MENFORCER-276-ARAEEUQ3DZKGP7LK65FX6C75KHKIJYNAPASQYCZKRS4IVUWL44FA/m/enforcer-rules/src/test/java/org/apache/maven/plugins/enforcer/TestRequireUpperBoundDeps.java:[118,9] cannot find symbol
[windows-jdk10] [ERROR]   symbol:   variable TestEnforcerRuleUtils
[windows-jdk10] [ERROR]   location: class org.apache.maven.plugins.enforcer.TestRequireUpperBoundDeps
[windows-jdk10] [ERROR] -> [Help 1]
[windows-jdk10] [ERROR] 
[windows-jdk10] [ERROR] To see the full stack trace of the errors, re-run Maven with the -e switch.
[windows-jdk10] [ERROR] Re-run Maven using the -X switch to enable full debug logging.
[windows-jdk10] [ERROR] 
[windows-jdk10] [ERROR] For more information about the errors and possible solutions, please read the following articles:
[windows-jdk10] [ERROR] [Help 1] http://cwiki.apache.org/confluence/display/MAVEN/MojoFailureException
[windows-jdk10] [ERROR] 
[windows-jdk10] [ERROR] After correcting the problems, you can resume the build with the command
[windows-jdk10] [ERROR]   mvn <goals> -rf :enforcer-rules
[Pipeline] [windows-jdk10] }
[Pipeline] [windows-jdk10] // dir
[Pipeline] [windows-jdk10] }
[windows-jdk10] [withMaven] junitPublisher - Archive test results for Maven artifact org.apache.maven.enforcer:enforcer-api:3.0.0-SNAPSHOT generated by maven-surefire-plugin:test (default-test): m\enforcer-api\target\surefire-reports\*.xml
[windows-jdk10] Recording test results
[windows-jdk10] None of the test reports contained any result
[Pipeline] [windows-jdk10] // withMaven
[Pipeline] [windows-jdk10] cleanWs
[windows-jdk10] [WS-CLEANUP] Deleting project workspace...[WS-CLEANUP] done
[Pipeline] [windows-jdk10] cleanWs
[windows-jdk10] [WS-CLEANUP] Deleting project workspace...[WS-CLEANUP] done
[Pipeline] [windows-jdk10] }
[Pipeline] [windows-jdk10] // stage
[Pipeline] [windows-jdk10] }
[Pipeline] [windows-jdk10] // node
[Pipeline] [windows-jdk10] }
[windows-jdk10] Failed in branch windows-jdk10
[Pipeline] // parallel
[Pipeline] stage
[Pipeline] { (Notifications)
[Pipeline] echo
Build result: FAILURE
[Pipeline] jiraIssueSelector
[Pipeline] emailext

Build failed in Jenkins: Maven TLP » maven-enforcer » MENFORCER-276 #9

Posted by Apache Jenkins Server <je...@builds.apache.org>.
See https://builds.apache.org/job/maven-box/job/maven-enforcer/job/MENFORCER-276/9/

No changes.

No tests ran.

Build log:
[...truncated 2.11 MB...]
[windows-jdk10] [INFO] Downloading: https://repo.maven.apache.org/maven2/org/apache/commons/commons-lang3/3.5/commons-lang3-3.5.jar
[windows-jdk10] [INFO] Downloading: https://repo.maven.apache.org/maven2/org/mockito/mockito-core/2.18.3/mockito-core-2.18.3.jar
[windows-jdk10] [INFO] Downloading: https://repo.maven.apache.org/maven2/org/apache/maven/shared/maven-common-artifact-filters/3.0.1/maven-common-artifact-filters-3.0.1.jar
[windows-jdk10] [INFO] Downloading: https://repo.maven.apache.org/maven2/commons-codec/commons-codec/1.6/commons-codec-1.6.jar
[windows-jdk10] [INFO] Downloaded: https://repo.maven.apache.org/maven2/org/apache/commons/commons-lang3/3.5/commons-lang3-3.5.jar (480 kB at 6.1 MB/s)
[windows-jdk10] [INFO] Downloading: https://repo.maven.apache.org/maven2/net/bytebuddy/byte-buddy/1.8.5/byte-buddy-1.8.5.jar
[windows-jdk9] [INFO] /F:/jenkins/jenkins-slave/workspace/aven-enforcer_MENFORCER-276-ARAEEUQ3DZKGP7LK65FX6C75KHKIJYNAPASQYCZKRS4IVUWL44FA/m/enforcer-rules/src/main/java/org/apache/maven/plugins/enforcer/RequirePluginVersions.java: Some input files use or override a deprecated API.
[windows-jdk9] [INFO] /F:/jenkins/jenkins-slave/workspace/aven-enforcer_MENFORCER-276-ARAEEUQ3DZKGP7LK65FX6C75KHKIJYNAPASQYCZKRS4IVUWL44FA/m/enforcer-rules/src/main/java/org/apache/maven/plugins/enforcer/RequirePluginVersions.java: Recompile with -Xlint:deprecation for details.
[windows-jdk9] [INFO] /F:/jenkins/jenkins-slave/workspace/aven-enforcer_MENFORCER-276-ARAEEUQ3DZKGP7LK65FX6C75KHKIJYNAPASQYCZKRS4IVUWL44FA/m/enforcer-rules/src/main/java/org/apache/maven/plugins/enforcer/RequirePluginVersions.java: F:\jenkins\jenkins-slave\workspace\aven-enforcer_MENFORCER-276-ARAEEUQ3DZKGP7LK65FX6C75KHKIJYNAPASQYCZKRS4IVUWL44FA\m\enforcer-rules\src\main\java\org\apache\maven\plugins\enforcer\RequirePluginVersions.java uses unchecked or unsafe operations.
[windows-jdk9] [INFO] /F:/jenkins/jenkins-slave/workspace/aven-enforcer_MENFORCER-276-ARAEEUQ3DZKGP7LK65FX6C75KHKIJYNAPASQYCZKRS4IVUWL44FA/m/enforcer-rules/src/main/java/org/apache/maven/plugins/enforcer/RequirePluginVersions.java: Recompile with -Xlint:unchecked for details.
[windows-jdk9] [INFO] 
[windows-jdk9] [INFO] --- maven-resources-plugin:3.0.2:testResources (default-testResources) @ enforcer-rules ---
[windows-jdk9] [INFO] Using 'UTF-8' encoding to copy filtered resources.
[windows-jdk9] [INFO] Copying 11 resources
[windows-jdk9] [INFO] Copying 3 resources
[windows-jdk9] [INFO] 
[windows-jdk9] [INFO] --- maven-compiler-plugin:3.7.0:testCompile (default-testCompile) @ enforcer-rules ---
[windows-jdk9] [INFO] Changes detected - recompiling the module!
[windows-jdk9] [INFO] Compiling 35 source files to F:\jenkins\jenkins-slave\workspace\aven-enforcer_MENFORCER-276-ARAEEUQ3DZKGP7LK65FX6C75KHKIJYNAPASQYCZKRS4IVUWL44FA\m\enforcer-rules\target\test-classes
[windows-jdk9] [INFO] /F:/jenkins/jenkins-slave/workspace/aven-enforcer_MENFORCER-276-ARAEEUQ3DZKGP7LK65FX6C75KHKIJYNAPASQYCZKRS4IVUWL44FA/m/enforcer-rules/src/test/java/org/apache/maven/plugins/enforcer/TestRequireUpperBoundDeps.java: Some input files use or override a deprecated API.
[windows-jdk9] [INFO] /F:/jenkins/jenkins-slave/workspace/aven-enforcer_MENFORCER-276-ARAEEUQ3DZKGP7LK65FX6C75KHKIJYNAPASQYCZKRS4IVUWL44FA/m/enforcer-rules/src/test/java/org/apache/maven/plugins/enforcer/TestRequireUpperBoundDeps.java: Recompile with -Xlint:deprecation for details.
[windows-jdk9] [INFO] /F:/jenkins/jenkins-slave/workspace/aven-enforcer_MENFORCER-276-ARAEEUQ3DZKGP7LK65FX6C75KHKIJYNAPASQYCZKRS4IVUWL44FA/m/enforcer-rules/src/test/java/org/apache/maven/plugins/enforcer/MockPlexusContainer.java: Some input files use unchecked or unsafe operations.
[windows-jdk9] [INFO] /F:/jenkins/jenkins-slave/workspace/aven-enforcer_MENFORCER-276-ARAEEUQ3DZKGP7LK65FX6C75KHKIJYNAPASQYCZKRS4IVUWL44FA/m/enforcer-rules/src/test/java/org/apache/maven/plugins/enforcer/MockPlexusContainer.java: Recompile with -Xlint:unchecked for details.
[windows-jdk9] [INFO] -------------------------------------------------------------
[windows-jdk9] [ERROR] COMPILATION ERROR : 
[windows-jdk9] [INFO] -------------------------------------------------------------
[windows-jdk9] [ERROR] /F:/jenkins/jenkins-slave/workspace/aven-enforcer_MENFORCER-276-ARAEEUQ3DZKGP7LK65FX6C75KHKIJYNAPASQYCZKRS4IVUWL44FA/m/enforcer-rules/src/test/java/org/apache/maven/plugins/enforcer/TestRequireUpperBoundDeps.java:[14,47] cannot find symbol
[windows-jdk9]   symbol:   class TestEnforcerRuleUtils
[windows-jdk9]   location: package org.apache.maven.plugins.enforcer.utils
[windows-jdk9] [ERROR] /F:/jenkins/jenkins-slave/workspace/aven-enforcer_MENFORCER-276-ARAEEUQ3DZKGP7LK65FX6C75KHKIJYNAPASQYCZKRS4IVUWL44FA/m/enforcer-rules/src/test/java/org/apache/maven/plugins/enforcer/TestRequireUpperBoundDeps.java:[87,9] cannot find symbol
[windows-jdk9]   symbol:   variable TestEnforcerRuleUtils
[windows-jdk9]   location: class org.apache.maven.plugins.enforcer.TestRequireUpperBoundDeps
[windows-jdk9] [ERROR] /F:/jenkins/jenkins-slave/workspace/aven-enforcer_MENFORCER-276-ARAEEUQ3DZKGP7LK65FX6C75KHKIJYNAPASQYCZKRS4IVUWL44FA/m/enforcer-rules/src/test/java/org/apache/maven/plugins/enforcer/TestRequireUpperBoundDeps.java:[97,9] cannot find symbol
[windows-jdk9]   symbol:   variable TestEnforcerRuleUtils
[windows-jdk9]   location: class org.apache.maven.plugins.enforcer.TestRequireUpperBoundDeps
[windows-jdk9] [ERROR] /F:/jenkins/jenkins-slave/workspace/aven-enforcer_MENFORCER-276-ARAEEUQ3DZKGP7LK65FX6C75KHKIJYNAPASQYCZKRS4IVUWL44FA/m/enforcer-rules/src/test/java/org/apache/maven/plugins/enforcer/TestRequireUpperBoundDeps.java:[107,9] cannot find symbol
[windows-jdk9]   symbol:   variable TestEnforcerRuleUtils
[windows-jdk9]   location: class org.apache.maven.plugins.enforcer.TestRequireUpperBoundDeps
[windows-jdk9] [ERROR] /F:/jenkins/jenkins-slave/workspace/aven-enforcer_MENFORCER-276-ARAEEUQ3DZKGP7LK65FX6C75KHKIJYNAPASQYCZKRS4IVUWL44FA/m/enforcer-rules/src/test/java/org/apache/maven/plugins/enforcer/TestRequireUpperBoundDeps.java:[118,9] cannot find symbol
[windows-jdk9]   symbol:   variable TestEnforcerRuleUtils
[windows-jdk9]   location: class org.apache.maven.plugins.enforcer.TestRequireUpperBoundDeps
[windows-jdk9] [INFO] 5 errors 
[windows-jdk9] [INFO] -------------------------------------------------------------
[windows-jdk9] [INFO] ------------------------------------------------------------------------
[windows-jdk9] [INFO] Reactor Summary:
[windows-jdk9] [INFO] 
[windows-jdk9] [INFO] Apache Maven Enforcer .............................. SUCCESS [ 34.162 s]
[windows-jdk9] [INFO] Apache Maven Enforcer API .......................... SUCCESS [  7.080 s]
[windows-jdk9] [INFO] Apache Maven Enforcer Built-In Rules ............... FAILURE [  5.870 s]
[windows-jdk9] [INFO] Apache Maven Enforcer Plugin ....................... SKIPPED
[windows-jdk9] [INFO] ------------------------------------------------------------------------
[windows-jdk9] [INFO] BUILD FAILURE
[windows-jdk9] [INFO] ------------------------------------------------------------------------
[windows-jdk9] [INFO] Total time: 48.528 s
[windows-jdk9] [INFO] Finished at: 2018-08-08T22:21:28-07:00
[windows-jdk9] [INFO] Final Memory: 40M/133M
[windows-jdk9] [INFO] ------------------------------------------------------------------------
[windows-jdk9] [INFO] [jenkins-event-spy] Generated F:\jenkins\jenkins-slave\workspace\aven-enforcer_MENFORCER-276-ARAEEUQ3DZKGP7LK65FX6C75KHKIJYNAPASQYCZKRS4IVUWL44FA@tmp\withMaven39172f09\maven-spy-20180808-222039-1063195592452469089460.log
[windows-jdk9] [ERROR] Failed to execute goal org.apache.maven.plugins:maven-compiler-plugin:3.7.0:testCompile (default-testCompile) on project enforcer-rules: Compilation failure: Compilation failure: 
[windows-jdk9] [ERROR] /F:/jenkins/jenkins-slave/workspace/aven-enforcer_MENFORCER-276-ARAEEUQ3DZKGP7LK65FX6C75KHKIJYNAPASQYCZKRS4IVUWL44FA/m/enforcer-rules/src/test/java/org/apache/maven/plugins/enforcer/TestRequireUpperBoundDeps.java:[14,47] cannot find symbol
[windows-jdk9] [ERROR]   symbol:   class TestEnforcerRuleUtils
[windows-jdk9] [ERROR]   location: package org.apache.maven.plugins.enforcer.utils
[windows-jdk9] [ERROR] /F:/jenkins/jenkins-slave/workspace/aven-enforcer_MENFORCER-276-ARAEEUQ3DZKGP7LK65FX6C75KHKIJYNAPASQYCZKRS4IVUWL44FA/m/enforcer-rules/src/test/java/org/apache/maven/plugins/enforcer/TestRequireUpperBoundDeps.java:[87,9] cannot find symbol
[windows-jdk9] [ERROR]   symbol:   variable TestEnforcerRuleUtils
[windows-jdk9] [ERROR]   location: class org.apache.maven.plugins.enforcer.TestRequireUpperBoundDeps
[windows-jdk9] [ERROR] /F:/jenkins/jenkins-slave/workspace/aven-enforcer_MENFORCER-276-ARAEEUQ3DZKGP7LK65FX6C75KHKIJYNAPASQYCZKRS4IVUWL44FA/m/enforcer-rules/src/test/java/org/apache/maven/plugins/enforcer/TestRequireUpperBoundDeps.java:[97,9] cannot find symbol
[windows-jdk9] [ERROR]   symbol:   variable TestEnforcerRuleUtils
[windows-jdk9] [ERROR]   location: class org.apache.maven.plugins.enforcer.TestRequireUpperBoundDeps
[windows-jdk9] [ERROR] /F:/jenkins/jenkins-slave/workspace/aven-enforcer_MENFORCER-276-ARAEEUQ3DZKGP7LK65FX6C75KHKIJYNAPASQYCZKRS4IVUWL44FA/m/enforcer-rules/src/test/java/org/apache/maven/plugins/enforcer/TestRequireUpperBoundDeps.java:[107,9] cannot find symbol
[windows-jdk9] [ERROR]   symbol:   variable TestEnforcerRuleUtils
[windows-jdk9] [ERROR]   location: class org.apache.maven.plugins.enforcer.TestRequireUpperBoundDeps
[windows-jdk9] [ERROR] /F:/jenkins/jenkins-slave/workspace/aven-enforcer_MENFORCER-276-ARAEEUQ3DZKGP7LK65FX6C75KHKIJYNAPASQYCZKRS4IVUWL44FA/m/enforcer-rules/src/test/java/org/apache/maven/plugins/enforcer/TestRequireUpperBoundDeps.java:[118,9] cannot find symbol
[windows-jdk9] [ERROR]   symbol:   variable TestEnforcerRuleUtils
[windows-jdk9] [ERROR]   location: class org.apache.maven.plugins.enforcer.TestRequireUpperBoundDeps
[windows-jdk9] [ERROR] -> [Help 1]
[windows-jdk9] [ERROR] 
[windows-jdk9] [ERROR] To see the full stack trace of the errors, re-run Maven with the -e switch.
[windows-jdk9] [ERROR] Re-run Maven using the -X switch to enable full debug logging.
[windows-jdk9] [ERROR] 
[windows-jdk9] [ERROR] For more information about the errors and possible solutions, please read the following articles:
[windows-jdk9] [ERROR] [Help 1] http://cwiki.apache.org/confluence/display/MAVEN/MojoFailureException
[windows-jdk9] [ERROR] 
[windows-jdk9] [ERROR] After correcting the problems, you can resume the build with the command
[windows-jdk9] [ERROR]   mvn <goals> -rf :enforcer-rules
[windows-jdk10] [INFO] Downloaded: https://repo.maven.apache.org/maven2/commons-codec/commons-codec/1.6/commons-codec-1.6.jar (233 kB at 1.7 MB/s)
[windows-jdk10] [INFO] Downloading: https://repo.maven.apache.org/maven2/net/bytebuddy/byte-buddy-agent/1.8.5/byte-buddy-agent-1.8.5.jar
[windows-jdk10] [INFO] Downloaded: https://repo.maven.apache.org/maven2/org/apache/maven/shared/maven-common-artifact-filters/3.0.1/maven-common-artifact-filters-3.0.1.jar (61 kB at 404 kB/s)
[windows-jdk10] [INFO] Downloading: https://repo.maven.apache.org/maven2/org/objenesis/objenesis/2.6/objenesis-2.6.jar
[windows-jdk10] [INFO] Downloaded: https://repo.maven.apache.org/maven2/org/mockito/mockito-core/2.18.3/mockito-core-2.18.3.jar (556 kB at 2.7 MB/s)
[windows-jdk10] [INFO] Downloading: https://repo.maven.apache.org/maven2/org/apache/maven/maven-compat/3.0/maven-compat-3.0.jar
[windows-jdk10] [INFO] Downloaded: https://repo.maven.apache.org/maven2/net/bytebuddy/byte-buddy/1.8.5/byte-buddy-1.8.5.jar (3.0 MB at 14 MB/s)
[windows-jdk10] [INFO] Downloading: https://repo.maven.apache.org/maven2/org/apache/maven/wagon/wagon-provider-api/1.0-beta-6/wagon-provider-api-1.0-beta-6.jar
[windows-jdk10] [INFO] Downloaded: https://repo.maven.apache.org/maven2/org/objenesis/objenesis/2.6/objenesis-2.6.jar (56 kB at 246 kB/s)
[windows-jdk10] [INFO] Downloading: https://repo.maven.apache.org/maven2/org/assertj/assertj-core/1.7.1/assertj-core-1.7.1.jar
[windows-jdk10] [INFO] Downloaded: https://repo.maven.apache.org/maven2/org/apache/maven/wagon/wagon-provider-api/1.0-beta-6/wagon-provider-api-1.0-beta-6.jar (53 kB at 217 kB/s)
[windows-jdk10] [INFO] Downloaded: https://repo.maven.apache.org/maven2/org/apache/maven/maven-compat/3.0/maven-compat-3.0.jar (285 kB at 913 kB/s)
[windows-jdk10] [INFO] Downloaded: https://repo.maven.apache.org/maven2/org/assertj/assertj-core/1.7.1/assertj-core-1.7.1.jar (619 kB at 2.0 MB/s)
[windows-jdk10] [INFO] Downloaded: https://repo.maven.apache.org/maven2/org/apache/maven/plugin-testing/maven-plugin-testing-harness/2.1/maven-plugin-testing-harness-2.1.jar (39 kB at 123 kB/s)
[windows-jdk10] [INFO] Downloaded: https://repo.maven.apache.org/maven2/net/bytebuddy/byte-buddy-agent/1.8.5/byte-buddy-agent-1.8.5.jar (40 kB at 100 kB/s)
[windows-jdk10] [INFO] 
[windows-jdk10] [INFO] --- maven-clean-plugin:3.0.0:clean (default-clean) @ enforcer-rules ---
[windows-jdk10] [INFO] 
[windows-jdk10] [INFO] --- maven-enforcer-plugin:1.4.1:enforce (enforce-maven-version) @ enforcer-rules ---
[windows-jdk10] [INFO] 
[windows-jdk10] [INFO] --- maven-enforcer-plugin:1.4.1:enforce (enforce-bytecode-version) @ enforcer-rules ---
[Pipeline] [windows-jdk9] }
[Pipeline] [windows-jdk9] // dir
[windows-jdk10] [INFO] 
[windows-jdk10] [INFO] --- maven-enforcer-plugin:1.4.1:enforce (ban-known-bad-maven-versions) @ enforcer-rules ---
[windows-jdk10] [INFO] 
[windows-jdk10] [INFO] --- apache-rat-plugin:0.12:check (rat-check) @ enforcer-rules ---
[windows-jdk10] [INFO] Enabled default license matchers.
[windows-jdk10] [INFO] Will parse SCM ignores for exclusions...
[windows-jdk10] [INFO] Finished adding exclusions from SCM ignore files.
[windows-jdk10] [INFO] 61 implicit excludes (use -debug for more details).
[windows-jdk10] [INFO] Exclude: .repository/**
[windows-jdk10] [INFO] Exclude: .maven/spy.log
[windows-jdk10] [INFO] Exclude: dependency-reduced-pom.xml
[windows-jdk10] [INFO] Exclude: .java-version
[windows-jdk10] [INFO] 130 resources included (use -debug for more details)
[Pipeline] [windows-jdk9] }
[windows-jdk9] [withMaven] junitPublisher - Archive test results for Maven artifact org.apache.maven.enforcer:enforcer-api:3.0.0-SNAPSHOT generated by maven-surefire-plugin:test (default-test): m\enforcer-api\target\surefire-reports\*.xml
[windows-jdk9] Recording test results
[windows-jdk9] None of the test reports contained any result
[Pipeline] [windows-jdk9] // withMaven
[Pipeline] [windows-jdk9] cleanWs
[windows-jdk10] [INFO] Rat check: Summary over all files. Unapproved: 0, unknown: 0, generated: 0, approved: 124 licenses.
[windows-jdk10] [INFO] 
[windows-jdk10] [INFO] --- maven-remote-resources-plugin:1.5:process (process-resource-bundles) @ enforcer-rules ---
[windows-jdk9] [WS-CLEANUP] Deleting project workspace...[WS-CLEANUP] done
[Pipeline] [windows-jdk9] cleanWs
[windows-jdk9] [WS-CLEANUP] Deleting project workspace...[WS-CLEANUP] done
[Pipeline] [windows-jdk9] }
[Pipeline] [windows-jdk9] // stage
[Pipeline] [windows-jdk9] }
[Pipeline] [windows-jdk9] // node
[Pipeline] [windows-jdk9] }
[windows-jdk9] Failed in branch windows-jdk9
[windows-jdk10] [INFO] 
[windows-jdk10] [INFO] --- maven-resources-plugin:3.0.2:resources (default-resources) @ enforcer-rules ---
[windows-jdk10] [INFO] Using 'UTF-8' encoding to copy filtered resources.
[windows-jdk10] [INFO] skip non existing resourceDirectory F:\jenkins\jenkins-slave\workspace\aven-enforcer_MENFORCER-276-ARAEEUQ3DZKGP7LK65FX6C75KHKIJYNAPASQYCZKRS4IVUWL44FA\m\enforcer-rules\src\main\resources
[windows-jdk10] [INFO] Copying 3 resources
[windows-jdk10] [INFO] 
[windows-jdk10] [INFO] --- maven-compiler-plugin:3.7.0:compile (default-compile) @ enforcer-rules ---
[windows-jdk10] [INFO] Changes detected - recompiling the module!
[windows-jdk10] [INFO] Compiling 43 source files to F:\jenkins\jenkins-slave\workspace\aven-enforcer_MENFORCER-276-ARAEEUQ3DZKGP7LK65FX6C75KHKIJYNAPASQYCZKRS4IVUWL44FA\m\enforcer-rules\target\classes
[windows-jdk10] [INFO] /F:/jenkins/jenkins-slave/workspace/aven-enforcer_MENFORCER-276-ARAEEUQ3DZKGP7LK65FX6C75KHKIJYNAPASQYCZKRS4IVUWL44FA/m/enforcer-rules/src/main/java/org/apache/maven/plugins/enforcer/RequirePluginVersions.java: Some input files use or override a deprecated API.
[windows-jdk10] [INFO] /F:/jenkins/jenkins-slave/workspace/aven-enforcer_MENFORCER-276-ARAEEUQ3DZKGP7LK65FX6C75KHKIJYNAPASQYCZKRS4IVUWL44FA/m/enforcer-rules/src/main/java/org/apache/maven/plugins/enforcer/RequirePluginVersions.java: Recompile with -Xlint:deprecation for details.
[windows-jdk10] [INFO] /F:/jenkins/jenkins-slave/workspace/aven-enforcer_MENFORCER-276-ARAEEUQ3DZKGP7LK65FX6C75KHKIJYNAPASQYCZKRS4IVUWL44FA/m/enforcer-rules/src/main/java/org/apache/maven/plugins/enforcer/RequirePluginVersions.java: F:\jenkins\jenkins-slave\workspace\aven-enforcer_MENFORCER-276-ARAEEUQ3DZKGP7LK65FX6C75KHKIJYNAPASQYCZKRS4IVUWL44FA\m\enforcer-rules\src\main\java\org\apache\maven\plugins\enforcer\RequirePluginVersions.java uses unchecked or unsafe operations.
[windows-jdk10] [INFO] /F:/jenkins/jenkins-slave/workspace/aven-enforcer_MENFORCER-276-ARAEEUQ3DZKGP7LK65FX6C75KHKIJYNAPASQYCZKRS4IVUWL44FA/m/enforcer-rules/src/main/java/org/apache/maven/plugins/enforcer/RequirePluginVersions.java: Recompile with -Xlint:unchecked for details.
[windows-jdk10] [INFO] 
[windows-jdk10] [INFO] --- maven-resources-plugin:3.0.2:testResources (default-testResources) @ enforcer-rules ---
[windows-jdk10] [INFO] Using 'UTF-8' encoding to copy filtered resources.
[windows-jdk10] [INFO] Copying 11 resources
[windows-jdk10] [INFO] Copying 3 resources
[windows-jdk10] [INFO] 
[windows-jdk10] [INFO] --- maven-compiler-plugin:3.7.0:testCompile (default-testCompile) @ enforcer-rules ---
[windows-jdk10] [INFO] Changes detected - recompiling the module!
[windows-jdk10] [INFO] Compiling 35 source files to F:\jenkins\jenkins-slave\workspace\aven-enforcer_MENFORCER-276-ARAEEUQ3DZKGP7LK65FX6C75KHKIJYNAPASQYCZKRS4IVUWL44FA\m\enforcer-rules\target\test-classes
[windows-jdk10] [INFO] /F:/jenkins/jenkins-slave/workspace/aven-enforcer_MENFORCER-276-ARAEEUQ3DZKGP7LK65FX6C75KHKIJYNAPASQYCZKRS4IVUWL44FA/m/enforcer-rules/src/test/java/org/apache/maven/plugins/enforcer/TestRequireUpperBoundDeps.java: Some input files use or override a deprecated API.
[windows-jdk10] [INFO] /F:/jenkins/jenkins-slave/workspace/aven-enforcer_MENFORCER-276-ARAEEUQ3DZKGP7LK65FX6C75KHKIJYNAPASQYCZKRS4IVUWL44FA/m/enforcer-rules/src/test/java/org/apache/maven/plugins/enforcer/TestRequireUpperBoundDeps.java: Recompile with -Xlint:deprecation for details.
[windows-jdk10] [INFO] /F:/jenkins/jenkins-slave/workspace/aven-enforcer_MENFORCER-276-ARAEEUQ3DZKGP7LK65FX6C75KHKIJYNAPASQYCZKRS4IVUWL44FA/m/enforcer-rules/src/test/java/org/apache/maven/plugins/enforcer/MockPlexusContainer.java: Some input files use unchecked or unsafe operations.
[windows-jdk10] [INFO] /F:/jenkins/jenkins-slave/workspace/aven-enforcer_MENFORCER-276-ARAEEUQ3DZKGP7LK65FX6C75KHKIJYNAPASQYCZKRS4IVUWL44FA/m/enforcer-rules/src/test/java/org/apache/maven/plugins/enforcer/MockPlexusContainer.java: Recompile with -Xlint:unchecked for details.
[windows-jdk10] [INFO] -------------------------------------------------------------
[windows-jdk10] [ERROR] COMPILATION ERROR : 
[windows-jdk10] [INFO] -------------------------------------------------------------
[windows-jdk10] [ERROR] /F:/jenkins/jenkins-slave/workspace/aven-enforcer_MENFORCER-276-ARAEEUQ3DZKGP7LK65FX6C75KHKIJYNAPASQYCZKRS4IVUWL44FA/m/enforcer-rules/src/test/java/org/apache/maven/plugins/enforcer/TestRequireUpperBoundDeps.java:[14,47] cannot find symbol
[windows-jdk10]   symbol:   class TestEnforcerRuleUtils
[windows-jdk10]   location: package org.apache.maven.plugins.enforcer.utils
[windows-jdk10] [ERROR] /F:/jenkins/jenkins-slave/workspace/aven-enforcer_MENFORCER-276-ARAEEUQ3DZKGP7LK65FX6C75KHKIJYNAPASQYCZKRS4IVUWL44FA/m/enforcer-rules/src/test/java/org/apache/maven/plugins/enforcer/TestRequireUpperBoundDeps.java:[87,9] cannot find symbol
[windows-jdk10]   symbol:   variable TestEnforcerRuleUtils
[windows-jdk10]   location: class org.apache.maven.plugins.enforcer.TestRequireUpperBoundDeps
[windows-jdk10] [ERROR] /F:/jenkins/jenkins-slave/workspace/aven-enforcer_MENFORCER-276-ARAEEUQ3DZKGP7LK65FX6C75KHKIJYNAPASQYCZKRS4IVUWL44FA/m/enforcer-rules/src/test/java/org/apache/maven/plugins/enforcer/TestRequireUpperBoundDeps.java:[97,9] cannot find symbol
[windows-jdk10]   symbol:   variable TestEnforcerRuleUtils
[windows-jdk10]   location: class org.apache.maven.plugins.enforcer.TestRequireUpperBoundDeps
[windows-jdk10] [ERROR] /F:/jenkins/jenkins-slave/workspace/aven-enforcer_MENFORCER-276-ARAEEUQ3DZKGP7LK65FX6C75KHKIJYNAPASQYCZKRS4IVUWL44FA/m/enforcer-rules/src/test/java/org/apache/maven/plugins/enforcer/TestRequireUpperBoundDeps.java:[107,9] cannot find symbol
[windows-jdk10]   symbol:   variable TestEnforcerRuleUtils
[windows-jdk10]   location: class org.apache.maven.plugins.enforcer.TestRequireUpperBoundDeps
[windows-jdk10] [ERROR] /F:/jenkins/jenkins-slave/workspace/aven-enforcer_MENFORCER-276-ARAEEUQ3DZKGP7LK65FX6C75KHKIJYNAPASQYCZKRS4IVUWL44FA/m/enforcer-rules/src/test/java/org/apache/maven/plugins/enforcer/TestRequireUpperBoundDeps.java:[118,9] cannot find symbol
[windows-jdk10]   symbol:   variable TestEnforcerRuleUtils
[windows-jdk10]   location: class org.apache.maven.plugins.enforcer.TestRequireUpperBoundDeps
[windows-jdk10] [INFO] 5 errors 
[windows-jdk10] [INFO] -------------------------------------------------------------
[windows-jdk10] [INFO] ------------------------------------------------------------------------
[windows-jdk10] [INFO] Reactor Summary:
[windows-jdk10] [INFO] 
[windows-jdk10] [INFO] Apache Maven Enforcer .............................. SUCCESS [ 38.001 s]
[windows-jdk10] [INFO] Apache Maven Enforcer API .......................... SUCCESS [  6.794 s]
[windows-jdk10] [INFO] Apache Maven Enforcer Built-In Rules ............... FAILURE [  6.285 s]
[windows-jdk10] [INFO] Apache Maven Enforcer Plugin ....................... SKIPPED
[windows-jdk10] [INFO] ------------------------------------------------------------------------
[windows-jdk10] [INFO] BUILD FAILURE
[windows-jdk10] [INFO] ------------------------------------------------------------------------
[windows-jdk10] [INFO] Total time: 52.367 s
[windows-jdk10] [INFO] Finished at: 2018-08-08T22:21:32-07:00
[windows-jdk10] [INFO] Final Memory: 39M/137M
[windows-jdk10] [INFO] ------------------------------------------------------------------------
[windows-jdk10] [INFO] [jenkins-event-spy] Generated F:\jenkins\jenkins-slave\workspace\aven-enforcer_MENFORCER-276-ARAEEUQ3DZKGP7LK65FX6C75KHKIJYNAPASQYCZKRS4IVUWL44FA@tmp\withMaven8e00989e\maven-spy-20180808-222039-7922161720002140282313.log
[windows-jdk10] [ERROR] Failed to execute goal org.apache.maven.plugins:maven-compiler-plugin:3.7.0:testCompile (default-testCompile) on project enforcer-rules: Compilation failure: Compilation failure: 
[windows-jdk10] [ERROR] /F:/jenkins/jenkins-slave/workspace/aven-enforcer_MENFORCER-276-ARAEEUQ3DZKGP7LK65FX6C75KHKIJYNAPASQYCZKRS4IVUWL44FA/m/enforcer-rules/src/test/java/org/apache/maven/plugins/enforcer/TestRequireUpperBoundDeps.java:[14,47] cannot find symbol
[windows-jdk10] [ERROR]   symbol:   class TestEnforcerRuleUtils
[windows-jdk10] [ERROR]   location: package org.apache.maven.plugins.enforcer.utils
[windows-jdk10] [ERROR] /F:/jenkins/jenkins-slave/workspace/aven-enforcer_MENFORCER-276-ARAEEUQ3DZKGP7LK65FX6C75KHKIJYNAPASQYCZKRS4IVUWL44FA/m/enforcer-rules/src/test/java/org/apache/maven/plugins/enforcer/TestRequireUpperBoundDeps.java:[87,9] cannot find symbol
[windows-jdk10] [ERROR]   symbol:   variable TestEnforcerRuleUtils
[windows-jdk10] [ERROR]   location: class org.apache.maven.plugins.enforcer.TestRequireUpperBoundDeps
[windows-jdk10] [ERROR] /F:/jenkins/jenkins-slave/workspace/aven-enforcer_MENFORCER-276-ARAEEUQ3DZKGP7LK65FX6C75KHKIJYNAPASQYCZKRS4IVUWL44FA/m/enforcer-rules/src/test/java/org/apache/maven/plugins/enforcer/TestRequireUpperBoundDeps.java:[97,9] cannot find symbol
[windows-jdk10] [ERROR]   symbol:   variable TestEnforcerRuleUtils
[windows-jdk10] [ERROR]   location: class org.apache.maven.plugins.enforcer.TestRequireUpperBoundDeps
[windows-jdk10] [ERROR] /F:/jenkins/jenkins-slave/workspace/aven-enforcer_MENFORCER-276-ARAEEUQ3DZKGP7LK65FX6C75KHKIJYNAPASQYCZKRS4IVUWL44FA/m/enforcer-rules/src/test/java/org/apache/maven/plugins/enforcer/TestRequireUpperBoundDeps.java:[107,9] cannot find symbol
[windows-jdk10] [ERROR]   symbol:   variable TestEnforcerRuleUtils
[windows-jdk10] [ERROR]   location: class org.apache.maven.plugins.enforcer.TestRequireUpperBoundDeps
[windows-jdk10] [ERROR] /F:/jenkins/jenkins-slave/workspace/aven-enforcer_MENFORCER-276-ARAEEUQ3DZKGP7LK65FX6C75KHKIJYNAPASQYCZKRS4IVUWL44FA/m/enforcer-rules/src/test/java/org/apache/maven/plugins/enforcer/TestRequireUpperBoundDeps.java:[118,9] cannot find symbol
[windows-jdk10] [ERROR]   symbol:   variable TestEnforcerRuleUtils
[windows-jdk10] [ERROR]   location: class org.apache.maven.plugins.enforcer.TestRequireUpperBoundDeps
[windows-jdk10] [ERROR] -> [Help 1]
[windows-jdk10] [ERROR] 
[windows-jdk10] [ERROR] To see the full stack trace of the errors, re-run Maven with the -e switch.
[windows-jdk10] [ERROR] Re-run Maven using the -X switch to enable full debug logging.
[windows-jdk10] [ERROR] 
[windows-jdk10] [ERROR] For more information about the errors and possible solutions, please read the following articles:
[windows-jdk10] [ERROR] [Help 1] http://cwiki.apache.org/confluence/display/MAVEN/MojoFailureException
[windows-jdk10] [ERROR] 
[windows-jdk10] [ERROR] After correcting the problems, you can resume the build with the command
[windows-jdk10] [ERROR]   mvn <goals> -rf :enforcer-rules
[Pipeline] [windows-jdk10] }
[Pipeline] [windows-jdk10] // dir
[Pipeline] [windows-jdk10] }
[windows-jdk10] [withMaven] junitPublisher - Archive test results for Maven artifact org.apache.maven.enforcer:enforcer-api:3.0.0-SNAPSHOT generated by maven-surefire-plugin:test (default-test): m\enforcer-api\target\surefire-reports\*.xml
[windows-jdk10] Recording test results
[windows-jdk10] None of the test reports contained any result
[Pipeline] [windows-jdk10] // withMaven
[Pipeline] [windows-jdk10] cleanWs
[windows-jdk10] [WS-CLEANUP] Deleting project workspace...[WS-CLEANUP] done
[Pipeline] [windows-jdk10] cleanWs
[windows-jdk10] [WS-CLEANUP] Deleting project workspace...[WS-CLEANUP] done
[Pipeline] [windows-jdk10] }
[Pipeline] [windows-jdk10] // stage
[Pipeline] [windows-jdk10] }
[Pipeline] [windows-jdk10] // node
[Pipeline] [windows-jdk10] }
[windows-jdk10] Failed in branch windows-jdk10
[Pipeline] // parallel
[Pipeline] stage
[Pipeline] { (Notifications)
[Pipeline] echo
Build result: FAILURE
[Pipeline] jiraIssueSelector
[Pipeline] emailext

Build failed in Jenkins: Maven TLP » maven-enforcer » MENFORCER-276 #8

Posted by Apache Jenkins Server <je...@builds.apache.org>.
See https://builds.apache.org/job/maven-box/job/maven-enforcer/job/MENFORCER-276/8/

Changes:

* Get back ubuntu-eu2 and replaced it with windows-2016-1 which currently
* Exclude windows-2012-1
* [INFRA-16848] Nodes should be fixed
* H31 seemed to have issues.

No tests ran.

Build log:
[...truncated 1.86 MB...]
[windows-jdk10] [INFO] Downloaded: https://repo.maven.apache.org/maven2/org/codehaus/plexus/plexus-compiler-api/2.8.2/plexus-compiler-api-2.8.2.jar (26 kB at 80 kB/s)
[windows-jdk10] [INFO] Downloaded: https://repo.maven.apache.org/maven2/org/apache/maven/shared/maven-shared-incremental/1.1/maven-shared-incremental-1.1.jar (14 kB at 41 kB/s)
[windows-jdk10] [INFO] Changes detected - recompiling the module!
[windows-jdk10] [INFO] Compiling 5 source files to F:\jenkins\jenkins-slave\workspace\aven-enforcer_MENFORCER-276-ARAEEUQ3DZKGP7LK65FX6C75KHKIJYNAPASQYCZKRS4IVUWL44FA\m\enforcer-api\target\classes
[windows-jdk10] [INFO] 
[windows-jdk10] [INFO] --- maven-resources-plugin:3.0.2:testResources (default-testResources) @ enforcer-api ---
[windows-jdk10] [INFO] Using 'UTF-8' encoding to copy filtered resources.
[windows-jdk10] [INFO] skip non existing resourceDirectory F:\jenkins\jenkins-slave\workspace\aven-enforcer_MENFORCER-276-ARAEEUQ3DZKGP7LK65FX6C75KHKIJYNAPASQYCZKRS4IVUWL44FA\m\enforcer-api\src\test\resources
[windows-jdk10] [INFO] Copying 3 resources
[windows-jdk10] [INFO] 
[windows-jdk10] [INFO] --- maven-compiler-plugin:3.7.0:testCompile (default-testCompile) @ enforcer-api ---
[windows-jdk10] [INFO] No sources to compile
[windows-jdk10] [INFO] 
[windows-jdk10] [INFO] --- maven-surefire-plugin:2.21.0:test (default-test) @ enforcer-api ---
[windows-jdk10] [INFO] Downloading: https://repo.maven.apache.org/maven2/org/apache/maven/surefire/maven-surefire-common/2.21.0/maven-surefire-common-2.21.0.pom
[windows-jdk10] [INFO] Downloaded: https://repo.maven.apache.org/maven2/org/apache/maven/surefire/maven-surefire-common/2.21.0/maven-surefire-common-2.21.0.pom (11 kB at 379 kB/s)
[windows-jdk10] [INFO] Downloading: https://repo.maven.apache.org/maven2/org/apache/maven/plugin-tools/maven-plugin-annotations/3.5/maven-plugin-annotations-3.5.pom
[windows-jdk10] [INFO] Downloaded: https://repo.maven.apache.org/maven2/org/apache/maven/plugin-tools/maven-plugin-annotations/3.5/maven-plugin-annotations-3.5.pom (1.7 kB at 111 kB/s)
[windows-jdk10] [INFO] Downloading: https://repo.maven.apache.org/maven2/org/apache/maven/plugin-tools/maven-plugin-tools/3.5/maven-plugin-tools-3.5.pom
[windows-jdk10] [INFO] Downloaded: https://repo.maven.apache.org/maven2/org/apache/maven/plugin-tools/maven-plugin-tools/3.5/maven-plugin-tools-3.5.pom (16 kB at 2.7 MB/s)
[windows-jdk10] [INFO] Downloading: https://repo.maven.apache.org/maven2/org/apache/maven/surefire/surefire-api/2.21.0/surefire-api-2.21.0.pom
[windows-jdk10] [INFO] Downloaded: https://repo.maven.apache.org/maven2/org/apache/maven/surefire/surefire-api/2.21.0/surefire-api-2.21.0.pom (3.5 kB at 590 kB/s)
[windows-jdk10] [INFO] Downloading: https://repo.maven.apache.org/maven2/org/apache/maven/surefire/surefire-logger-api/2.21.0/surefire-logger-api-2.21.0.pom
[windows-jdk10] [INFO] Downloaded: https://repo.maven.apache.org/maven2/org/apache/maven/surefire/surefire-logger-api/2.21.0/surefire-logger-api-2.21.0.pom (2.0 kB at 402 kB/s)
[windows-jdk10] [INFO] Downloading: https://repo.maven.apache.org/maven2/org/apache/maven/surefire/surefire-booter/2.21.0/surefire-booter-2.21.0.pom
[windows-jdk10] [INFO] Downloaded: https://repo.maven.apache.org/maven2/org/apache/maven/surefire/surefire-booter/2.21.0/surefire-booter-2.21.0.pom (7.4 kB at 818 kB/s)
[windows-jdk10] [INFO] Downloading: https://repo.maven.apache.org/maven2/org/apache/maven/maven-toolchain/2.2.1/maven-toolchain-2.2.1.pom
[windows-jdk10] [INFO] Downloaded: https://repo.maven.apache.org/maven2/org/apache/maven/maven-toolchain/2.2.1/maven-toolchain-2.2.1.pom (3.3 kB at 176 kB/s)
[windows-jdk10] [INFO] Downloading: https://repo.maven.apache.org/maven2/org/codehaus/plexus/plexus-java/0.9.3/plexus-java-0.9.3.pom
[windows-jdk10] [INFO] Downloaded: https://repo.maven.apache.org/maven2/org/codehaus/plexus/plexus-java/0.9.3/plexus-java-0.9.3.pom (2.4 kB at 26 kB/s)
[windows-jdk10] [INFO] Downloading: https://repo.maven.apache.org/maven2/org/codehaus/plexus/plexus-languages/0.9.3/plexus-languages-0.9.3.pom
[windows-jdk10] [INFO] Downloaded: https://repo.maven.apache.org/maven2/org/codehaus/plexus/plexus-languages/0.9.3/plexus-languages-0.9.3.pom (2.2 kB at 38 kB/s)
[windows-jdk10] [INFO] Downloading: https://repo.maven.apache.org/maven2/org/apache/maven/surefire/surefire-booter/2.21.0/surefire-booter-2.21.0.jar
[windows-jdk10] [INFO] Downloaded: https://repo.maven.apache.org/maven2/org/apache/maven/surefire/surefire-booter/2.21.0/surefire-booter-2.21.0.jar (273 kB at 6.8 MB/s)
[windows-jdk10] [INFO] Downloading: https://repo.maven.apache.org/maven2/junit/junit/4.12/junit-4.12.jar
[windows-jdk10] [INFO] Downloaded: https://repo.maven.apache.org/maven2/junit/junit/4.12/junit-4.12.jar (315 kB at 5.8 MB/s)
[windows-jdk10] [INFO] Downloading: https://repo.maven.apache.org/maven2/org/apache/maven/maven-toolchain/2.2.1/maven-toolchain-2.2.1.jar
[windows-jdk10] [INFO] Downloaded: https://repo.maven.apache.org/maven2/org/apache/maven/maven-toolchain/2.2.1/maven-toolchain-2.2.1.jar (38 kB at 607 kB/s)
[windows-jdk10] [INFO] Downloading: https://repo.maven.apache.org/maven2/org/codehaus/plexus/plexus-java/0.9.3/plexus-java-0.9.3.jar
[windows-jdk10] [INFO] Downloaded: https://repo.maven.apache.org/maven2/org/codehaus/plexus/plexus-java/0.9.3/plexus-java-0.9.3.jar (32 kB at 460 kB/s)
[windows-jdk10] [INFO] Downloading: https://repo.maven.apache.org/maven2/org/apache/maven/plugin-tools/maven-plugin-annotations/3.5/maven-plugin-annotations-3.5.jar
[windows-jdk10] [INFO] Downloading: https://repo.maven.apache.org/maven2/org/apache/maven/surefire/maven-surefire-common/2.21.0/maven-surefire-common-2.21.0.jar
[windows-jdk10] [INFO] Downloading: https://repo.maven.apache.org/maven2/org/apache/maven/surefire/surefire-logger-api/2.21.0/surefire-logger-api-2.21.0.jar
[windows-jdk10] [INFO] Downloaded: https://repo.maven.apache.org/maven2/org/apache/maven/plugin-tools/maven-plugin-annotations/3.5/maven-plugin-annotations-3.5.jar (14 kB at 75 kB/s)
[windows-jdk10] [INFO] Downloading: https://repo.maven.apache.org/maven2/org/apache/maven/surefire/surefire-api/2.21.0/surefire-api-2.21.0.jar
[windows-jdk10] [INFO] Downloaded: https://repo.maven.apache.org/maven2/org/apache/maven/surefire/surefire-logger-api/2.21.0/surefire-logger-api-2.21.0.jar (13 kB at 67 kB/s)
[windows-jdk10] [INFO] Downloaded: https://repo.maven.apache.org/maven2/org/apache/maven/surefire/maven-surefire-common/2.21.0/maven-surefire-common-2.21.0.jar (521 kB at 2.2 MB/s)
[windows-jdk10] [INFO] Downloaded: https://repo.maven.apache.org/maven2/org/apache/maven/surefire/surefire-api/2.21.0/surefire-api-2.21.0.jar (185 kB at 766 kB/s)
[windows-jdk10] [INFO] 
[windows-jdk10] [INFO] --- maven-jar-plugin:3.0.2:jar (default-jar) @ enforcer-api ---
[windows-jdk10] [INFO] Downloading: https://repo.maven.apache.org/maven2/org/apache/maven/shared/maven-shared-utils/3.0.1/maven-shared-utils-3.0.1.jar
[windows-jdk10] [INFO] Downloaded: https://repo.maven.apache.org/maven2/org/apache/maven/shared/maven-shared-utils/3.0.1/maven-shared-utils-3.0.1.jar (154 kB at 2.4 MB/s)
[windows-jdk10] [INFO] Building jar: F:\jenkins\jenkins-slave\workspace\aven-enforcer_MENFORCER-276-ARAEEUQ3DZKGP7LK65FX6C75KHKIJYNAPASQYCZKRS4IVUWL44FA\m\enforcer-api\target\enforcer-api-3.0.0-SNAPSHOT.jar
[windows-jdk10] [INFO] 
[windows-jdk10] [INFO] --- maven-site-plugin:3.7:attach-descriptor (attach-descriptor) @ enforcer-api ---
[windows-jdk10] [INFO] Skipping because packaging 'jar' is not pom.
[windows-jdk10] [INFO] 
[windows-jdk10] [INFO] --- maven-checkstyle-plugin:3.0.0:check (checkstyle-check) @ enforcer-api ---
[windows-jdk10] [INFO] 
[windows-jdk10] [INFO] ------------------------------------------------------------------------
[windows-jdk10] [INFO] Building Apache Maven Enforcer Built-In Rules 3.0.0-SNAPSHOT
[windows-jdk10] [INFO] ------------------------------------------------------------------------
[windows-jdk10] [INFO] Downloading: https://repo.maven.apache.org/maven2/org/apache/maven/shared/maven-common-artifact-filters/3.0.1/maven-common-artifact-filters-3.0.1.pom
[windows-jdk10] [INFO] Downloaded: https://repo.maven.apache.org/maven2/org/apache/maven/shared/maven-common-artifact-filters/3.0.1/maven-common-artifact-filters-3.0.1.pom (4.8 kB at 604 kB/s)
[windows-jdk10] [INFO] Downloading: https://repo.maven.apache.org/maven2/org/apache/maven/plugin-testing/maven-plugin-testing-harness/2.1/maven-plugin-testing-harness-2.1.pom
[windows-jdk10] [INFO] Downloaded: https://repo.maven.apache.org/maven2/org/apache/maven/plugin-testing/maven-plugin-testing-harness/2.1/maven-plugin-testing-harness-2.1.pom (3.2 kB at 359 kB/s)
[windows-jdk10] [INFO] Downloading: https://repo.maven.apache.org/maven2/org/apache/maven/plugin-testing/maven-plugin-testing/2.1/maven-plugin-testing-2.1.pom
[windows-jdk10] [INFO] Downloaded: https://repo.maven.apache.org/maven2/org/apache/maven/plugin-testing/maven-plugin-testing/2.1/maven-plugin-testing-2.1.pom (10 kB at 1.3 MB/s)
[windows-jdk10] [INFO] Downloading: https://repo.maven.apache.org/maven2/commons-codec/commons-codec/1.6/commons-codec-1.6.pom
[windows-jdk10] [INFO] Downloaded: https://repo.maven.apache.org/maven2/commons-codec/commons-codec/1.6/commons-codec-1.6.pom (11 kB at 697 kB/s)
[windows-jdk10] [INFO] Downloading: https://repo.maven.apache.org/maven2/org/apache/commons/commons-parent/22/commons-parent-22.pom
[windows-jdk10] [INFO] Downloaded: https://repo.maven.apache.org/maven2/org/apache/commons/commons-parent/22/commons-parent-22.pom (42 kB at 3.8 MB/s)
[windows-jdk10] [INFO] Downloading: https://repo.maven.apache.org/maven2/org/mockito/mockito-core/2.18.3/mockito-core-2.18.3.pom
[windows-jdk10] [INFO] Downloaded: https://repo.maven.apache.org/maven2/org/mockito/mockito-core/2.18.3/mockito-core-2.18.3.pom (16 kB at 469 kB/s)
[windows-jdk10] [INFO] Downloading: https://repo.maven.apache.org/maven2/net/bytebuddy/byte-buddy/1.8.5/byte-buddy-1.8.5.pom
[windows-jdk10] [INFO] Downloaded: https://repo.maven.apache.org/maven2/net/bytebuddy/byte-buddy/1.8.5/byte-buddy-1.8.5.pom (12 kB at 1.0 MB/s)
[windows-jdk10] [INFO] Downloading: https://repo.maven.apache.org/maven2/net/bytebuddy/byte-buddy-parent/1.8.5/byte-buddy-parent-1.8.5.pom
[windows-jdk10] [INFO] Downloaded: https://repo.maven.apache.org/maven2/net/bytebuddy/byte-buddy-parent/1.8.5/byte-buddy-parent-1.8.5.pom (27 kB at 1.3 MB/s)
[windows-jdk10] [INFO] Downloading: https://repo.maven.apache.org/maven2/net/bytebuddy/byte-buddy-agent/1.8.5/byte-buddy-agent-1.8.5.pom
[windows-jdk10] [INFO] Downloaded: https://repo.maven.apache.org/maven2/net/bytebuddy/byte-buddy-agent/1.8.5/byte-buddy-agent-1.8.5.pom (4.9 kB at 378 kB/s)
[windows-jdk10] [INFO] Downloading: https://repo.maven.apache.org/maven2/org/objenesis/objenesis/2.6/objenesis-2.6.pom
[windows-jdk10] [INFO] Downloaded: https://repo.maven.apache.org/maven2/org/objenesis/objenesis/2.6/objenesis-2.6.pom (2.8 kB at 348 kB/s)
[windows-jdk10] [INFO] Downloading: https://repo.maven.apache.org/maven2/org/objenesis/objenesis-parent/2.6/objenesis-parent-2.6.pom
[windows-jdk10] [INFO] Downloaded: https://repo.maven.apache.org/maven2/org/objenesis/objenesis-parent/2.6/objenesis-parent-2.6.pom (17 kB at 1.5 MB/s)
[windows-jdk10] [INFO] Downloading: https://repo.maven.apache.org/maven2/org/apache/maven/maven-compat/3.0/maven-compat-3.0.pom
[windows-jdk10] [INFO] Downloaded: https://repo.maven.apache.org/maven2/org/apache/maven/maven-compat/3.0/maven-compat-3.0.pom (4.0 kB at 366 kB/s)
[windows-jdk10] [INFO] Downloading: https://repo.maven.apache.org/maven2/org/apache/maven/wagon/wagon-provider-api/1.0-beta-6/wagon-provider-api-1.0-beta-6.pom
[windows-jdk10] [INFO] Downloaded: https://repo.maven.apache.org/maven2/org/apache/maven/wagon/wagon-provider-api/1.0-beta-6/wagon-provider-api-1.0-beta-6.pom (1.8 kB at 88 kB/s)
[windows-jdk10] [INFO] Downloading: https://repo.maven.apache.org/maven2/org/apache/maven/wagon/wagon/1.0-beta-6/wagon-1.0-beta-6.pom
[windows-jdk10] [INFO] Downloaded: https://repo.maven.apache.org/maven2/org/apache/maven/wagon/wagon/1.0-beta-6/wagon-1.0-beta-6.pom (12 kB at 1.5 MB/s)
[windows-jdk10] [INFO] Downloading: https://repo.maven.apache.org/maven2/org/assertj/assertj-core/1.7.1/assertj-core-1.7.1.pom
[windows-jdk10] [INFO] Downloaded: https://repo.maven.apache.org/maven2/org/assertj/assertj-core/1.7.1/assertj-core-1.7.1.pom (4.7 kB at 519 kB/s)
[windows-jdk10] [INFO] Downloading: https://repo.maven.apache.org/maven2/org/assertj/assertj-parent-pom/1.2.6/assertj-parent-pom-1.2.6.pom
[windows-jdk10] [INFO] Downloaded: https://repo.maven.apache.org/maven2/org/assertj/assertj-parent-pom/1.2.6/assertj-parent-pom-1.2.6.pom (13 kB at 838 kB/s)
[windows-jdk10] [INFO] Downloading: https://repo.maven.apache.org/maven2/org/apache/maven/plugin-testing/maven-plugin-testing-harness/2.1/maven-plugin-testing-harness-2.1.jar
[windows-jdk10] [INFO] Downloading: https://repo.maven.apache.org/maven2/commons-codec/commons-codec/1.6/commons-codec-1.6.jar
[windows-jdk10] [INFO] Downloading: https://repo.maven.apache.org/maven2/org/apache/commons/commons-lang3/3.5/commons-lang3-3.5.jar
[windows-jdk10] [INFO] Downloaded: https://repo.maven.apache.org/maven2/org/apache/commons/commons-lang3/3.5/commons-lang3-3.5.jar (480 kB at 12 MB/s)
[windows-jdk10] [INFO] Downloading: https://repo.maven.apache.org/maven2/net/bytebuddy/byte-buddy/1.8.5/byte-buddy-1.8.5.jar
[windows-jdk10] [INFO] Downloading: https://repo.maven.apache.org/maven2/org/mockito/mockito-core/2.18.3/mockito-core-2.18.3.jar
[windows-jdk10] [INFO] Downloaded: https://repo.maven.apache.org/maven2/commons-codec/commons-codec/1.6/commons-codec-1.6.jar (233 kB at 5.5 MB/s)
[windows-jdk10] [INFO] Downloading: https://repo.maven.apache.org/maven2/net/bytebuddy/byte-buddy-agent/1.8.5/byte-buddy-agent-1.8.5.jar
[windows-jdk10] [INFO] Downloading: https://repo.maven.apache.org/maven2/org/apache/maven/shared/maven-common-artifact-filters/3.0.1/maven-common-artifact-filters-3.0.1.jar
[windows-jdk10] [INFO] Downloaded: https://repo.maven.apache.org/maven2/org/apache/maven/plugin-testing/maven-plugin-testing-harness/2.1/maven-plugin-testing-harness-2.1.jar (39 kB at 218 kB/s)
[windows-jdk10] [INFO] Downloading: https://repo.maven.apache.org/maven2/org/objenesis/objenesis/2.6/objenesis-2.6.jar
[windows-jdk10] [INFO] Downloaded: https://repo.maven.apache.org/maven2/net/bytebuddy/byte-buddy-agent/1.8.5/byte-buddy-agent-1.8.5.jar (40 kB at 215 kB/s)
[windows-jdk10] [INFO] Downloading: https://repo.maven.apache.org/maven2/org/apache/maven/maven-compat/3.0/maven-compat-3.0.jar
[windows-jdk10] [INFO] Downloaded: https://repo.maven.apache.org/maven2/org/objenesis/objenesis/2.6/objenesis-2.6.jar (56 kB at 293 kB/s)
[windows-jdk10] [INFO] Downloading: https://repo.maven.apache.org/maven2/org/apache/maven/wagon/wagon-provider-api/1.0-beta-6/wagon-provider-api-1.0-beta-6.jar
[windows-jdk10] [INFO] Downloaded: https://repo.maven.apache.org/maven2/org/apache/maven/wagon/wagon-provider-api/1.0-beta-6/wagon-provider-api-1.0-beta-6.jar (53 kB at 266 kB/s)
[windows-jdk10] [INFO] Downloading: https://repo.maven.apache.org/maven2/org/assertj/assertj-core/1.7.1/assertj-core-1.7.1.jar
[windows-jdk10] [INFO] Downloaded: https://repo.maven.apache.org/maven2/org/assertj/assertj-core/1.7.1/assertj-core-1.7.1.jar (619 kB at 2.6 MB/s)
[windows-jdk10] [INFO] Downloaded: https://repo.maven.apache.org/maven2/org/apache/maven/shared/maven-common-artifact-filters/3.0.1/maven-common-artifact-filters-3.0.1.jar (61 kB at 228 kB/s)
[windows-jdk10] [INFO] Downloaded: https://repo.maven.apache.org/maven2/org/mockito/mockito-core/2.18.3/mockito-core-2.18.3.jar (556 kB at 2.1 MB/s)
[windows-jdk10] [INFO] Downloaded: https://repo.maven.apache.org/maven2/net/bytebuddy/byte-buddy/1.8.5/byte-buddy-1.8.5.jar (3.0 MB at 11 MB/s)
[windows-jdk10] [INFO] Downloaded: https://repo.maven.apache.org/maven2/org/apache/maven/maven-compat/3.0/maven-compat-3.0.jar (285 kB at 664 kB/s)
[windows-jdk10] [INFO] 
[windows-jdk10] [INFO] --- maven-clean-plugin:3.0.0:clean (default-clean) @ enforcer-rules ---
[windows-jdk10] [INFO] 
[windows-jdk10] [INFO] --- maven-enforcer-plugin:1.4.1:enforce (enforce-maven-version) @ enforcer-rules ---
[windows-jdk10] [INFO] 
[windows-jdk10] [INFO] --- maven-enforcer-plugin:1.4.1:enforce (enforce-bytecode-version) @ enforcer-rules ---
[windows-jdk10] [INFO] 
[windows-jdk10] [INFO] --- maven-enforcer-plugin:1.4.1:enforce (ban-known-bad-maven-versions) @ enforcer-rules ---
[windows-jdk10] [INFO] 
[windows-jdk10] [INFO] --- apache-rat-plugin:0.12:check (rat-check) @ enforcer-rules ---
[windows-jdk10] [INFO] Enabled default license matchers.
[windows-jdk10] [INFO] Will parse SCM ignores for exclusions...
[windows-jdk10] [INFO] Finished adding exclusions from SCM ignore files.
[windows-jdk10] [INFO] 61 implicit excludes (use -debug for more details).
[windows-jdk10] [INFO] Exclude: .repository/**
[windows-jdk10] [INFO] Exclude: .maven/spy.log
[windows-jdk10] [INFO] Exclude: dependency-reduced-pom.xml
[windows-jdk10] [INFO] Exclude: .java-version
[windows-jdk10] [INFO] 130 resources included (use -debug for more details)
[windows-jdk10] [INFO] Rat check: Summary over all files. Unapproved: 0, unknown: 0, generated: 0, approved: 124 licenses.
[windows-jdk10] [INFO] 
[windows-jdk10] [INFO] --- maven-remote-resources-plugin:1.5:process (process-resource-bundles) @ enforcer-rules ---
[windows-jdk10] [INFO] 
[windows-jdk10] [INFO] --- maven-resources-plugin:3.0.2:resources (default-resources) @ enforcer-rules ---
[windows-jdk10] [INFO] Using 'UTF-8' encoding to copy filtered resources.
[windows-jdk10] [INFO] skip non existing resourceDirectory F:\jenkins\jenkins-slave\workspace\aven-enforcer_MENFORCER-276-ARAEEUQ3DZKGP7LK65FX6C75KHKIJYNAPASQYCZKRS4IVUWL44FA\m\enforcer-rules\src\main\resources
[windows-jdk10] [INFO] Copying 3 resources
[windows-jdk10] [INFO] 
[windows-jdk10] [INFO] --- maven-compiler-plugin:3.7.0:compile (default-compile) @ enforcer-rules ---
[windows-jdk10] [INFO] Changes detected - recompiling the module!
[windows-jdk10] [INFO] Compiling 43 source files to F:\jenkins\jenkins-slave\workspace\aven-enforcer_MENFORCER-276-ARAEEUQ3DZKGP7LK65FX6C75KHKIJYNAPASQYCZKRS4IVUWL44FA\m\enforcer-rules\target\classes
[windows-jdk10] [INFO] /F:/jenkins/jenkins-slave/workspace/aven-enforcer_MENFORCER-276-ARAEEUQ3DZKGP7LK65FX6C75KHKIJYNAPASQYCZKRS4IVUWL44FA/m/enforcer-rules/src/main/java/org/apache/maven/plugins/enforcer/RequirePluginVersions.java: Some input files use or override a deprecated API.
[windows-jdk10] [INFO] /F:/jenkins/jenkins-slave/workspace/aven-enforcer_MENFORCER-276-ARAEEUQ3DZKGP7LK65FX6C75KHKIJYNAPASQYCZKRS4IVUWL44FA/m/enforcer-rules/src/main/java/org/apache/maven/plugins/enforcer/RequirePluginVersions.java: Recompile with -Xlint:deprecation for details.
[windows-jdk10] [INFO] /F:/jenkins/jenkins-slave/workspace/aven-enforcer_MENFORCER-276-ARAEEUQ3DZKGP7LK65FX6C75KHKIJYNAPASQYCZKRS4IVUWL44FA/m/enforcer-rules/src/main/java/org/apache/maven/plugins/enforcer/RequirePluginVersions.java: F:\jenkins\jenkins-slave\workspace\aven-enforcer_MENFORCER-276-ARAEEUQ3DZKGP7LK65FX6C75KHKIJYNAPASQYCZKRS4IVUWL44FA\m\enforcer-rules\src\main\java\org\apache\maven\plugins\enforcer\RequirePluginVersions.java uses unchecked or unsafe operations.
[windows-jdk10] [INFO] /F:/jenkins/jenkins-slave/workspace/aven-enforcer_MENFORCER-276-ARAEEUQ3DZKGP7LK65FX6C75KHKIJYNAPASQYCZKRS4IVUWL44FA/m/enforcer-rules/src/main/java/org/apache/maven/plugins/enforcer/RequirePluginVersions.java: Recompile with -Xlint:unchecked for details.
[windows-jdk10] [INFO] 
[windows-jdk10] [INFO] --- maven-resources-plugin:3.0.2:testResources (default-testResources) @ enforcer-rules ---
[windows-jdk10] [INFO] Using 'UTF-8' encoding to copy filtered resources.
[windows-jdk10] [INFO] Copying 11 resources
[windows-jdk10] [INFO] Copying 3 resources
[windows-jdk10] [INFO] 
[windows-jdk10] [INFO] --- maven-compiler-plugin:3.7.0:testCompile (default-testCompile) @ enforcer-rules ---
[windows-jdk10] [INFO] Changes detected - recompiling the module!
[windows-jdk10] [INFO] Compiling 35 source files to F:\jenkins\jenkins-slave\workspace\aven-enforcer_MENFORCER-276-ARAEEUQ3DZKGP7LK65FX6C75KHKIJYNAPASQYCZKRS4IVUWL44FA\m\enforcer-rules\target\test-classes
[windows-jdk10] [INFO] /F:/jenkins/jenkins-slave/workspace/aven-enforcer_MENFORCER-276-ARAEEUQ3DZKGP7LK65FX6C75KHKIJYNAPASQYCZKRS4IVUWL44FA/m/enforcer-rules/src/test/java/org/apache/maven/plugins/enforcer/TestRequireUpperBoundDeps.java: Some input files use or override a deprecated API.
[windows-jdk10] [INFO] /F:/jenkins/jenkins-slave/workspace/aven-enforcer_MENFORCER-276-ARAEEUQ3DZKGP7LK65FX6C75KHKIJYNAPASQYCZKRS4IVUWL44FA/m/enforcer-rules/src/test/java/org/apache/maven/plugins/enforcer/TestRequireUpperBoundDeps.java: Recompile with -Xlint:deprecation for details.
[windows-jdk10] [INFO] /F:/jenkins/jenkins-slave/workspace/aven-enforcer_MENFORCER-276-ARAEEUQ3DZKGP7LK65FX6C75KHKIJYNAPASQYCZKRS4IVUWL44FA/m/enforcer-rules/src/test/java/org/apache/maven/plugins/enforcer/MockPlexusContainer.java: Some input files use unchecked or unsafe operations.
[windows-jdk10] [INFO] /F:/jenkins/jenkins-slave/workspace/aven-enforcer_MENFORCER-276-ARAEEUQ3DZKGP7LK65FX6C75KHKIJYNAPASQYCZKRS4IVUWL44FA/m/enforcer-rules/src/test/java/org/apache/maven/plugins/enforcer/MockPlexusContainer.java: Recompile with -Xlint:unchecked for details.
[windows-jdk10] [INFO] -------------------------------------------------------------
[windows-jdk10] [ERROR] COMPILATION ERROR : 
[windows-jdk10] [INFO] -------------------------------------------------------------
[windows-jdk10] [ERROR] /F:/jenkins/jenkins-slave/workspace/aven-enforcer_MENFORCER-276-ARAEEUQ3DZKGP7LK65FX6C75KHKIJYNAPASQYCZKRS4IVUWL44FA/m/enforcer-rules/src/test/java/org/apache/maven/plugins/enforcer/TestRequireUpperBoundDeps.java:[14,47] cannot find symbol
[windows-jdk10]   symbol:   class TestEnforcerRuleUtils
[windows-jdk10]   location: package org.apache.maven.plugins.enforcer.utils
[windows-jdk10] [ERROR] /F:/jenkins/jenkins-slave/workspace/aven-enforcer_MENFORCER-276-ARAEEUQ3DZKGP7LK65FX6C75KHKIJYNAPASQYCZKRS4IVUWL44FA/m/enforcer-rules/src/test/java/org/apache/maven/plugins/enforcer/TestRequireUpperBoundDeps.java:[87,9] cannot find symbol
[windows-jdk10]   symbol:   variable TestEnforcerRuleUtils
[windows-jdk10]   location: class org.apache.maven.plugins.enforcer.TestRequireUpperBoundDeps
[windows-jdk10] [ERROR] /F:/jenkins/jenkins-slave/workspace/aven-enforcer_MENFORCER-276-ARAEEUQ3DZKGP7LK65FX6C75KHKIJYNAPASQYCZKRS4IVUWL44FA/m/enforcer-rules/src/test/java/org/apache/maven/plugins/enforcer/TestRequireUpperBoundDeps.java:[97,9] cannot find symbol
[windows-jdk10]   symbol:   variable TestEnforcerRuleUtils
[windows-jdk10]   location: class org.apache.maven.plugins.enforcer.TestRequireUpperBoundDeps
[windows-jdk10] [ERROR] /F:/jenkins/jenkins-slave/workspace/aven-enforcer_MENFORCER-276-ARAEEUQ3DZKGP7LK65FX6C75KHKIJYNAPASQYCZKRS4IVUWL44FA/m/enforcer-rules/src/test/java/org/apache/maven/plugins/enforcer/TestRequireUpperBoundDeps.java:[107,9] cannot find symbol
[windows-jdk10]   symbol:   variable TestEnforcerRuleUtils
[windows-jdk10]   location: class org.apache.maven.plugins.enforcer.TestRequireUpperBoundDeps
[windows-jdk10] [ERROR] /F:/jenkins/jenkins-slave/workspace/aven-enforcer_MENFORCER-276-ARAEEUQ3DZKGP7LK65FX6C75KHKIJYNAPASQYCZKRS4IVUWL44FA/m/enforcer-rules/src/test/java/org/apache/maven/plugins/enforcer/TestRequireUpperBoundDeps.java:[118,9] cannot find symbol
[windows-jdk10]   symbol:   variable TestEnforcerRuleUtils
[windows-jdk10]   location: class org.apache.maven.plugins.enforcer.TestRequireUpperBoundDeps
[windows-jdk10] [INFO] 5 errors 
[windows-jdk10] [INFO] -------------------------------------------------------------
[windows-jdk10] [INFO] ------------------------------------------------------------------------
[windows-jdk10] [INFO] Reactor Summary:
[windows-jdk10] [INFO] 
[windows-jdk10] [INFO] Apache Maven Enforcer .............................. SUCCESS [ 18.476 s]
[windows-jdk10] [INFO] Apache Maven Enforcer API .......................... SUCCESS [  5.980 s]
[windows-jdk10] [INFO] Apache Maven Enforcer Built-In Rules ............... FAILURE [  6.113 s]
[windows-jdk10] [INFO] Apache Maven Enforcer Plugin ....................... SKIPPED
[windows-jdk10] [INFO] ------------------------------------------------------------------------
[windows-jdk10] [INFO] BUILD FAILURE
[windows-jdk10] [INFO] ------------------------------------------------------------------------
[windows-jdk10] [INFO] Total time: 32.165 s
[windows-jdk10] [INFO] Finished at: 2018-08-04T05:20:06Z
[windows-jdk10] [INFO] Final Memory: 39M/140M
[windows-jdk10] [INFO] ------------------------------------------------------------------------
[windows-jdk10] [INFO] [jenkins-event-spy] Generated F:\jenkins\jenkins-slave\workspace\aven-enforcer_MENFORCER-276-ARAEEUQ3DZKGP7LK65FX6C75KHKIJYNAPASQYCZKRS4IVUWL44FA@tmp\withMaven9f72ad64\maven-spy-20180804-051934-26715339462946346722211.log
[windows-jdk10] [ERROR] Failed to execute goal org.apache.maven.plugins:maven-compiler-plugin:3.7.0:testCompile (default-testCompile) on project enforcer-rules: Compilation failure: Compilation failure: 
[windows-jdk10] [ERROR] /F:/jenkins/jenkins-slave/workspace/aven-enforcer_MENFORCER-276-ARAEEUQ3DZKGP7LK65FX6C75KHKIJYNAPASQYCZKRS4IVUWL44FA/m/enforcer-rules/src/test/java/org/apache/maven/plugins/enforcer/TestRequireUpperBoundDeps.java:[14,47] cannot find symbol
[windows-jdk10] [ERROR]   symbol:   class TestEnforcerRuleUtils
[windows-jdk10] [ERROR]   location: package org.apache.maven.plugins.enforcer.utils
[windows-jdk10] [ERROR] /F:/jenkins/jenkins-slave/workspace/aven-enforcer_MENFORCER-276-ARAEEUQ3DZKGP7LK65FX6C75KHKIJYNAPASQYCZKRS4IVUWL44FA/m/enforcer-rules/src/test/java/org/apache/maven/plugins/enforcer/TestRequireUpperBoundDeps.java:[87,9] cannot find symbol
[windows-jdk10] [ERROR]   symbol:   variable TestEnforcerRuleUtils
[windows-jdk10] [ERROR]   location: class org.apache.maven.plugins.enforcer.TestRequireUpperBoundDeps
[windows-jdk10] [ERROR] /F:/jenkins/jenkins-slave/workspace/aven-enforcer_MENFORCER-276-ARAEEUQ3DZKGP7LK65FX6C75KHKIJYNAPASQYCZKRS4IVUWL44FA/m/enforcer-rules/src/test/java/org/apache/maven/plugins/enforcer/TestRequireUpperBoundDeps.java:[97,9] cannot find symbol
[windows-jdk10] [ERROR]   symbol:   variable TestEnforcerRuleUtils
[windows-jdk10] [ERROR]   location: class org.apache.maven.plugins.enforcer.TestRequireUpperBoundDeps
[windows-jdk10] [ERROR] /F:/jenkins/jenkins-slave/workspace/aven-enforcer_MENFORCER-276-ARAEEUQ3DZKGP7LK65FX6C75KHKIJYNAPASQYCZKRS4IVUWL44FA/m/enforcer-rules/src/test/java/org/apache/maven/plugins/enforcer/TestRequireUpperBoundDeps.java:[107,9] cannot find symbol
[windows-jdk10] [ERROR]   symbol:   variable TestEnforcerRuleUtils
[windows-jdk10] [ERROR]   location: class org.apache.maven.plugins.enforcer.TestRequireUpperBoundDeps
[windows-jdk10] [ERROR] /F:/jenkins/jenkins-slave/workspace/aven-enforcer_MENFORCER-276-ARAEEUQ3DZKGP7LK65FX6C75KHKIJYNAPASQYCZKRS4IVUWL44FA/m/enforcer-rules/src/test/java/org/apache/maven/plugins/enforcer/TestRequireUpperBoundDeps.java:[118,9] cannot find symbol
[windows-jdk10] [ERROR]   symbol:   variable TestEnforcerRuleUtils
[windows-jdk10] [ERROR]   location: class org.apache.maven.plugins.enforcer.TestRequireUpperBoundDeps
[windows-jdk10] [ERROR] -> [Help 1]
[windows-jdk10] [ERROR] 
[windows-jdk10] [ERROR] To see the full stack trace of the errors, re-run Maven with the -e switch.
[windows-jdk10] [ERROR] Re-run Maven using the -X switch to enable full debug logging.
[windows-jdk10] [ERROR] 
[windows-jdk10] [ERROR] For more information about the errors and possible solutions, please read the following articles:
[windows-jdk10] [ERROR] [Help 1] http://cwiki.apache.org/confluence/display/MAVEN/MojoFailureException
[windows-jdk10] [ERROR] 
[windows-jdk10] [ERROR] After correcting the problems, you can resume the build with the command
[windows-jdk10] [ERROR]   mvn <goals> -rf :enforcer-rules
[Pipeline] [windows-jdk10] }
[Pipeline] [windows-jdk10] // dir
[Pipeline] [windows-jdk10] }
[windows-jdk10] [withMaven] junitPublisher - Archive test results for Maven artifact org.apache.maven.enforcer:enforcer-api:3.0.0-SNAPSHOT generated by maven-surefire-plugin:test (default-test): m\enforcer-api\target\surefire-reports\*.xml
[windows-jdk10] Recording test results
[windows-jdk10] None of the test reports contained any result
[Pipeline] [windows-jdk10] // withMaven
[Pipeline] [windows-jdk10] cleanWs
[windows-jdk10] [WS-CLEANUP] Deleting project workspace...[WS-CLEANUP] done
[Pipeline] [windows-jdk10] cleanWs
[windows-jdk10] [WS-CLEANUP] Deleting project workspace...[WS-CLEANUP] done
[Pipeline] [windows-jdk10] }
[Pipeline] [windows-jdk10] // stage
[Pipeline] [windows-jdk10] }
[Pipeline] [windows-jdk10] // node
[Pipeline] [windows-jdk10] }
[windows-jdk10] Failed in branch windows-jdk10
[Pipeline] // parallel
[Pipeline] stage
[Pipeline] { (Notifications)
[Pipeline] echo
Build result: FAILURE
[Pipeline] jiraIssueSelector
[Pipeline] emailext

Build failed in Jenkins: Maven TLP » maven-enforcer » MENFORCER-276 #7

Posted by Apache Jenkins Server <je...@builds.apache.org>.
See https://builds.apache.org/job/maven-box/job/maven-enforcer/job/MENFORCER-276/7/

Changes:

* INFRA-16749, INFRA-16768  - Followup cleanup under all circumstances.
* INFRA-16749, INFRA-16768  - Followup cleanup under all circumstances.
* ubunut-eu2 is back online.

No tests ran.

Build log:
[...truncated 2.12 MB...]
[windows-jdk10] [INFO] Downloaded: https://repo.maven.apache.org/maven2/org/codehaus/plexus/plexus-compiler-manager/2.8.2/plexus-compiler-manager-2.8.2.jar (4.7 kB at 84 kB/s)
[windows-jdk10] [INFO] Downloaded: https://repo.maven.apache.org/maven2/com/thoughtworks/qdox/qdox/2.0-M7/qdox-2.0-M7.jar (315 kB at 3.3 MB/s)
[windows-jdk10] [INFO] Changes detected - recompiling the module!
[windows-jdk10] [INFO] Compiling 5 source files to F:\jenkins\jenkins-slave\workspace\aven-enforcer_MENFORCER-276-ARAEEUQ3DZKGP7LK65FX6C75KHKIJYNAPASQYCZKRS4IVUWL44FA\m\enforcer-api\target\classes
[windows-jdk10] [INFO] 
[windows-jdk10] [INFO] --- maven-resources-plugin:3.0.2:testResources (default-testResources) @ enforcer-api ---
[windows-jdk10] [INFO] Using 'UTF-8' encoding to copy filtered resources.
[windows-jdk10] [INFO] skip non existing resourceDirectory F:\jenkins\jenkins-slave\workspace\aven-enforcer_MENFORCER-276-ARAEEUQ3DZKGP7LK65FX6C75KHKIJYNAPASQYCZKRS4IVUWL44FA\m\enforcer-api\src\test\resources
[windows-jdk10] [INFO] Copying 3 resources
[windows-jdk10] [INFO] 
[windows-jdk10] [INFO] --- maven-compiler-plugin:3.7.0:testCompile (default-testCompile) @ enforcer-api ---
[windows-jdk10] [INFO] No sources to compile
[windows-jdk10] [INFO] 
[windows-jdk10] [INFO] --- maven-surefire-plugin:2.21.0:test (default-test) @ enforcer-api ---
[windows-jdk10] [INFO] Downloading: https://repo.maven.apache.org/maven2/org/apache/maven/surefire/maven-surefire-common/2.21.0/maven-surefire-common-2.21.0.pom
[windows-jdk10] [INFO] Downloaded: https://repo.maven.apache.org/maven2/org/apache/maven/surefire/maven-surefire-common/2.21.0/maven-surefire-common-2.21.0.pom (11 kB at 1.4 MB/s)
[windows-jdk10] [INFO] Downloading: https://repo.maven.apache.org/maven2/org/apache/maven/plugin-tools/maven-plugin-annotations/3.5/maven-plugin-annotations-3.5.pom
[windows-jdk10] [INFO] Downloaded: https://repo.maven.apache.org/maven2/org/apache/maven/plugin-tools/maven-plugin-annotations/3.5/maven-plugin-annotations-3.5.pom (1.7 kB at 128 kB/s)
[windows-jdk10] [INFO] Downloading: https://repo.maven.apache.org/maven2/org/apache/maven/plugin-tools/maven-plugin-tools/3.5/maven-plugin-tools-3.5.pom
[windows-jdk10] [INFO] Downloaded: https://repo.maven.apache.org/maven2/org/apache/maven/plugin-tools/maven-plugin-tools/3.5/maven-plugin-tools-3.5.pom (16 kB at 2.3 MB/s)
[windows-jdk10] [INFO] Downloading: https://repo.maven.apache.org/maven2/org/apache/maven/surefire/surefire-api/2.21.0/surefire-api-2.21.0.pom
[windows-jdk10] [INFO] Downloaded: https://repo.maven.apache.org/maven2/org/apache/maven/surefire/surefire-api/2.21.0/surefire-api-2.21.0.pom (3.5 kB at 506 kB/s)
[windows-jdk10] [INFO] Downloading: https://repo.maven.apache.org/maven2/org/apache/maven/surefire/surefire-logger-api/2.21.0/surefire-logger-api-2.21.0.pom
[windows-jdk10] [INFO] Downloaded: https://repo.maven.apache.org/maven2/org/apache/maven/surefire/surefire-logger-api/2.21.0/surefire-logger-api-2.21.0.pom (2.0 kB at 335 kB/s)
[windows-jdk10] [INFO] Downloading: https://repo.maven.apache.org/maven2/org/apache/maven/surefire/surefire-booter/2.21.0/surefire-booter-2.21.0.pom
[windows-jdk10] [INFO] Downloaded: https://repo.maven.apache.org/maven2/org/apache/maven/surefire/surefire-booter/2.21.0/surefire-booter-2.21.0.pom (7.4 kB at 1.1 MB/s)
[windows-jdk10] [INFO] Downloading: https://repo.maven.apache.org/maven2/org/apache/maven/maven-toolchain/2.2.1/maven-toolchain-2.2.1.pom
[windows-jdk10] [INFO] Downloaded: https://repo.maven.apache.org/maven2/org/apache/maven/maven-toolchain/2.2.1/maven-toolchain-2.2.1.pom (3.3 kB at 478 kB/s)
[windows-jdk10] [INFO] Downloading: https://repo.maven.apache.org/maven2/org/codehaus/plexus/plexus-java/0.9.3/plexus-java-0.9.3.pom
[windows-jdk10] [INFO] Downloaded: https://repo.maven.apache.org/maven2/org/codehaus/plexus/plexus-java/0.9.3/plexus-java-0.9.3.pom (2.4 kB at 392 kB/s)
[windows-jdk10] [INFO] Downloading: https://repo.maven.apache.org/maven2/org/codehaus/plexus/plexus-languages/0.9.3/plexus-languages-0.9.3.pom
[windows-jdk10] [INFO] Downloaded: https://repo.maven.apache.org/maven2/org/codehaus/plexus/plexus-languages/0.9.3/plexus-languages-0.9.3.pom (2.2 kB at 367 kB/s)
[windows-jdk10] [INFO] Downloading: https://repo.maven.apache.org/maven2/org/apache/maven/surefire/maven-surefire-common/2.21.0/maven-surefire-common-2.21.0.jar
[windows-jdk10] [INFO] Downloading: https://repo.maven.apache.org/maven2/org/apache/maven/surefire/surefire-logger-api/2.21.0/surefire-logger-api-2.21.0.jar
[windows-jdk10] [INFO] Downloading: https://repo.maven.apache.org/maven2/org/apache/maven/plugin-tools/maven-plugin-annotations/3.5/maven-plugin-annotations-3.5.jar
[windows-jdk10] [INFO] Downloading: https://repo.maven.apache.org/maven2/org/apache/maven/surefire/surefire-booter/2.21.0/surefire-booter-2.21.0.jar
[windows-jdk10] [INFO] Downloading: https://repo.maven.apache.org/maven2/org/apache/maven/surefire/surefire-api/2.21.0/surefire-api-2.21.0.jar
[windows-jdk10] [INFO] Downloaded: https://repo.maven.apache.org/maven2/org/apache/maven/plugin-tools/maven-plugin-annotations/3.5/maven-plugin-annotations-3.5.jar (14 kB at 1.4 MB/s)
[windows-jdk10] [INFO] Downloading: https://repo.maven.apache.org/maven2/junit/junit/4.12/junit-4.12.jar
[windows-jdk10] [INFO] Downloaded: https://repo.maven.apache.org/maven2/org/apache/maven/surefire/surefire-logger-api/2.21.0/surefire-logger-api-2.21.0.jar (13 kB at 1.1 MB/s)
[windows-jdk10] [INFO] Downloading: https://repo.maven.apache.org/maven2/org/apache/maven/maven-toolchain/2.2.1/maven-toolchain-2.2.1.jar
[windows-jdk10] [INFO] Downloaded: https://repo.maven.apache.org/maven2/org/apache/maven/surefire/surefire-api/2.21.0/surefire-api-2.21.0.jar (185 kB at 2.5 MB/s)
[windows-jdk10] [INFO] Downloading: https://repo.maven.apache.org/maven2/org/codehaus/plexus/plexus-java/0.9.3/plexus-java-0.9.3.jar
[windows-jdk10] [INFO] Downloaded: https://repo.maven.apache.org/maven2/org/apache/maven/surefire/surefire-booter/2.21.0/surefire-booter-2.21.0.jar (273 kB at 3.7 MB/s)
[windows-jdk10] [INFO] Downloaded: https://repo.maven.apache.org/maven2/org/apache/maven/surefire/maven-surefire-common/2.21.0/maven-surefire-common-2.21.0.jar (521 kB at 6.8 MB/s)
[windows-jdk10] [INFO] Downloaded: https://repo.maven.apache.org/maven2/org/codehaus/plexus/plexus-java/0.9.3/plexus-java-0.9.3.jar (32 kB at 349 kB/s)
[windows-jdk10] [INFO] Downloaded: https://repo.maven.apache.org/maven2/junit/junit/4.12/junit-4.12.jar (315 kB at 3.5 MB/s)
[windows-jdk10] [INFO] Downloaded: https://repo.maven.apache.org/maven2/org/apache/maven/maven-toolchain/2.2.1/maven-toolchain-2.2.1.jar (38 kB at 409 kB/s)
[windows-jdk10] [INFO] 
[windows-jdk10] [INFO] --- maven-jar-plugin:3.0.2:jar (default-jar) @ enforcer-api ---
[windows-jdk10] [INFO] Downloading: https://repo.maven.apache.org/maven2/org/apache/maven/shared/maven-shared-utils/3.0.1/maven-shared-utils-3.0.1.jar
[windows-jdk10] [INFO] Downloaded: https://repo.maven.apache.org/maven2/org/apache/maven/shared/maven-shared-utils/3.0.1/maven-shared-utils-3.0.1.jar (154 kB at 7.0 MB/s)
[windows-jdk10] [INFO] Building jar: F:\jenkins\jenkins-slave\workspace\aven-enforcer_MENFORCER-276-ARAEEUQ3DZKGP7LK65FX6C75KHKIJYNAPASQYCZKRS4IVUWL44FA\m\enforcer-api\target\enforcer-api-3.0.0-SNAPSHOT.jar
[windows-jdk10] [INFO] 
[windows-jdk10] [INFO] --- maven-site-plugin:3.7:attach-descriptor (attach-descriptor) @ enforcer-api ---
[windows-jdk10] [INFO] Skipping because packaging 'jar' is not pom.
[windows-jdk10] [INFO] 
[windows-jdk10] [INFO] --- maven-checkstyle-plugin:3.0.0:check (checkstyle-check) @ enforcer-api ---
[windows-jdk10] [INFO] 
[windows-jdk10] [INFO] ------------------------------------------------------------------------
[windows-jdk10] [INFO] Building Apache Maven Enforcer Built-In Rules 3.0.0-SNAPSHOT
[windows-jdk10] [INFO] ------------------------------------------------------------------------
[windows-jdk10] [INFO] Downloading: https://repo.maven.apache.org/maven2/org/apache/maven/shared/maven-common-artifact-filters/3.0.1/maven-common-artifact-filters-3.0.1.pom
[windows-jdk10] [INFO] Downloaded: https://repo.maven.apache.org/maven2/org/apache/maven/shared/maven-common-artifact-filters/3.0.1/maven-common-artifact-filters-3.0.1.pom (4.8 kB at 967 kB/s)
[windows-jdk10] [INFO] Downloading: https://repo.maven.apache.org/maven2/org/apache/maven/plugin-testing/maven-plugin-testing-harness/2.1/maven-plugin-testing-harness-2.1.pom
[windows-jdk10] [INFO] Downloaded: https://repo.maven.apache.org/maven2/org/apache/maven/plugin-testing/maven-plugin-testing-harness/2.1/maven-plugin-testing-harness-2.1.pom (3.2 kB at 646 kB/s)
[windows-jdk10] [INFO] Downloading: https://repo.maven.apache.org/maven2/org/apache/maven/plugin-testing/maven-plugin-testing/2.1/maven-plugin-testing-2.1.pom
[windows-jdk10] [INFO] Downloaded: https://repo.maven.apache.org/maven2/org/apache/maven/plugin-testing/maven-plugin-testing/2.1/maven-plugin-testing-2.1.pom (10 kB at 1.7 MB/s)
[windows-jdk10] [INFO] Downloading: https://repo.maven.apache.org/maven2/commons-codec/commons-codec/1.6/commons-codec-1.6.pom
[windows-jdk10] [INFO] Downloaded: https://repo.maven.apache.org/maven2/commons-codec/commons-codec/1.6/commons-codec-1.6.pom (11 kB at 1.9 MB/s)
[windows-jdk10] [INFO] Downloading: https://repo.maven.apache.org/maven2/org/apache/commons/commons-parent/22/commons-parent-22.pom
[windows-jdk10] [INFO] Downloaded: https://repo.maven.apache.org/maven2/org/apache/commons/commons-parent/22/commons-parent-22.pom (42 kB at 5.2 MB/s)
[windows-jdk10] [INFO] Downloading: https://repo.maven.apache.org/maven2/org/mockito/mockito-core/2.18.3/mockito-core-2.18.3.pom
[windows-jdk10] [INFO] Downloaded: https://repo.maven.apache.org/maven2/org/mockito/mockito-core/2.18.3/mockito-core-2.18.3.pom (16 kB at 2.7 MB/s)
[windows-jdk10] [INFO] Downloading: https://repo.maven.apache.org/maven2/net/bytebuddy/byte-buddy/1.8.5/byte-buddy-1.8.5.pom
[windows-jdk10] [INFO] Downloaded: https://repo.maven.apache.org/maven2/net/bytebuddy/byte-buddy/1.8.5/byte-buddy-1.8.5.pom (12 kB at 1.7 MB/s)
[windows-jdk10] [INFO] Downloading: https://repo.maven.apache.org/maven2/net/bytebuddy/byte-buddy-parent/1.8.5/byte-buddy-parent-1.8.5.pom
[windows-jdk10] [INFO] Downloaded: https://repo.maven.apache.org/maven2/net/bytebuddy/byte-buddy-parent/1.8.5/byte-buddy-parent-1.8.5.pom (27 kB at 3.8 MB/s)
[windows-jdk10] [INFO] Downloading: https://repo.maven.apache.org/maven2/net/bytebuddy/byte-buddy-agent/1.8.5/byte-buddy-agent-1.8.5.pom
[windows-jdk10] [INFO] Downloaded: https://repo.maven.apache.org/maven2/net/bytebuddy/byte-buddy-agent/1.8.5/byte-buddy-agent-1.8.5.pom (4.9 kB at 820 kB/s)
[windows-jdk10] [INFO] Downloading: https://repo.maven.apache.org/maven2/org/objenesis/objenesis/2.6/objenesis-2.6.pom
[windows-jdk10] [INFO] Downloaded: https://repo.maven.apache.org/maven2/org/objenesis/objenesis/2.6/objenesis-2.6.pom (2.8 kB at 464 kB/s)
[windows-jdk10] [INFO] Downloading: https://repo.maven.apache.org/maven2/org/objenesis/objenesis-parent/2.6/objenesis-parent-2.6.pom
[windows-jdk10] [INFO] Downloaded: https://repo.maven.apache.org/maven2/org/objenesis/objenesis-parent/2.6/objenesis-parent-2.6.pom (17 kB at 2.8 MB/s)
[windows-jdk10] [INFO] Downloading: https://repo.maven.apache.org/maven2/org/apache/maven/maven-compat/3.0/maven-compat-3.0.pom
[windows-jdk10] [INFO] Downloaded: https://repo.maven.apache.org/maven2/org/apache/maven/maven-compat/3.0/maven-compat-3.0.pom (4.0 kB at 670 kB/s)
[windows-jdk10] [INFO] Downloading: https://repo.maven.apache.org/maven2/org/apache/maven/wagon/wagon-provider-api/1.0-beta-6/wagon-provider-api-1.0-beta-6.pom
[windows-jdk10] [INFO] Downloaded: https://repo.maven.apache.org/maven2/org/apache/maven/wagon/wagon-provider-api/1.0-beta-6/wagon-provider-api-1.0-beta-6.pom (1.8 kB at 293 kB/s)
[windows-jdk10] [INFO] Downloading: https://repo.maven.apache.org/maven2/org/apache/maven/wagon/wagon/1.0-beta-6/wagon-1.0-beta-6.pom
[windows-jdk10] [INFO] Downloaded: https://repo.maven.apache.org/maven2/org/apache/maven/wagon/wagon/1.0-beta-6/wagon-1.0-beta-6.pom (12 kB at 2.1 MB/s)
[windows-jdk10] [INFO] Downloading: https://repo.maven.apache.org/maven2/org/assertj/assertj-core/1.7.1/assertj-core-1.7.1.pom
[windows-jdk10] [INFO] Downloaded: https://repo.maven.apache.org/maven2/org/assertj/assertj-core/1.7.1/assertj-core-1.7.1.pom (4.7 kB at 935 kB/s)
[windows-jdk10] [INFO] Downloading: https://repo.maven.apache.org/maven2/org/assertj/assertj-parent-pom/1.2.6/assertj-parent-pom-1.2.6.pom
[windows-jdk10] [INFO] Downloaded: https://repo.maven.apache.org/maven2/org/assertj/assertj-parent-pom/1.2.6/assertj-parent-pom-1.2.6.pom (13 kB at 2.2 MB/s)
[windows-jdk10] [INFO] Downloading: https://repo.maven.apache.org/maven2/org/apache/maven/shared/maven-common-artifact-filters/3.0.1/maven-common-artifact-filters-3.0.1.jar
[windows-jdk10] [INFO] Downloading: https://repo.maven.apache.org/maven2/org/apache/maven/plugin-testing/maven-plugin-testing-harness/2.1/maven-plugin-testing-harness-2.1.jar
[windows-jdk10] [INFO] Downloading: https://repo.maven.apache.org/maven2/org/mockito/mockito-core/2.18.3/mockito-core-2.18.3.jar
[windows-jdk10] [INFO] Downloading: https://repo.maven.apache.org/maven2/org/apache/commons/commons-lang3/3.5/commons-lang3-3.5.jar
[windows-jdk10] [INFO] Downloading: https://repo.maven.apache.org/maven2/commons-codec/commons-codec/1.6/commons-codec-1.6.jar
[windows-jdk10] [INFO] Downloaded: https://repo.maven.apache.org/maven2/org/apache/maven/shared/maven-common-artifact-filters/3.0.1/maven-common-artifact-filters-3.0.1.jar (61 kB at 4.1 MB/s)
[windows-jdk10] [INFO] Downloading: https://repo.maven.apache.org/maven2/net/bytebuddy/byte-buddy/1.8.5/byte-buddy-1.8.5.jar
[windows-jdk10] [INFO] Downloaded: https://repo.maven.apache.org/maven2/org/apache/maven/plugin-testing/maven-plugin-testing-harness/2.1/maven-plugin-testing-harness-2.1.jar (39 kB at 1.9 MB/s)
[windows-jdk10] [INFO] Downloading: https://repo.maven.apache.org/maven2/net/bytebuddy/byte-buddy-agent/1.8.5/byte-buddy-agent-1.8.5.jar
[windows-jdk10] [INFO] Downloaded: https://repo.maven.apache.org/maven2/commons-codec/commons-codec/1.6/commons-codec-1.6.jar (233 kB at 10 MB/s)
[windows-jdk10] [INFO] Downloading: https://repo.maven.apache.org/maven2/org/objenesis/objenesis/2.6/objenesis-2.6.jar
[windows-jdk10] [INFO] Downloaded: https://repo.maven.apache.org/maven2/org/apache/commons/commons-lang3/3.5/commons-lang3-3.5.jar (480 kB at 16 MB/s)
[windows-jdk10] [INFO] Downloading: https://repo.maven.apache.org/maven2/org/apache/maven/maven-compat/3.0/maven-compat-3.0.jar
[windows-jdk10] [INFO] Downloaded: https://repo.maven.apache.org/maven2/net/bytebuddy/byte-buddy-agent/1.8.5/byte-buddy-agent-1.8.5.jar (40 kB at 1.1 MB/s)
[windows-jdk10] [INFO] Downloading: https://repo.maven.apache.org/maven2/org/apache/maven/wagon/wagon-provider-api/1.0-beta-6/wagon-provider-api-1.0-beta-6.jar
[windows-jdk10] [INFO] Downloaded: https://repo.maven.apache.org/maven2/org/objenesis/objenesis/2.6/objenesis-2.6.jar (56 kB at 1.3 MB/s)
[windows-jdk10] [INFO] Downloading: https://repo.maven.apache.org/maven2/org/assertj/assertj-core/1.7.1/assertj-core-1.7.1.jar
[windows-jdk10] [INFO] Downloaded: https://repo.maven.apache.org/maven2/org/mockito/mockito-core/2.18.3/mockito-core-2.18.3.jar (556 kB at 9.9 MB/s)
[windows-jdk10] [INFO] Downloaded: https://repo.maven.apache.org/maven2/org/apache/maven/wagon/wagon-provider-api/1.0-beta-6/wagon-provider-api-1.0-beta-6.jar (53 kB at 950 kB/s)
[windows-jdk10] [INFO] Downloaded: https://repo.maven.apache.org/maven2/org/apache/maven/maven-compat/3.0/maven-compat-3.0.jar (285 kB at 4.0 MB/s)
[windows-jdk10] [INFO] Downloaded: https://repo.maven.apache.org/maven2/org/assertj/assertj-core/1.7.1/assertj-core-1.7.1.jar (619 kB at 7.7 MB/s)
[windows-jdk10] [INFO] Downloaded: https://repo.maven.apache.org/maven2/net/bytebuddy/byte-buddy/1.8.5/byte-buddy-1.8.5.jar (3.0 MB at 22 MB/s)
[windows-jdk10] [INFO] 
[windows-jdk10] [INFO] --- maven-clean-plugin:3.0.0:clean (default-clean) @ enforcer-rules ---
[windows-jdk10] [INFO] 
[windows-jdk10] [INFO] --- maven-enforcer-plugin:1.4.1:enforce (enforce-maven-version) @ enforcer-rules ---
[windows-jdk10] [INFO] 
[windows-jdk10] [INFO] --- maven-enforcer-plugin:1.4.1:enforce (enforce-bytecode-version) @ enforcer-rules ---
[windows-jdk10] [INFO] 
[windows-jdk10] [INFO] --- maven-enforcer-plugin:1.4.1:enforce (ban-known-bad-maven-versions) @ enforcer-rules ---
[windows-jdk10] [INFO] 
[windows-jdk10] [INFO] --- apache-rat-plugin:0.12:check (rat-check) @ enforcer-rules ---
[windows-jdk10] [INFO] Enabled default license matchers.
[windows-jdk10] [INFO] Will parse SCM ignores for exclusions...
[windows-jdk10] [INFO] Finished adding exclusions from SCM ignore files.
[windows-jdk10] [INFO] 61 implicit excludes (use -debug for more details).
[windows-jdk10] [INFO] Exclude: .repository/**
[windows-jdk10] [INFO] Exclude: .maven/spy.log
[windows-jdk10] [INFO] Exclude: dependency-reduced-pom.xml
[windows-jdk10] [INFO] Exclude: .java-version
[windows-jdk10] [INFO] 130 resources included (use -debug for more details)
[windows-jdk10] [INFO] Rat check: Summary over all files. Unapproved: 0, unknown: 0, generated: 0, approved: 124 licenses.
[windows-jdk10] [INFO] 
[windows-jdk10] [INFO] --- maven-remote-resources-plugin:1.5:process (process-resource-bundles) @ enforcer-rules ---
[windows-jdk10] [INFO] 
[windows-jdk10] [INFO] --- maven-resources-plugin:3.0.2:resources (default-resources) @ enforcer-rules ---
[windows-jdk10] [INFO] Using 'UTF-8' encoding to copy filtered resources.
[windows-jdk10] [INFO] skip non existing resourceDirectory F:\jenkins\jenkins-slave\workspace\aven-enforcer_MENFORCER-276-ARAEEUQ3DZKGP7LK65FX6C75KHKIJYNAPASQYCZKRS4IVUWL44FA\m\enforcer-rules\src\main\resources
[windows-jdk10] [INFO] Copying 3 resources
[windows-jdk10] [INFO] 
[windows-jdk10] [INFO] --- maven-compiler-plugin:3.7.0:compile (default-compile) @ enforcer-rules ---
[windows-jdk10] [INFO] Changes detected - recompiling the module!
[windows-jdk10] [INFO] Compiling 43 source files to F:\jenkins\jenkins-slave\workspace\aven-enforcer_MENFORCER-276-ARAEEUQ3DZKGP7LK65FX6C75KHKIJYNAPASQYCZKRS4IVUWL44FA\m\enforcer-rules\target\classes
[windows-jdk10] [INFO] /F:/jenkins/jenkins-slave/workspace/aven-enforcer_MENFORCER-276-ARAEEUQ3DZKGP7LK65FX6C75KHKIJYNAPASQYCZKRS4IVUWL44FA/m/enforcer-rules/src/main/java/org/apache/maven/plugins/enforcer/RequirePluginVersions.java: Some input files use or override a deprecated API.
[windows-jdk10] [INFO] /F:/jenkins/jenkins-slave/workspace/aven-enforcer_MENFORCER-276-ARAEEUQ3DZKGP7LK65FX6C75KHKIJYNAPASQYCZKRS4IVUWL44FA/m/enforcer-rules/src/main/java/org/apache/maven/plugins/enforcer/RequirePluginVersions.java: Recompile with -Xlint:deprecation for details.
[windows-jdk10] [INFO] /F:/jenkins/jenkins-slave/workspace/aven-enforcer_MENFORCER-276-ARAEEUQ3DZKGP7LK65FX6C75KHKIJYNAPASQYCZKRS4IVUWL44FA/m/enforcer-rules/src/main/java/org/apache/maven/plugins/enforcer/RequirePluginVersions.java: F:\jenkins\jenkins-slave\workspace\aven-enforcer_MENFORCER-276-ARAEEUQ3DZKGP7LK65FX6C75KHKIJYNAPASQYCZKRS4IVUWL44FA\m\enforcer-rules\src\main\java\org\apache\maven\plugins\enforcer\RequirePluginVersions.java uses unchecked or unsafe operations.
[windows-jdk10] [INFO] /F:/jenkins/jenkins-slave/workspace/aven-enforcer_MENFORCER-276-ARAEEUQ3DZKGP7LK65FX6C75KHKIJYNAPASQYCZKRS4IVUWL44FA/m/enforcer-rules/src/main/java/org/apache/maven/plugins/enforcer/RequirePluginVersions.java: Recompile with -Xlint:unchecked for details.
[windows-jdk10] [INFO] 
[windows-jdk10] [INFO] --- maven-resources-plugin:3.0.2:testResources (default-testResources) @ enforcer-rules ---
[windows-jdk10] [INFO] Using 'UTF-8' encoding to copy filtered resources.
[windows-jdk10] [INFO] Copying 11 resources
[windows-jdk10] [INFO] Copying 3 resources
[windows-jdk10] [INFO] 
[windows-jdk10] [INFO] --- maven-compiler-plugin:3.7.0:testCompile (default-testCompile) @ enforcer-rules ---
[windows-jdk10] [INFO] Changes detected - recompiling the module!
[windows-jdk10] [INFO] Compiling 35 source files to F:\jenkins\jenkins-slave\workspace\aven-enforcer_MENFORCER-276-ARAEEUQ3DZKGP7LK65FX6C75KHKIJYNAPASQYCZKRS4IVUWL44FA\m\enforcer-rules\target\test-classes
[windows-jdk10] [INFO] /F:/jenkins/jenkins-slave/workspace/aven-enforcer_MENFORCER-276-ARAEEUQ3DZKGP7LK65FX6C75KHKIJYNAPASQYCZKRS4IVUWL44FA/m/enforcer-rules/src/test/java/org/apache/maven/plugins/enforcer/TestRequireUpperBoundDeps.java: Some input files use or override a deprecated API.
[windows-jdk10] [INFO] /F:/jenkins/jenkins-slave/workspace/aven-enforcer_MENFORCER-276-ARAEEUQ3DZKGP7LK65FX6C75KHKIJYNAPASQYCZKRS4IVUWL44FA/m/enforcer-rules/src/test/java/org/apache/maven/plugins/enforcer/TestRequireUpperBoundDeps.java: Recompile with -Xlint:deprecation for details.
[windows-jdk10] [INFO] /F:/jenkins/jenkins-slave/workspace/aven-enforcer_MENFORCER-276-ARAEEUQ3DZKGP7LK65FX6C75KHKIJYNAPASQYCZKRS4IVUWL44FA/m/enforcer-rules/src/test/java/org/apache/maven/plugins/enforcer/MockPlexusContainer.java: Some input files use unchecked or unsafe operations.
[windows-jdk10] [INFO] /F:/jenkins/jenkins-slave/workspace/aven-enforcer_MENFORCER-276-ARAEEUQ3DZKGP7LK65FX6C75KHKIJYNAPASQYCZKRS4IVUWL44FA/m/enforcer-rules/src/test/java/org/apache/maven/plugins/enforcer/MockPlexusContainer.java: Recompile with -Xlint:unchecked for details.
[windows-jdk10] [INFO] -------------------------------------------------------------
[windows-jdk10] [ERROR] COMPILATION ERROR : 
[windows-jdk10] [INFO] -------------------------------------------------------------
[windows-jdk10] [ERROR] /F:/jenkins/jenkins-slave/workspace/aven-enforcer_MENFORCER-276-ARAEEUQ3DZKGP7LK65FX6C75KHKIJYNAPASQYCZKRS4IVUWL44FA/m/enforcer-rules/src/test/java/org/apache/maven/plugins/enforcer/TestRequireUpperBoundDeps.java:[14,47] cannot find symbol
[windows-jdk10]   symbol:   class TestEnforcerRuleUtils
[windows-jdk10]   location: package org.apache.maven.plugins.enforcer.utils
[windows-jdk10] [ERROR] /F:/jenkins/jenkins-slave/workspace/aven-enforcer_MENFORCER-276-ARAEEUQ3DZKGP7LK65FX6C75KHKIJYNAPASQYCZKRS4IVUWL44FA/m/enforcer-rules/src/test/java/org/apache/maven/plugins/enforcer/TestRequireUpperBoundDeps.java:[87,9] cannot find symbol
[windows-jdk10]   symbol:   variable TestEnforcerRuleUtils
[windows-jdk10]   location: class org.apache.maven.plugins.enforcer.TestRequireUpperBoundDeps
[windows-jdk10] [ERROR] /F:/jenkins/jenkins-slave/workspace/aven-enforcer_MENFORCER-276-ARAEEUQ3DZKGP7LK65FX6C75KHKIJYNAPASQYCZKRS4IVUWL44FA/m/enforcer-rules/src/test/java/org/apache/maven/plugins/enforcer/TestRequireUpperBoundDeps.java:[97,9] cannot find symbol
[windows-jdk10]   symbol:   variable TestEnforcerRuleUtils
[windows-jdk10]   location: class org.apache.maven.plugins.enforcer.TestRequireUpperBoundDeps
[windows-jdk10] [ERROR] /F:/jenkins/jenkins-slave/workspace/aven-enforcer_MENFORCER-276-ARAEEUQ3DZKGP7LK65FX6C75KHKIJYNAPASQYCZKRS4IVUWL44FA/m/enforcer-rules/src/test/java/org/apache/maven/plugins/enforcer/TestRequireUpperBoundDeps.java:[107,9] cannot find symbol
[windows-jdk10]   symbol:   variable TestEnforcerRuleUtils
[windows-jdk10]   location: class org.apache.maven.plugins.enforcer.TestRequireUpperBoundDeps
[windows-jdk10] [ERROR] /F:/jenkins/jenkins-slave/workspace/aven-enforcer_MENFORCER-276-ARAEEUQ3DZKGP7LK65FX6C75KHKIJYNAPASQYCZKRS4IVUWL44FA/m/enforcer-rules/src/test/java/org/apache/maven/plugins/enforcer/TestRequireUpperBoundDeps.java:[118,9] cannot find symbol
[windows-jdk10]   symbol:   variable TestEnforcerRuleUtils
[windows-jdk10]   location: class org.apache.maven.plugins.enforcer.TestRequireUpperBoundDeps
[windows-jdk10] [INFO] 5 errors 
[windows-jdk10] [INFO] -------------------------------------------------------------
[windows-jdk10] [INFO] ------------------------------------------------------------------------
[windows-jdk10] [INFO] Reactor Summary:
[windows-jdk10] [INFO] 
[windows-jdk10] [INFO] Apache Maven Enforcer .............................. SUCCESS [ 14.587 s]
[windows-jdk10] [INFO] Apache Maven Enforcer API .......................... SUCCESS [  3.930 s]
[windows-jdk10] [INFO] Apache Maven Enforcer Built-In Rules ............... FAILURE [  4.698 s]
[windows-jdk10] [INFO] Apache Maven Enforcer Plugin ....................... SKIPPED
[windows-jdk10] [INFO] ------------------------------------------------------------------------
[windows-jdk10] [INFO] BUILD FAILURE
[windows-jdk10] [INFO] ------------------------------------------------------------------------
[windows-jdk10] [INFO] Total time: 24.358 s
[windows-jdk10] [INFO] Finished at: 2018-07-24T05:18:02Z
[windows-jdk10] [INFO] Final Memory: 38M/137M
[windows-jdk10] [INFO] ------------------------------------------------------------------------
[windows-jdk10] [INFO] [jenkins-event-spy] Generated F:\jenkins\jenkins-slave\workspace\aven-enforcer_MENFORCER-276-ARAEEUQ3DZKGP7LK65FX6C75KHKIJYNAPASQYCZKRS4IVUWL44FA@tmp\withMaven32da0939\maven-spy-20180724-051738-9313634405793801866880.log
[windows-jdk10] [ERROR] Failed to execute goal org.apache.maven.plugins:maven-compiler-plugin:3.7.0:testCompile (default-testCompile) on project enforcer-rules: Compilation failure: Compilation failure: 
[windows-jdk10] [ERROR] /F:/jenkins/jenkins-slave/workspace/aven-enforcer_MENFORCER-276-ARAEEUQ3DZKGP7LK65FX6C75KHKIJYNAPASQYCZKRS4IVUWL44FA/m/enforcer-rules/src/test/java/org/apache/maven/plugins/enforcer/TestRequireUpperBoundDeps.java:[14,47] cannot find symbol
[windows-jdk10] [ERROR]   symbol:   class TestEnforcerRuleUtils
[windows-jdk10] [ERROR]   location: package org.apache.maven.plugins.enforcer.utils
[windows-jdk10] [ERROR] /F:/jenkins/jenkins-slave/workspace/aven-enforcer_MENFORCER-276-ARAEEUQ3DZKGP7LK65FX6C75KHKIJYNAPASQYCZKRS4IVUWL44FA/m/enforcer-rules/src/test/java/org/apache/maven/plugins/enforcer/TestRequireUpperBoundDeps.java:[87,9] cannot find symbol
[windows-jdk10] [ERROR]   symbol:   variable TestEnforcerRuleUtils
[windows-jdk10] [ERROR]   location: class org.apache.maven.plugins.enforcer.TestRequireUpperBoundDeps
[windows-jdk10] [ERROR] /F:/jenkins/jenkins-slave/workspace/aven-enforcer_MENFORCER-276-ARAEEUQ3DZKGP7LK65FX6C75KHKIJYNAPASQYCZKRS4IVUWL44FA/m/enforcer-rules/src/test/java/org/apache/maven/plugins/enforcer/TestRequireUpperBoundDeps.java:[97,9] cannot find symbol
[windows-jdk10] [ERROR]   symbol:   variable TestEnforcerRuleUtils
[windows-jdk10] [ERROR]   location: class org.apache.maven.plugins.enforcer.TestRequireUpperBoundDeps
[windows-jdk10] [ERROR] /F:/jenkins/jenkins-slave/workspace/aven-enforcer_MENFORCER-276-ARAEEUQ3DZKGP7LK65FX6C75KHKIJYNAPASQYCZKRS4IVUWL44FA/m/enforcer-rules/src/test/java/org/apache/maven/plugins/enforcer/TestRequireUpperBoundDeps.java:[107,9] cannot find symbol
[windows-jdk10] [ERROR]   symbol:   variable TestEnforcerRuleUtils
[windows-jdk10] [ERROR]   location: class org.apache.maven.plugins.enforcer.TestRequireUpperBoundDeps
[windows-jdk10] [ERROR] /F:/jenkins/jenkins-slave/workspace/aven-enforcer_MENFORCER-276-ARAEEUQ3DZKGP7LK65FX6C75KHKIJYNAPASQYCZKRS4IVUWL44FA/m/enforcer-rules/src/test/java/org/apache/maven/plugins/enforcer/TestRequireUpperBoundDeps.java:[118,9] cannot find symbol
[windows-jdk10] [ERROR]   symbol:   variable TestEnforcerRuleUtils
[windows-jdk10] [ERROR]   location: class org.apache.maven.plugins.enforcer.TestRequireUpperBoundDeps
[windows-jdk10] [ERROR] -> [Help 1]
[windows-jdk10] [ERROR] 
[windows-jdk10] [ERROR] To see the full stack trace of the errors, re-run Maven with the -e switch.
[windows-jdk10] [ERROR] Re-run Maven using the -X switch to enable full debug logging.
[windows-jdk10] [ERROR] 
[windows-jdk10] [ERROR] For more information about the errors and possible solutions, please read the following articles:
[windows-jdk10] [ERROR] [Help 1] http://cwiki.apache.org/confluence/display/MAVEN/MojoFailureException
[windows-jdk10] [ERROR] 
[windows-jdk10] [ERROR] After correcting the problems, you can resume the build with the command
[windows-jdk10] [ERROR]   mvn <goals> -rf :enforcer-rules
[Pipeline] [windows-jdk10] }
[Pipeline] [windows-jdk10] // dir
[Pipeline] [windows-jdk10] }
[windows-jdk10] [withMaven] junitPublisher - Archive test results for Maven artifact org.apache.maven.enforcer:enforcer-api:3.0.0-SNAPSHOT generated by maven-surefire-plugin:test (default-test): m\enforcer-api\target\surefire-reports\*.xml
[windows-jdk10] Recording test results
[windows-jdk10] None of the test reports contained any result
[Pipeline] [windows-jdk10] // withMaven
[Pipeline] [windows-jdk10] cleanWs
[windows-jdk10] [WS-CLEANUP] Deleting project workspace...[WS-CLEANUP] done
[Pipeline] [windows-jdk10] cleanWs
[windows-jdk10] [WS-CLEANUP] Deleting project workspace...[WS-CLEANUP] done
[Pipeline] [windows-jdk10] }
[Pipeline] [windows-jdk10] // stage
[Pipeline] [windows-jdk10] }
[Pipeline] [windows-jdk10] // node
[Pipeline] [windows-jdk10] }
[windows-jdk10] Failed in branch windows-jdk10
[Pipeline] // parallel
[Pipeline] stage
[Pipeline] { (Notifications)
[Pipeline] echo
Build result: FAILURE
[Pipeline] jiraIssueSelector
[Pipeline] emailext