You are viewing a plain text version of this content. The canonical link for it is here.
Posted to builds@beam.apache.org by Apache Jenkins Server <je...@builds.apache.org> on 2021/05/08 12:34:12 UTC

Build failed in Jenkins: beam_LoadTests_Java_GBK_Dataflow_Streaming #730

See <https://ci-beam.apache.org/job/beam_LoadTests_Java_GBK_Dataflow_Streaming/730/display/redirect?page=changes>

Changes:

[Pablo Estrada] [BEAM-11271] WgetDataset instead of getTable for query location

[Ismaël Mejía] [BEAM-11055] Fix mistaken version of log4j in HCatalog

[Ismaël Mejía] Revert "[BEAM-9112] Bump jboss-module to 1.11.0.Final"

[noreply] [BEAM-11841] Optimize byte size calculation of lazy iterables (#14610)

[noreply] [BEAM-9920][BEAM-11418] Go Xlang artifact staging to GCP w/ Dataflow

[noreply] Fix silent failures in Python SDK worker if pickled main session is

[Kyle Weaver] [BEAM-8888] Improve handling of unknown types in CalciteUtils.

[noreply] [BEAM-12258] Filter lists so testSQLLimit doesn't fail to parse "[]"

[noreply] [BEAM-12250] Double Py Dataflow VR timeouts (#14754)


------------------------------------------
[...truncated 26.00 KB...]
> Task :sdks:java:core:compileJava FROM-CACHE
> Task :sdks:java:core:classes
> Task :sdks:java:core:shadowJar FROM-CACHE
> Task :sdks:java:testing:test-utils:compileJava FROM-CACHE
> Task :sdks:java:testing:test-utils:classes UP-TO-DATE
> Task :sdks:java:testing:test-utils:jar
> Task :sdks:java:io:kinesis:compileJava FROM-CACHE
> Task :sdks:java:io:kinesis:classes UP-TO-DATE
> Task :sdks:java:extensions:protobuf:extractIncludeProto
> Task :sdks:java:extensions:protobuf:generateProto NO-SOURCE
> Task :sdks:java:extensions:protobuf:compileJava FROM-CACHE
> Task :sdks:java:extensions:protobuf:classes UP-TO-DATE
> Task :sdks:java:fn-execution:compileJava FROM-CACHE
> Task :sdks:java:fn-execution:classes UP-TO-DATE
> Task :sdks:java:io:kinesis:jar
> Task :sdks:java:fn-execution:jar
> Task :sdks:java:extensions:protobuf:jar
> Task :runners:core-construction-java:compileJava FROM-CACHE
> Task :runners:core-construction-java:classes UP-TO-DATE
> Task :runners:core-construction-java:jar
> Task :runners:core-java:compileJava FROM-CACHE
> Task :runners:core-java:classes UP-TO-DATE
> Task :runners:core-java:jar
> Task :sdks:java:extensions:google-cloud-platform-core:compileJava FROM-CACHE
> Task :sdks:java:extensions:google-cloud-platform-core:classes UP-TO-DATE
> Task :sdks:java:extensions:google-cloud-platform-core:jar
> Task :sdks:java:harness:compileJava FROM-CACHE
> Task :sdks:java:harness:classes UP-TO-DATE
> Task :sdks:java:harness:jar
> Task :sdks:java:harness:shadowJar FROM-CACHE
> Task :runners:java-fn-execution:compileJava FROM-CACHE
> Task :runners:java-fn-execution:classes UP-TO-DATE
> Task :runners:java-fn-execution:jar
> Task :sdks:java:expansion-service:compileJava FROM-CACHE
> Task :sdks:java:expansion-service:classes UP-TO-DATE
> Task :sdks:java:expansion-service:jar
> Task :sdks:java:io:kafka:compileJava FROM-CACHE
> Task :sdks:java:io:kafka:classes UP-TO-DATE
> Task :sdks:java:io:kafka:jar
> Task :sdks:java:io:google-cloud-platform:compileJava FROM-CACHE
> Task :sdks:java:io:google-cloud-platform:classes UP-TO-DATE
> Task :sdks:java:io:google-cloud-platform:jar
> Task :runners:google-cloud-dataflow-java:compileJava FROM-CACHE
> Task :runners:google-cloud-dataflow-java:classes
> Task :runners:google-cloud-dataflow-java:jar
> Task :runners:google-cloud-dataflow-java:****:legacy-****:compileJava FROM-CACHE
> Task :runners:google-cloud-dataflow-java:****:legacy-****:classes UP-TO-DATE
> Task :runners:google-cloud-dataflow-java:****:legacy-****:shadowJar FROM-CACHE

> Task :sdks:java:io:synthetic:compileJava
Note: <https://ci-beam.apache.org/job/beam_LoadTests_Java_GBK_Dataflow_Streaming/ws/src/sdks/java/io/synthetic/src/main/java/org/apache/beam/sdk/io/synthetic/SyntheticBoundedSource.java> uses or overrides a deprecated API.
Note: Recompile with -Xlint:deprecation for details.

> Task :sdks:java:io:synthetic:classes
> Task :sdks:java:io:synthetic:jar

> Task :sdks:java:testing:load-tests:compileJava
Note: Some input files use unchecked or unsafe operations.
Note: Recompile with -Xlint:unchecked for details.

> Task :sdks:java:testing:load-tests:classes
> Task :sdks:java:testing:load-tests:jar

> Task :sdks:java:testing:load-tests:run
May 08, 2021 12:09:45 PM org.apache.beam.runners.dataflow.DataflowRunner validateSdkContainerImageOptions
WARNING: Prefer --sdkContainerImage over deprecated legacy option --****HarnessContainerImage.
May 08, 2021 12:09:46 PM org.apache.beam.runners.dataflow.options.DataflowPipelineOptions$StagingLocationFactory create
INFO: No stagingLocation provided, falling back to gcpTempLocation
May 08, 2021 12:09:47 PM org.apache.beam.runners.dataflow.DataflowRunner fromOptions
INFO: PipelineOptions.filesToStage was not specified. Defaulting to files from the classpath: will stage 188 files. Enable logging at DEBUG level to see which files will be staged.
May 08, 2021 12:09:47 PM org.apache.beam.runners.dataflow.DataflowRunner run
INFO: Executing pipeline on the Dataflow Service, which will have billing implications related to Google Compute Engine usage and other Google Cloud Services.
May 08, 2021 12:09:50 PM org.apache.beam.runners.dataflow.DataflowRunner run
INFO: Staging portable pipeline proto to gs://temp-storage-for-perf-tests/loadtests/staging/
May 08, 2021 12:09:50 PM org.apache.beam.runners.dataflow.util.PackageUtil tryStagePackage
INFO: Uploading <91912 bytes, hash eb0105f7761bd8f2e27f1cf3c8fa2450bc3d1e5502d3fc125c2224f4c4ef9722> to gs://temp-storage-for-perf-tests/loadtests/staging/pipeline-6wEF93Yb2PLifxzzyPokULw9HlUC0_wSXCIk9MTvlyI.pb
May 08, 2021 12:09:51 PM org.apache.beam.runners.dataflow.util.PackageUtil stageClasspathElements
INFO: Uploading 189 files from PipelineOptions.filesToStage to staging location to prepare for execution.
May 08, 2021 12:09:51 PM org.apache.beam.runners.dataflow.util.PackageUtil$PackageAttributes forFileToStage
INFO: Staging custom dataflow-****.jar as beam-runners-google-cloud-dataflow-java-legacy-****-2.31.0-SNAPSHOT-kcdnZjdrL6vP4zyu35nUD2TE0MvljukBlrfoT5jRa_I.jar
May 08, 2021 12:09:52 PM org.apache.beam.runners.dataflow.util.PackageUtil tryStagePackage
INFO: Uploading /home/jenkins/.gradle/caches/modules-2/files-2.1/com.fasterxml.jackson.dataformat/jackson-dataformat-cbor/2.12.1/ac5d8670334090de075f956fae36812a6bdbdabb/jackson-dataformat-cbor-2.12.1.jar to gs://temp-storage-for-perf-tests/loadtests/staging/jackson-dataformat-cbor-2.12.1-52d5rqlCfKc9f0B-X6gIoEBVeOwFZlOoZcJuTG8B1Cg.jar
May 08, 2021 12:09:52 PM org.apache.beam.runners.dataflow.util.PackageUtil tryStagePackage
INFO: Uploading /home/jenkins/.gradle/caches/modules-2/files-2.1/com.google.auto.value/auto-value-annotations/1.8.1/174878f9cc9cbacb8b464d774afb2ccf938f257b/auto-value-annotations-1.8.1.jar to gs://temp-storage-for-perf-tests/loadtests/staging/auto-value-annotations-1.8.1-N-wJtH1-01qZ0Tkn21yG_JBx9iD5Q-rV11cURpgxCFI.jar
May 08, 2021 12:09:52 PM org.apache.beam.runners.dataflow.util.PackageUtil stageClasspathElements
INFO: Staging files complete: 187 files cached, 2 files newly uploaded in 1 seconds
May 08, 2021 12:09:52 PM org.apache.beam.runners.dataflow.DataflowPipelineTranslator$Translator addStep
INFO: Adding Read input/DataflowRunner.StreamingUnboundedRead.ReadWithIds as step s1
May 08, 2021 12:09:52 PM org.apache.beam.sdk.io.synthetic.SyntheticUnboundedSource split
INFO: Split into 20 bundles of sizes: [org.apache.beam.sdk.io.synthetic.SyntheticUnboundedSource@26c47874, org.apache.beam.sdk.io.synthetic.SyntheticUnboundedSource@421056e5, org.apache.beam.sdk.io.synthetic.SyntheticUnboundedSource@2849434b, org.apache.beam.sdk.io.synthetic.SyntheticUnboundedSource@60bbacfc, org.apache.beam.sdk.io.synthetic.SyntheticUnboundedSource@65b97f47, org.apache.beam.sdk.io.synthetic.SyntheticUnboundedSource@255eaa6b, org.apache.beam.sdk.io.synthetic.SyntheticUnboundedSource@476fe690, org.apache.beam.sdk.io.synthetic.SyntheticUnboundedSource@7a0e7ecd, org.apache.beam.sdk.io.synthetic.SyntheticUnboundedSource@54e3658c, org.apache.beam.sdk.io.synthetic.SyntheticUnboundedSource@43e9089, org.apache.beam.sdk.io.synthetic.SyntheticUnboundedSource@3c5dbdf8, org.apache.beam.sdk.io.synthetic.SyntheticUnboundedSource@352c44a8, org.apache.beam.sdk.io.synthetic.SyntheticUnboundedSource@7aac8884, org.apache.beam.sdk.io.synthetic.SyntheticUnboundedSource@a66e580, org.apache.beam.sdk.io.synthetic.SyntheticUnboundedSource@5b852b49, org.apache.beam.sdk.io.synthetic.SyntheticUnboundedSource@cdb2d95, org.apache.beam.sdk.io.synthetic.SyntheticUnboundedSource@122d6c22, org.apache.beam.sdk.io.synthetic.SyntheticUnboundedSource@2f5ac102, org.apache.beam.sdk.io.synthetic.SyntheticUnboundedSource@5df778c3, org.apache.beam.sdk.io.synthetic.SyntheticUnboundedSource@895416d]
May 08, 2021 12:09:53 PM org.apache.beam.runners.dataflow.DataflowPipelineTranslator$Translator addStep
INFO: Adding Read input/StripIds as step s2
May 08, 2021 12:09:53 PM org.apache.beam.runners.dataflow.DataflowPipelineTranslator$Translator addStep
INFO: Adding Collect start time metrics as step s3
May 08, 2021 12:09:53 PM org.apache.beam.runners.dataflow.DataflowPipelineTranslator$Translator addStep
INFO: Adding Total bytes monitor as step s4
May 08, 2021 12:09:53 PM org.apache.beam.runners.dataflow.DataflowPipelineTranslator$Translator addStep
INFO: Adding Window.Into()/Window.Assign as step s5
May 08, 2021 12:09:53 PM org.apache.beam.runners.dataflow.DataflowPipelineTranslator$Translator addStep
INFO: Adding Group by key (0) as step s6
May 08, 2021 12:09:53 PM org.apache.beam.runners.dataflow.DataflowPipelineTranslator$Translator addStep
INFO: Adding Ungroup and reiterate (0) as step s7
May 08, 2021 12:09:53 PM org.apache.beam.runners.dataflow.DataflowPipelineTranslator$Translator addStep
INFO: Adding Collect end time metrics (0) as step s8
May 08, 2021 12:09:53 PM org.apache.beam.runners.dataflow.DataflowRunner run
INFO: Dataflow SDK version: 2.31.0-SNAPSHOT
May 08, 2021 12:09:54 PM org.apache.beam.runners.dataflow.DataflowRunner run
INFO: To access the Dataflow monitoring console, please navigate to https://console.cloud.google.com/dataflow/jobs/us-central1/2021-05-08_05_09_53-15103019869399081257?project=apache-beam-testing
May 08, 2021 12:09:54 PM org.apache.beam.runners.dataflow.DataflowRunner run
INFO: Submitted job: 2021-05-08_05_09_53-15103019869399081257
May 08, 2021 12:09:54 PM org.apache.beam.runners.dataflow.DataflowRunner run
INFO: To cancel the job using the 'gcloud' tool, run:
> gcloud dataflow jobs --project=apache-beam-testing cancel --region=us-central1 2021-05-08_05_09_53-15103019869399081257
May 08, 2021 12:09:58 PM org.apache.beam.runners.dataflow.util.MonitoringUtil$LoggingHandler process
WARNING: 2021-05-08T12:09:58.245Z: The workflow name is not a valid Cloud Label. Labels applied to Cloud resources (such as GCE Instances) for monitoring will be labeled with this modified job name: load0tests0java0dataflow0streaming0gbk01-jenkins-050812094-rhtd. For the best monitoring experience, please name your job with a valid Cloud Label. For details, see: https://cloud.google.com/compute/docs/labeling-resources#restrictions
May 08, 2021 12:10:03 PM org.apache.beam.runners.dataflow.util.MonitoringUtil$LoggingHandler process
INFO: 2021-05-08T12:10:02.098Z: Worker configuration: n1-standard-4 in us-central1-f.
May 08, 2021 12:10:03 PM org.apache.beam.runners.dataflow.util.MonitoringUtil$LoggingHandler process
INFO: 2021-05-08T12:10:02.875Z: Expanding CoGroupByKey operations into optimizable parts.
May 08, 2021 12:10:03 PM org.apache.beam.runners.dataflow.util.MonitoringUtil$LoggingHandler process
INFO: 2021-05-08T12:10:02.944Z: Expanding SplittableProcessKeyed operations into optimizable parts.
May 08, 2021 12:10:03 PM org.apache.beam.runners.dataflow.util.MonitoringUtil$LoggingHandler process
INFO: 2021-05-08T12:10:02.976Z: Expanding GroupByKey operations into streaming Read/Write steps
May 08, 2021 12:10:03 PM org.apache.beam.runners.dataflow.util.MonitoringUtil$LoggingHandler process
INFO: 2021-05-08T12:10:03.045Z: Lifting ValueCombiningMappingFns into MergeBucketsMappingFns
May 08, 2021 12:10:03 PM org.apache.beam.runners.dataflow.util.MonitoringUtil$LoggingHandler process
INFO: 2021-05-08T12:10:03.140Z: Fusing adjacent ParDo, Read, Write, and Flatten operations
May 08, 2021 12:10:03 PM org.apache.beam.runners.dataflow.util.MonitoringUtil$LoggingHandler process
INFO: 2021-05-08T12:10:03.168Z: Fusing consumer Read input/StripIds into Read input/DataflowRunner.StreamingUnboundedRead.ReadWithIds
May 08, 2021 12:10:03 PM org.apache.beam.runners.dataflow.util.MonitoringUtil$LoggingHandler process
INFO: 2021-05-08T12:10:03.196Z: Fusing consumer Collect start time metrics into Read input/StripIds
May 08, 2021 12:10:03 PM org.apache.beam.runners.dataflow.util.MonitoringUtil$LoggingHandler process
INFO: 2021-05-08T12:10:03.225Z: Fusing consumer Total bytes monitor into Collect start time metrics
May 08, 2021 12:10:03 PM org.apache.beam.runners.dataflow.util.MonitoringUtil$LoggingHandler process
INFO: 2021-05-08T12:10:03.250Z: Fusing consumer Window.Into()/Window.Assign into Total bytes monitor
May 08, 2021 12:10:03 PM org.apache.beam.runners.dataflow.util.MonitoringUtil$LoggingHandler process
INFO: 2021-05-08T12:10:03.291Z: Fusing consumer Group by key (0)/WriteStream into Window.Into()/Window.Assign
May 08, 2021 12:10:03 PM org.apache.beam.runners.dataflow.util.MonitoringUtil$LoggingHandler process
INFO: 2021-05-08T12:10:03.346Z: Fusing consumer Group by key (0)/MergeBuckets into Group by key (0)/ReadStream
May 08, 2021 12:10:03 PM org.apache.beam.runners.dataflow.util.MonitoringUtil$LoggingHandler process
INFO: 2021-05-08T12:10:03.438Z: Fusing consumer Ungroup and reiterate (0) into Group by key (0)/MergeBuckets
May 08, 2021 12:10:03 PM org.apache.beam.runners.dataflow.util.MonitoringUtil$LoggingHandler process
INFO: 2021-05-08T12:10:03.473Z: Fusing consumer Collect end time metrics (0) into Ungroup and reiterate (0)
May 08, 2021 12:10:06 PM org.apache.beam.runners.dataflow.util.MonitoringUtil$LoggingHandler process
INFO: 2021-05-08T12:10:03.948Z: Executing operation Group by key (0)/ReadStream+Group by key (0)/MergeBuckets+Ungroup and reiterate (0)+Collect end time metrics (0)
May 08, 2021 12:10:06 PM org.apache.beam.runners.dataflow.util.MonitoringUtil$LoggingHandler process
INFO: 2021-05-08T12:10:03.983Z: Executing operation Read input/DataflowRunner.StreamingUnboundedRead.ReadWithIds+Read input/StripIds+Collect start time metrics+Total bytes monitor+Window.Into()/Window.Assign+Group by key (0)/WriteStream
May 08, 2021 12:10:06 PM org.apache.beam.runners.dataflow.util.MonitoringUtil$LoggingHandler process
INFO: 2021-05-08T12:10:04.017Z: Starting 5 ****s in us-central1-f...
May 08, 2021 12:10:17 PM org.apache.beam.runners.dataflow.util.MonitoringUtil$LoggingHandler process
INFO: 2021-05-08T12:10:14.969Z: Your project already contains 100 Dataflow-created metric descriptors, so new user metrics of the form custom.googleapis.com/* will not be created. However, all user metrics are also available in the metric dataflow.googleapis.com/job/user_counter. If you rely on the custom metrics, you can delete old / unused metric descriptors. See https://developers.google.com/apis-explorer/#p/monitoring/v3/monitoring.projects.metricDescriptors.list and https://developers.google.com/apis-explorer/#p/monitoring/v3/monitoring.projects.metricDescriptors.delete
May 08, 2021 12:10:37 PM org.apache.beam.runners.dataflow.util.MonitoringUtil$LoggingHandler process
INFO: 2021-05-08T12:10:36.801Z: Autoscaling: Raised the number of ****s to 1 so that the pipeline can catch up with its backlog and keep up with its input rate.
May 08, 2021 12:10:37 PM org.apache.beam.runners.dataflow.util.MonitoringUtil$LoggingHandler process
INFO: 2021-05-08T12:10:36.848Z: Resized **** pool to 1, though goal was 5.  This could be a quota issue.
May 08, 2021 12:10:47 PM org.apache.beam.runners.dataflow.util.MonitoringUtil$LoggingHandler process
INFO: 2021-05-08T12:10:47.315Z: Autoscaling: Raised the number of ****s to 5 so that the pipeline can catch up with its backlog and keep up with its input rate.
May 08, 2021 12:11:17 PM org.apache.beam.runners.dataflow.util.MonitoringUtil$LoggingHandler process
INFO: 2021-05-08T12:11:16.672Z: Workers have started successfully.
May 08, 2021 12:11:17 PM org.apache.beam.runners.dataflow.util.MonitoringUtil$LoggingHandler process
INFO: 2021-05-08T12:11:16.704Z: Workers have started successfully.
May 08, 2021 12:32:01 PM org.apache.beam.runners.dataflow.util.MonitoringUtil$LoggingHandler process
INFO: 2021-05-08T12:32:00.046Z: Finished operation Group by key (0)/ReadStream+Group by key (0)/MergeBuckets+Ungroup and reiterate (0)+Collect end time metrics (0)
May 08, 2021 12:32:01 PM org.apache.beam.runners.dataflow.util.MonitoringUtil$LoggingHandler process
INFO: 2021-05-08T12:32:00.046Z: Finished operation Read input/DataflowRunner.StreamingUnboundedRead.ReadWithIds+Read input/StripIds+Collect start time metrics+Total bytes monitor+Window.Into()/Window.Assign+Group by key (0)/WriteStream
May 08, 2021 12:32:01 PM org.apache.beam.runners.dataflow.util.MonitoringUtil$LoggingHandler process
INFO: 2021-05-08T12:32:00.922Z: Cleaning up.
May 08, 2021 12:32:01 PM org.apache.beam.runners.dataflow.util.MonitoringUtil$LoggingHandler process
INFO: 2021-05-08T12:32:01.013Z: Stopping **** pool...
May 08, 2021 12:32:54 PM org.apache.beam.runners.dataflow.util.MonitoringUtil$LoggingHandler process
INFO: 2021-05-08T12:32:54.282Z: Autoscaling: Reduced the number of ****s to 0 based on low average **** CPU utilization, and the pipeline having sufficiently low backlog and keeping up with input rate.
May 08, 2021 12:32:54 PM org.apache.beam.runners.dataflow.util.MonitoringUtil$LoggingHandler process
INFO: 2021-05-08T12:32:54.340Z: Worker pool stopped.
May 08, 2021 12:33:07 PM org.apache.beam.runners.dataflow.DataflowPipelineJob logTerminalState
INFO: Job 2021-05-08_05_09_53-15103019869399081257 finished with status DONE.
Load test results for test (ID): 9037e2e8-fea2-4564-8d24-8e65921267b3 and timestamp: 2021-05-08T12:09:47.393000000Z:
                 Metric:                    Value:
    dataflow_runtime_sec                  1069.739
dataflow_total_bytes_count               2.7352998E9
Exception in thread "main" com.google.cloud.bigquery.BigQueryException: Read timed out
	at com.google.cloud.bigquery.spi.v2.HttpBigQueryRpc.translate(HttpBigQueryRpc.java:115)
	at com.google.cloud.bigquery.spi.v2.HttpBigQueryRpc.getTable(HttpBigQueryRpc.java:286)
	at com.google.cloud.bigquery.BigQueryImpl$17.call(BigQueryImpl.java:717)
	at com.google.cloud.bigquery.BigQueryImpl$17.call(BigQueryImpl.java:714)
	at com.google.api.gax.retrying.DirectRetryingExecutor.submit(DirectRetryingExecutor.java:105)
	at com.google.cloud.RetryHelper.run(RetryHelper.java:76)
	at com.google.cloud.RetryHelper.runWithRetries(RetryHelper.java:50)
	at com.google.cloud.bigquery.BigQueryImpl.getTable(BigQueryImpl.java:713)
	at org.apache.beam.sdk.testutils.publishing.BigQueryClient.createTableIfNotExists(BigQueryClient.java:145)
	at org.apache.beam.sdk.testutils.publishing.BigQueryClient.insertAll(BigQueryClient.java:109)
	at org.apache.beam.sdk.testutils.publishing.BigQueryResultsPublisher.publish(BigQueryResultsPublisher.java:57)
	at org.apache.beam.sdk.loadtests.LoadTest.publishResultsToBigQuery(LoadTest.java:177)
	at org.apache.beam.sdk.loadtests.LoadTest.run(LoadTest.java:140)
	at org.apache.beam.sdk.loadtests.GroupByKeyLoadTest.run(GroupByKeyLoadTest.java:57)
	at org.apache.beam.sdk.loadtests.GroupByKeyLoadTest.main(GroupByKeyLoadTest.java:131)
Caused by: java.net.SocketTimeoutException: Read timed out
	at java.net.SocketInputStream.socketRead0(Native Method)
	at java.net.SocketInputStream.socketRead(SocketInputStream.java:116)
	at java.net.SocketInputStream.read(SocketInputStream.java:171)
	at java.net.SocketInputStream.read(SocketInputStream.java:141)
	at sun.security.ssl.SSLSocketInputRecord.read(SSLSocketInputRecord.java:457)
	at sun.security.ssl.SSLSocketInputRecord.bytesInCompletePacket(SSLSocketInputRecord.java:68)
	at sun.security.ssl.SSLSocketImpl.readApplicationRecord(SSLSocketImpl.java:1332)
	at sun.security.ssl.SSLSocketImpl.access$300(SSLSocketImpl.java:73)
	at sun.security.ssl.SSLSocketImpl$AppInputStream.read(SSLSocketImpl.java:948)
	at java.io.BufferedInputStream.fill(BufferedInputStream.java:246)
	at java.io.BufferedInputStream.read1(BufferedInputStream.java:286)
	at java.io.BufferedInputStream.read(BufferedInputStream.java:345)
	at sun.net.www.http.HttpClient.parseHTTPHeader(HttpClient.java:735)
	at sun.net.www.http.HttpClient.parseHTTP(HttpClient.java:678)
	at sun.net.www.protocol.http.HttpURLConnection.getInputStream0(HttpURLConnection.java:1593)
	at sun.net.www.protocol.http.HttpURLConnection.getInputStream(HttpURLConnection.java:1498)
	at java.net.HttpURLConnection.getResponseCode(HttpURLConnection.java:480)
	at sun.net.www.protocol.https.HttpsURLConnectionImpl.getResponseCode(HttpsURLConnectionImpl.java:352)
	at com.google.api.client.http.javanet.NetHttpResponse.<init>(NetHttpResponse.java:36)
	at com.google.api.client.http.javanet.NetHttpRequest.execute(NetHttpRequest.java:149)
	at com.google.api.client.http.javanet.NetHttpRequest.execute(NetHttpRequest.java:84)
	at com.google.api.client.http.HttpRequest.execute(HttpRequest.java:1012)
	at com.google.api.client.googleapis.services.AbstractGoogleClientRequest.executeUnparsed(AbstractGoogleClientRequest.java:514)
	at com.google.api.client.googleapis.services.AbstractGoogleClientRequest.executeUnparsed(AbstractGoogleClientRequest.java:455)
	at com.google.api.client.googleapis.services.AbstractGoogleClientRequest.execute(AbstractGoogleClientRequest.java:565)
	at com.google.cloud.bigquery.spi.v2.HttpBigQueryRpc.getTable(HttpBigQueryRpc.java:284)
	... 13 more

> Task :sdks:java:testing:load-tests:run FAILED

FAILURE: Build failed with an exception.

* What went wrong:
Execution failed for task ':sdks:java:testing:load-tests:run'.
> Process 'command '/usr/lib/jvm/java-8-openjdk-amd64/bin/java'' finished with non-zero exit value 1

* Try:
Run with --stacktrace option to get the stack trace. Run with --info or --debug option to get more log output. Run with --scan to get full insights.

* Get more help at https://help.gradle.org

Deprecated Gradle features were used in this build, making it incompatible with Gradle 7.0.
Use '--warning-mode all' to show the individual deprecation warnings.
See https://docs.gradle.org/6.8.3/userguide/command_line_interface.html#sec:command_line_warnings

BUILD FAILED in 25m 21s
87 actionable tasks: 56 executed, 31 from cache

Publishing build scan...
https://gradle.com/s/inwfopkbtj76a

Build step 'Invoke Gradle script' changed build result to FAILURE
Build step 'Invoke Gradle script' marked build as failure

---------------------------------------------------------------------
To unsubscribe, e-mail: builds-unsubscribe@beam.apache.org
For additional commands, e-mail: builds-help@beam.apache.org


Jenkins build is back to normal : beam_LoadTests_Java_GBK_Dataflow_Streaming #731

Posted by Apache Jenkins Server <je...@builds.apache.org>.
See <https://ci-beam.apache.org/job/beam_LoadTests_Java_GBK_Dataflow_Streaming/731/display/redirect>


---------------------------------------------------------------------
To unsubscribe, e-mail: builds-unsubscribe@beam.apache.org
For additional commands, e-mail: builds-help@beam.apache.org