You are viewing a plain text version of this content. The canonical link for it is here.
Posted to builds@beam.apache.org by Apache Jenkins Server <je...@builds.apache.org> on 2023/10/19 08:04:13 UTC
Build failed in Jenkins: beam_PostCommit_Java_Nexmark_Dataflow #10768
See <https://ci-beam.apache.org/job/beam_PostCommit_Java_Nexmark_Dataflow/10768/display/redirect?page=changes>
Changes:
[noreply] [Security] Bump org.json:json due to CVE-2022-45688 (#28962)
------------------------------------------
[...truncated 1.35 MB...]
2023-10-19T08:01:48.934Z 0 samples not enough to calculate steady-state event rate
Oct 19, 2023 8:01:48 AM org.apache.beam.sdk.testutils.metrics.MetricsReader getCounterMetric
2023-10-19T08:01:48.987Z no activity
SEVERE: Failed to get metric fatal, from namespace SqlQuery7
2023-10-19T08:02:04.030Z RUNNING SqlQuery7
Oct 19, 2023 8:02:04 AM org.apache.beam.sdk.testutils.metrics.MetricsReader getCounterMetric
SEVERE: Failed to get metric event.elements, from namespace SqlQuery7.Events
Oct 19, 2023 8:02:04 AM org.apache.beam.sdk.testutils.metrics.MetricsReader getCounterMetric
SEVERE: Failed to get metric event.bytes, from namespace SqlQuery7.Events
Oct 19, 2023 8:02:04 AM org.apache.beam.sdk.testutils.metrics.MetricsReader getCounterMetric
SEVERE: Failed to get metric result.elements, from namespace SqlQuery7.Results
Oct 19, 2023 8:02:04 AM org.apache.beam.sdk.testutils.metrics.MetricsReader getCounterMetric
SEVERE: Failed to get metric result.bytes, from namespace SqlQuery7.Results
2023-10-19T08:02:04.648Z 0 samples not enough to calculate steady-state event rate
Oct 19, 2023 8:02:04 AM org.apache.beam.sdk.testutils.metrics.MetricsReader getCounterMetric
2023-10-19T08:02:04.704Z no activity
SEVERE: Failed to get metric fatal, from namespace SqlQuery7
2023-10-19T08:02:19.747Z RUNNING SqlQuery7
Oct 19, 2023 8:02:19 AM org.apache.beam.sdk.testutils.metrics.MetricsReader getCounterMetric
SEVERE: Failed to get metric event.elements, from namespace SqlQuery7.Events
Oct 19, 2023 8:02:19 AM org.apache.beam.sdk.testutils.metrics.MetricsReader getCounterMetric
SEVERE: Failed to get metric event.bytes, from namespace SqlQuery7.Events
Oct 19, 2023 8:02:20 AM org.apache.beam.sdk.testutils.metrics.MetricsReader getCounterMetric
SEVERE: Failed to get metric result.elements, from namespace SqlQuery7.Results
Oct 19, 2023 8:02:20 AM org.apache.beam.sdk.testutils.metrics.MetricsReader getCounterMetric
SEVERE: Failed to get metric result.bytes, from namespace SqlQuery7.Results
2023-10-19T08:02:20.316Z 0 samples not enough to calculate steady-state event rate
Oct 19, 2023 8:02:20 AM org.apache.beam.sdk.testutils.metrics.MetricsReader getCounterMetric
2023-10-19T08:02:20.361Z no activity
SEVERE: Failed to get metric fatal, from namespace SqlQuery7
2023-10-19T08:02:35.401Z RUNNING SqlQuery7
Oct 19, 2023 8:02:35 AM org.apache.beam.sdk.testutils.metrics.MetricsReader getCounterMetric
SEVERE: Failed to get metric event.elements, from namespace SqlQuery7.Events
Oct 19, 2023 8:02:35 AM org.apache.beam.sdk.testutils.metrics.MetricsReader getCounterMetric
SEVERE: Failed to get metric event.bytes, from namespace SqlQuery7.Events
Oct 19, 2023 8:02:35 AM org.apache.beam.sdk.testutils.metrics.MetricsReader getCounterMetric
SEVERE: Failed to get metric result.elements, from namespace SqlQuery7.Results
Oct 19, 2023 8:02:35 AM org.apache.beam.sdk.testutils.metrics.MetricsReader getCounterMetric
SEVERE: Failed to get metric result.bytes, from namespace SqlQuery7.Results
2023-10-19T08:02:35.944Z 0 samples not enough to calculate steady-state event rate
Oct 19, 2023 8:02:35 AM org.apache.beam.sdk.testutils.metrics.MetricsReader getCounterMetric
2023-10-19T08:02:35.998Z no activity
SEVERE: Failed to get metric fatal, from namespace SqlQuery7
2023-10-19T08:02:51.062Z RUNNING SqlQuery7
Oct 19, 2023 8:02:51 AM org.apache.beam.sdk.testutils.metrics.MetricsReader getCounterMetric
SEVERE: Failed to get metric event.elements, from namespace SqlQuery7.Events
Oct 19, 2023 8:02:51 AM org.apache.beam.sdk.testutils.metrics.MetricsReader getCounterMetric
SEVERE: Failed to get metric event.bytes, from namespace SqlQuery7.Events
Oct 19, 2023 8:02:51 AM org.apache.beam.sdk.testutils.metrics.MetricsReader getCounterMetric
SEVERE: Failed to get metric result.elements, from namespace SqlQuery7.Results
Oct 19, 2023 8:02:51 AM org.apache.beam.sdk.testutils.metrics.MetricsReader getCounterMetric
SEVERE: Failed to get metric result.bytes, from namespace SqlQuery7.Results
2023-10-19T08:02:51.686Z 0 samples not enough to calculate steady-state event rate
Oct 19, 2023 8:02:51 AM org.apache.beam.sdk.testutils.metrics.MetricsReader getCounterMetric
2023-10-19T08:02:51.726Z no activity
SEVERE: Failed to get metric fatal, from namespace SqlQuery7
2023-10-19T08:03:06.786Z RUNNING SqlQuery7
Oct 19, 2023 8:03:06 AM org.apache.beam.sdk.testutils.metrics.MetricsReader getCounterMetric
SEVERE: Failed to get metric event.elements, from namespace SqlQuery7.Events
Oct 19, 2023 8:03:06 AM org.apache.beam.sdk.testutils.metrics.MetricsReader getCounterMetric
SEVERE: Failed to get metric event.bytes, from namespace SqlQuery7.Events
Oct 19, 2023 8:03:07 AM org.apache.beam.sdk.testutils.metrics.MetricsReader getCounterMetric
SEVERE: Failed to get metric result.elements, from namespace SqlQuery7.Results
Oct 19, 2023 8:03:07 AM org.apache.beam.sdk.testutils.metrics.MetricsReader getCounterMetric
SEVERE: Failed to get metric result.bytes, from namespace SqlQuery7.Results
2023-10-19T08:03:07.345Z 0 samples not enough to calculate steady-state event rate
Oct 19, 2023 8:03:07 AM org.apache.beam.sdk.testutils.metrics.MetricsReader getCounterMetric
2023-10-19T08:03:07.434Z no activity
SEVERE: Failed to get metric fatal, from namespace SqlQuery7
2023-10-19T08:03:22.484Z RUNNING SqlQuery7
Oct 19, 2023 8:03:22 AM org.apache.beam.sdk.testutils.metrics.MetricsReader getCounterMetric
SEVERE: Failed to get metric event.elements, from namespace SqlQuery7.Events
Oct 19, 2023 8:03:22 AM org.apache.beam.sdk.testutils.metrics.MetricsReader getCounterMetric
SEVERE: Failed to get metric event.bytes, from namespace SqlQuery7.Events
Oct 19, 2023 8:03:22 AM org.apache.beam.sdk.testutils.metrics.MetricsReader getCounterMetric
SEVERE: Failed to get metric result.elements, from namespace SqlQuery7.Results
Oct 19, 2023 8:03:22 AM org.apache.beam.sdk.testutils.metrics.MetricsReader getCounterMetric
SEVERE: Failed to get metric result.bytes, from namespace SqlQuery7.Results
2023-10-19T08:03:23.126Z 0 samples not enough to calculate steady-state event rate
2023-10-19T08:03:23.196Z no activity
Oct 19, 2023 8:03:23 AM org.apache.beam.sdk.testutils.metrics.MetricsReader getCounterMetric
SEVERE: Failed to get metric fatal, from namespace SqlQuery7
2023-10-19T08:03:38.236Z RUNNING SqlQuery7
Oct 19, 2023 8:03:38 AM org.apache.beam.sdk.testutils.metrics.MetricsReader getCounterMetric
SEVERE: Failed to get metric event.elements, from namespace SqlQuery7.Events
Oct 19, 2023 8:03:38 AM org.apache.beam.sdk.testutils.metrics.MetricsReader getCounterMetric
SEVERE: Failed to get metric event.bytes, from namespace SqlQuery7.Events
Oct 19, 2023 8:03:38 AM org.apache.beam.sdk.testutils.metrics.MetricsReader getCounterMetric
SEVERE: Failed to get metric result.elements, from namespace SqlQuery7.Results
Oct 19, 2023 8:03:38 AM org.apache.beam.sdk.testutils.metrics.MetricsReader getCounterMetric
SEVERE: Failed to get metric result.bytes, from namespace SqlQuery7.Results
2023-10-19T08:03:39.005Z 0 samples not enough to calculate steady-state event rate
2023-10-19T08:03:39.074Z no activity
Oct 19, 2023 8:03:39 AM org.apache.beam.sdk.testutils.metrics.MetricsReader getCounterMetric
SEVERE: Failed to get metric fatal, from namespace SqlQuery7
2023-10-19T08:03:54.125Z RUNNING SqlQuery7
Oct 19, 2023 8:03:54 AM org.apache.beam.sdk.testutils.metrics.MetricsReader getCounterMetric
SEVERE: Failed to get metric event.elements, from namespace SqlQuery7.Events
Oct 19, 2023 8:03:54 AM org.apache.beam.sdk.testutils.metrics.MetricsReader getCounterMetric
SEVERE: Failed to get metric event.bytes, from namespace SqlQuery7.Events
Oct 19, 2023 8:03:54 AM org.apache.beam.sdk.testutils.metrics.MetricsReader getCounterMetric
SEVERE: Failed to get metric result.elements, from namespace SqlQuery7.Results
Oct 19, 2023 8:03:54 AM org.apache.beam.sdk.testutils.metrics.MetricsReader getCounterMetric
SEVERE: Failed to get metric result.bytes, from namespace SqlQuery7.Results
2023-10-19T08:03:54.744Z 0 samples not enough to calculate steady-state event rate
Oct 19, 2023 8:03:54 AM org.apache.beam.sdk.testutils.metrics.MetricsReader getCounterMetric
2023-10-19T08:03:54.795Z no activity
SEVERE: Failed to get metric fatal, from namespace SqlQuery7
2023-10-19T08:04:09.866Z FAILED SqlQuery7
Oct 19, 2023 8:04:09 AM org.apache.beam.sdk.testutils.metrics.MetricsReader getCounterMetric
SEVERE: Failed to get metric event.elements, from namespace SqlQuery7.Events
Oct 19, 2023 8:04:09 AM org.apache.beam.sdk.testutils.metrics.MetricsReader getCounterMetric
SEVERE: Failed to get metric event.bytes, from namespace SqlQuery7.Events
Oct 19, 2023 8:04:09 AM org.apache.beam.sdk.testutils.metrics.MetricsReader getCounterMetric
SEVERE: Failed to get metric result.elements, from namespace SqlQuery7.Results
Oct 19, 2023 8:04:09 AM org.apache.beam.sdk.testutils.metrics.MetricsReader getCounterMetric
SEVERE: Failed to get metric result.bytes, from namespace SqlQuery7.Results
2023-10-19T08:04:09.918Z 0 samples not enough to calculate steady-state event rate
Oct 19, 2023 8:04:09 AM org.apache.beam.sdk.testutils.metrics.MetricsReader getCounterMetric
SEVERE: Failed to get metric fatal, from namespace SqlQuery7
==========================================================================================
Run started 2023-10-19T07:54:07.751Z and ran for PT602.167S
Default configuration:
{"debug":true,"query":null,"sourceType":"DIRECT","generateEventFilePathPrefix":null,"sinkType":"DEVNULL","exportSummaryToBigQuery":false,"pubSubMode":"COMBINED","pubsubMessageSerializationMethod":"CODER","sideInputType":"DIRECT","sideInputRowCount":500,"sideInputNumShards":3,"sideInputUrl":null,"sessionGap":600000,"numEvents":100000,"numEventGenerators":100,"rateShape":"SINE","firstEventRate":10000,"nextEventRate":10000,"rateUnit":"PER_SECOND","ratePeriodSec":600,"preloadSeconds":0,"streamTimeout":240,"isRateLimited":false,"useWallclockEventTime":false,"avgPersonByteSize":200,"avgAuctionByteSize":500,"avgBidByteSize":100,"hotAuctionRatio":2,"hotSellersRatio":4,"hotBiddersRatio":4,"windowSizeSec":10,"windowPeriodSec":5,"watermarkHoldbackSec":0,"numInFlightAuctions":100,"numActivePeople":1000,"coderStrategy":"HAND","cpuDelayMs":0,"diskBusyBytes":0,"auctionSkip":123,"fanout":5,"maxAuctionsWaitingTime":600,"occasionalDelaySec":3,"probDelayedEvent":0.1,"maxLogEvents":100000,"usePubsubPublishTime":false,"outOfOrderGroupSize":1,"numKeyBuckets":20000,"pardoCPUFactor":1.0}
Configurations:
Conf Description
0000 query:PASSTHROUGH; exportSummaryToBigQuery:true; numEvents:10000000
0001 query:CURRENCY_CONVERSION; exportSummaryToBigQuery:true; numEvents:10000000
0002 query:SELECTION; exportSummaryToBigQuery:true; numEvents:10000000
0003 query:LOCAL_ITEM_SUGGESTION; exportSummaryToBigQuery:true; numEvents:10000000
0004 query:AVERAGE_PRICE_FOR_CATEGORY; exportSummaryToBigQuery:true; numEvents:1000000
0005 query:HOT_ITEMS; exportSummaryToBigQuery:true; numEvents:10000000
0006 query:AVERAGE_SELLING_PRICE_BY_SELLER; exportSummaryToBigQuery:true; numEvents:1000000
0007 query:HIGHEST_BID; exportSummaryToBigQuery:true; numEvents:10000000
0008 query:MONITOR_NEW_USERS; exportSummaryToBigQuery:true; numEvents:10000000
0009 query:WINNING_BIDS; exportSummaryToBigQuery:true; numEvents:1000000
0010 query:LOG_TO_SHARDED_FILES; exportSummaryToBigQuery:true; numEvents:10000000
0011 query:USER_SESSIONS; exportSummaryToBigQuery:true; numEvents:10000000
0012 query:PROCESSING_TIME_WINDOWS; exportSummaryToBigQuery:true; numEvents:10000000
0013 query:PORTABILITY_BATCH; exportSummaryToBigQuery:true; numEvents:10000000
0014 query:RESHUFFLE; exportSummaryToBigQuery:true; numEvents:10000000
0015 query:BOUNDED_SIDE_INPUT_JOIN; exportSummaryToBigQuery:true; numEvents:10000000
0016 query:SESSION_SIDE_INPUT_JOIN; exportSummaryToBigQuery:true; numEvents:10000000
Performance:
Conf Runtime(sec) (Baseline) Events(/sec) (Baseline) Results (Baseline)
0000 26.1 382643.3 9200000
0001 23.0 434707.0 9200000
0002 16.7 600132.0 83527
0003 28.7 347898.7 9054
0004 *** not run ***
0005 *** not run ***
0006 *** not run ***
0007 -1.0 -1.0 -1
*** Job was unexpectedly updated ***
0008 *** not run ***
0009 *** not run ***
0010 *** not run ***
0011 *** not run ***
0012 *** not run ***
0013 *** not run ***
0014 *** not run ***
0015 33.7 296463.2 9200000
0016 *** not run ***
==========================================================================================
==========================================================================================
Run started 2023-10-19T07:54:07.751Z and ran for PT602.702S
Default configuration:
{"debug":true,"query":null,"sourceType":"DIRECT","generateEventFilePathPrefix":null,"sinkType":"DEVNULL","exportSummaryToBigQuery":false,"pubSubMode":"COMBINED","pubsubMessageSerializationMethod":"CODER","sideInputType":"DIRECT","sideInputRowCount":500,"sideInputNumShards":3,"sideInputUrl":null,"sessionGap":600000,"numEvents":100000,"numEventGenerators":100,"rateShape":"SINE","firstEventRate":10000,"nextEventRate":10000,"rateUnit":"PER_SECOND","ratePeriodSec":600,"preloadSeconds":0,"streamTimeout":240,"isRateLimited":false,"useWallclockEventTime":false,"avgPersonByteSize":200,"avgAuctionByteSize":500,"avgBidByteSize":100,"hotAuctionRatio":2,"hotSellersRatio":4,"hotBiddersRatio":4,"windowSizeSec":10,"windowPeriodSec":5,"watermarkHoldbackSec":0,"numInFlightAuctions":100,"numActivePeople":1000,"coderStrategy":"HAND","cpuDelayMs":0,"diskBusyBytes":0,"auctionSkip":123,"fanout":5,"maxAuctionsWaitingTime":600,"occasionalDelaySec":3,"probDelayedEvent":0.1,"maxLogEvents":100000,"usePubsubPublishTime":false,"outOfOrderGroupSize":1,"numKeyBuckets":20000,"pardoCPUFactor":1.0}
Configurations:
Conf Description
0000 query:PASSTHROUGH; exportSummaryToBigQuery:true; numEvents:10000000
0001 query:CURRENCY_CONVERSION; exportSummaryToBigQuery:true; numEvents:10000000
0002 query:SELECTION; exportSummaryToBigQuery:true; numEvents:10000000
0003 query:LOCAL_ITEM_SUGGESTION; exportSummaryToBigQuery:true; numEvents:10000000
0004 query:AVERAGE_PRICE_FOR_CATEGORY; exportSummaryToBigQuery:true; numEvents:1000000
0005 query:HOT_ITEMS; exportSummaryToBigQuery:true; numEvents:10000000
0006 query:AVERAGE_SELLING_PRICE_BY_SELLER; exportSummaryToBigQuery:true; numEvents:1000000
0007 query:HIGHEST_BID; exportSummaryToBigQuery:true; numEvents:10000000
0008 query:MONITOR_NEW_USERS; exportSummaryToBigQuery:true; numEvents:10000000
0009 query:WINNING_BIDS; exportSummaryToBigQuery:true; numEvents:1000000
0010 query:LOG_TO_SHARDED_FILES; exportSummaryToBigQuery:true; numEvents:10000000
0011 query:USER_SESSIONS; exportSummaryToBigQuery:true; numEvents:10000000
0012 query:PROCESSING_TIME_WINDOWS; exportSummaryToBigQuery:true; numEvents:10000000
0013 query:PORTABILITY_BATCH; exportSummaryToBigQuery:true; numEvents:10000000
0014 query:RESHUFFLE; exportSummaryToBigQuery:true; numEvents:10000000
0015 query:BOUNDED_SIDE_INPUT_JOIN; exportSummaryToBigQuery:true; numEvents:10000000
0016 query:SESSION_SIDE_INPUT_JOIN; exportSummaryToBigQuery:true; numEvents:10000000
Performance:
Conf Runtime(sec) (Baseline) Events(/sec) (Baseline) Results (Baseline)
0000 26.1 382643.3 9200000
0001 23.0 434707.0 9200000
0002 16.7 600132.0 83527
0003 28.7 347898.7 9054
0004 *** not run ***
0005 *** not run ***
0006 *** not run ***
0007 -1.0 -1.0 -1
*** Job was unexpectedly updated ***
0008 *** not run ***
0009 *** not run ***
0010 *** not run ***
0011 *** not run ***
0012 *** not run ***
0013 *** not run ***
0014 *** not run ***
0015 33.7 296463.2 9200000
0016 *** not run ***
==========================================================================================
Exception in thread "main" java.lang.RuntimeException: Execution was not successful
at org.apache.beam.sdk.nexmark.Main.runAll(Main.java:169)
at org.apache.beam.sdk.nexmark.Main.main(Main.java:441)
> Task :sdks:java:testing:nexmark:run FAILED
FAILURE: Build failed with an exception.
* What went wrong:
Execution failed for task ':sdks:java:testing:nexmark:run'.
> Process 'command '/usr/lib/jvm/java-8-openjdk-amd64/bin/java'' finished with non-zero exit value 1
* Try:
> Run with --stacktrace option to get the stack trace.
> Run with --info or --debug option to get more log output.
> Get more help at https://help.gradle.org.
Deprecated Gradle features were used in this build, making it incompatible with Gradle 9.0.
You can use '--warning-mode all' to show the individual deprecation warnings and determine if they come from your own scripts or plugins.
For more on this, please refer to https://docs.gradle.org/8.3/userguide/command_line_interface.html#sec:command_line_warnings in the Gradle documentation.
BUILD FAILED in 10m 28s
130 actionable tasks: 2 executed, 128 up-to-date
Publishing build scan...
https://ge.apache.org/s/encm735wdegyk
Build step 'Invoke Gradle script' changed build result to FAILURE
Build step 'Invoke Gradle script' marked build as failure
---------------------------------------------------------------------
To unsubscribe, e-mail: builds-unsubscribe@beam.apache.org
For additional commands, e-mail: builds-help@beam.apache.org
Jenkins build is back to normal : beam_PostCommit_Java_Nexmark_Dataflow #10769
Posted by Apache Jenkins Server <je...@builds.apache.org>.
See <https://ci-beam.apache.org/job/beam_PostCommit_Java_Nexmark_Dataflow/10769/display/redirect>
---------------------------------------------------------------------
To unsubscribe, e-mail: builds-unsubscribe@beam.apache.org
For additional commands, e-mail: builds-help@beam.apache.org