You are viewing a plain text version of this content. The canonical link for it is here.
Posted to builds@solr.apache.org by Apache Jenkins Server <je...@builds.apache.org> on 2025/12/23 00:06:22 UTC

[JENKINS] Solr » Solr-Docker-Nightly-main - Build # 1450 - Still Failing!

Build: https://ci-builds.apache.org/job/Solr/job/Solr-Docker-Nightly-main/1450/

Log: 
Started by user Jan Høydahl
Running as SYSTEM
[EnvInject] - Loading node environment variables.
Building remotely on lucene-solr-4 (solr lucene) in workspace /home/jenkins/jenkins-agent/workspace/Solr/Solr-Docker-Nightly-main
[WS-CLEANUP] Deleting project workspace...
[WS-CLEANUP] Deferred wipeout is used...
[WS-CLEANUP] Done
The recommended git tool is: NONE
No credentials specified
Cloning the remote Git repository
Cloning repository https://gitbox.apache.org/repos/asf/solr.git
 > git init /home/jenkins/jenkins-agent/workspace/Solr/Solr-Docker-Nightly-main # timeout=10
Fetching upstream changes from https://gitbox.apache.org/repos/asf/solr.git
 > git --version # timeout=10
 > git --version # 'git version 2.43.0'
 > git fetch --tags --force --progress -- https://gitbox.apache.org/repos/asf/solr.git +refs/heads/*:refs/remotes/origin/* # timeout=10
 > git config remote.origin.url https://gitbox.apache.org/repos/asf/solr.git # timeout=10
 > git config --add remote.origin.fetch +refs/heads/*:refs/remotes/origin/* # timeout=10
Avoid second fetch
 > git rev-parse refs/remotes/origin/main^{commit} # timeout=10
Checking out Revision de9c90f97c9b6663914e53ac8881e0415844105f (refs/remotes/origin/main)
 > git config core.sparsecheckout # timeout=10
 > git checkout -f de9c90f97c9b6663914e53ac8881e0415844105f # timeout=10
 > git branch -a -v --no-abbrev # timeout=10
 > git checkout -b main de9c90f97c9b6663914e53ac8881e0415844105f # timeout=10
Commit message: "SOLR-18027 Increase socket timeout in addition to request timeout (#3975)"
 > git rev-list --no-walk 16511419ae246b4c69ba9960f2eecc329c95c839 # timeout=10
No emails were triggered.
provisioning config files...
copy managed file [gradle.properties] to file:/home/jenkins/jenkins-agent/workspace/Solr/Solr-Docker-Nightly-main/gradle.properties
[Solr-Docker-Nightly-main] $ /bin/sh -xe /tmp/jenkins7801152580085864826.sh
+ echo ****
+ docker login -u **** --password-stdin
Login Succeeded
[Gradle] - Launching build.
[Solr-Docker-Nightly-main] $ /home/jenkins/jenkins-agent/workspace/Solr/Solr-Docker-Nightly-main/gradlew -Psolr.docker.imageRepo=apache/solr-nightly -Psolr.docker.platform=linux/arm64,linux/amd64 -Psolr.docker.dist=full testDocker dockerPush
Downloading gradle-wrapper.jar from https://raw.githubusercontent.com/gradle/gradle/v8.10.2/gradle/wrapper/gradle-wrapper.jar
To honour the JVM settings for this build a single-use Daemon process will be forked. For more on this, please refer to https://docs.gradle.org/8.10/userguide/gradle_daemon.html#sec:disabling_the_daemon in the Gradle documentation.
Daemon will be stopped at the end of the build 

> Task :build-infra:compileJava
Note: /home/jenkins/jenkins-agent/workspace/Solr/Solr-Docker-Nightly-main/build-tools/build-infra/src/main/java/org/apache/lucene/gradle/Checksum.java uses or overrides a deprecated API.
Note: Recompile with -Xlint:deprecation for details.

> Task :build-infra:pluginDescriptors
> Task :build-infra:processResources
> Task :build-infra:classes
> Task :build-infra:jar
> Task :gitStatus
> Task :checkJdkInternalsExportedToGradle

> Task :solr:api:compileJava
Note: Some input files use or override a deprecated API.
Note: Recompile with -Xlint:deprecation for details.

> Task :solr:api:processResources NO-SOURCE
> Task :solr:api:classes

> Task :solr:api:resolve
SLF4J(W): No SLF4J providers were found.
SLF4J(W): Defaulting to no-operation (NOP) logger implementation
SLF4J(W): See https://www.slf4j.org/codes.html#noProviders for further details.

> Task :solr:solrj:openApiGenerate
Cleaned up output directory /home/jenkins/jenkins-agent/workspace/Solr/Solr-Docker-Nightly-main/solr/solrj/build/generated/ before code generation (cleanupOutput set to true).
No application/json content media type found in response. Response examples can currently only be generated for application/json media type.
############################################################################################
# Thanks for using OpenAPI Generator.                                                      #
# We appreciate your support! Please consider donation to help us maintain this project.   #
# https://opencollective.com/openapi_generator/donate                                      #
############################################################################################
Successfully generated code to /home/jenkins/jenkins-agent/workspace/Solr/Solr-Docker-Nightly-main/solr/solrj/build/generated/

> Task :spotlessInternalRegisterDependencies
> Task :solr:solrj:generatedSpotlessHelper
> Task :solr:solrj:generatedSpotless

> Task :solr:solrj:compileJava
Note: Some input files use or override a deprecated API.
Note: Recompile with -Xlint:deprecation for details.

> Task :solr:solrj-streaming:compileJava
Note: Some input files use or override a deprecated API.
Note: Recompile with -Xlint:deprecation for details.

> Task :solr:solrj-zookeeper:compileJava
Note: Some input files use or override a deprecated API.
Note: Recompile with -Xlint:deprecation for details.

> Task :solr:core:compileJava
Note: Some input files use or override a deprecated API.
Note: Recompile with -Xlint:deprecation for details.

> Task :solr:modules:cross-dc:compileJava
Note: Some input files use or override a deprecated API.
Note: Recompile with -Xlint:deprecation for details.

> Task :solr:cross-dc-manager:compileJava
Note: Some input files use or override a deprecated API.
Note: Recompile with -Xlint:deprecation for details.

> Task :solr:cross-dc-manager:processResources NO-SOURCE
> Task :solr:cross-dc-manager:classes
> Task :solr:cross-dc-manager:jar
> Task :solr:cross-dc-manager:assemblePackaging
> Task :solr:docker:createBodySnippetDockerfile
> Task :solr:docker:createDockerfileLocal
> Task :solr:docker:assemblePackaging
> Task :solr:documentation:changesToHtml
> Task :solr:documentation:copyDocumentationAssets
> Task :solr:documentation:markdownToHtml
> Task :solr:documentation:copyChangesToHtmlForMiniSite
> Task :solr:documentation:copyMiniDocumentationAssets
> Task :solr:documentation:createMiniDocumentationIndex
> Task :solr:documentation:documentationMinimal
> Task :solr:example:assemblePackaging
> Task :solr:api:jar
> Task :solr:core:processResources
> Task :solr:core:classes
> Task :solr:core:jar
> Task :solr:solrj:processResources
> Task :solr:solrj:classes
> Task :solr:solrj:jar
> Task :solr:solrj-streaming:processResources
> Task :solr:solrj-streaming:classes
> Task :solr:solrj-streaming:jar
> Task :solr:solrj-zookeeper:processResources NO-SOURCE
> Task :solr:solrj-zookeeper:classes
> Task :solr:solrj-zookeeper:jar
> Task :solr:webapp:compileJava NO-SOURCE
> Task :solr:webapp:processResources NO-SOURCE
> Task :solr:webapp:classes UP-TO-DATE

> Task :solr:api:buildJSClient
No application/json content media type found in response. Response examples can currently only be generated for application/json media type.
############################################################################################
# Thanks for using OpenAPI Generator.                                                      #
# We appreciate your support! Please consider donation to help us maintain this project.   #
# https://opencollective.com/openapi_generator/donate                                      #
############################################################################################
Successfully generated code to /home/jenkins/jenkins-agent/workspace/Solr/Solr-Docker-Nightly-main/solr/api/build/generated/js

> Task :solr:webapp:nodeSetup
> Task :solr:webapp:npmSetup SKIPPED

> Task :solr:webapp:downloadBrowserify
npm warn deprecated inflight@1.0.6: This module is not supported, and leaks memory. Do not use it. Check out lru-cache if you want a good and tested way to coalesce async requests by a key value, which is much more comprehensive and powerful.
npm warn deprecated glob@7.2.3: Glob versions prior to v9 are no longer supported

added 178 packages, and changed 1 package in 4s

39 packages are looking for funding
  run `npm fund` for details

> Task :solr:webapp:syncJSClientSourceCode

> Task :solr:webapp:jsClientDownloadDeps
npm warn deprecated inflight@1.0.6: This module is not supported, and leaks memory. Do not use it. Check out lru-cache if you want a good and tested way to coalesce async requests by a key value, which is much more comprehensive and powerful.
npm warn deprecated @babel/plugin-proposal-numeric-separator@7.18.6: This proposal has been merged to the ECMAScript standard and thus this plugin is no longer maintained. Please use @babel/plugin-transform-numeric-separator instead.
npm warn deprecated @babel/plugin-proposal-nullish-coalescing-operator@7.18.6: This proposal has been merged to the ECMAScript standard and thus this plugin is no longer maintained. Please use @babel/plugin-transform-nullish-coalescing-operator instead.
npm warn deprecated @babel/plugin-proposal-json-strings@7.18.6: This proposal has been merged to the ECMAScript standard and thus this plugin is no longer maintained. Please use @babel/plugin-transform-json-strings instead.
npm warn deprecated @babel/plugin-proposal-export-namespace-from@7.18.9: This proposal has been merged to the ECMAScript standard and thus this plugin is no longer maintained. Please use @babel/plugin-transform-export-namespace-from instead.
npm warn deprecated @babel/plugin-proposal-class-properties@7.18.6: This proposal has been merged to the ECMAScript standard and thus this plugin is no longer maintained. Please use @babel/plugin-transform-class-properties instead.
npm warn deprecated @babel/plugin-proposal-logical-assignment-operators@7.20.7: This proposal has been merged to the ECMAScript standard and thus this plugin is no longer maintained. Please use @babel/plugin-transform-logical-assignment-operators instead.
npm warn deprecated @babel/plugin-proposal-optional-chaining@7.21.0: This proposal has been merged to the ECMAScript standard and thus this plugin is no longer maintained. Please use @babel/plugin-transform-optional-chaining instead.
npm warn deprecated glob@7.2.3: Glob versions prior to v9 are no longer supported
npm warn deprecated glob@7.1.6: Glob versions prior to v9 are no longer supported
npm warn deprecated formidable@1.2.6: Please upgrade to latest, formidable@v2 or formidable@v3! Check these notes: https://bit.ly/2ZEqIau
npm warn deprecated superagent@5.3.1: Please upgrade to superagent v10.2.2+, see release notes at https://github.com/forwardemail/superagent/releases/tag/v10.2.2 - maintenance is supported by Forward Email @ https://forwardemail.net
npm warn deprecated sinon@7.5.0: 16.1.1

> v2_api@11.0.0 prepare
> npm run build


> v2_api@11.0.0 build
> babel src -d dist

Successfully compiled 153 files with Babel (2653ms).

added 331 packages, and audited 332 packages in 12s

43 packages are looking for funding
  run `npm fund` for details

4 vulnerabilities (2 moderate, 2 high)

To address all issues (including breaking changes), run:
  npm audit fix --force

Run `npm audit` for details.

> Task :solr:webapp:jsClientBuild

> v2_api@11.0.0 build
> babel src -d dist

Successfully compiled 153 files with Babel (2631ms).

> Task :solr:webapp:generateJsClientBundle
> Task :solr:webapp:finalizeJsBundleDir
> Task :kotlinWasmKotlinNpmCachesSetup
> Task :kotlinWasmNodeJsSetup
> Task :kotlinWasmRestoreYarnLock
> Task :kotlinWasmYarnSetup
> Task :solr:ui:wasmJsPackageJson
> Task :solr:ui:wasmJsTestPackageJson
> Task :solr:ui:wasmJsPublicPackageJson
> Task :solr:ui:wasmJsTestPublicPackageJson
> Task :kotlinWasmPackageJsonUmbrella
> Task :wasmRootPackageJson

> Task :kotlinWasmNpmInstall
warning Ignored scripts due to flag.

> Task :kotlinWasmStoreYarnLock
> Task :solr:ui:wasmJsResolveResourcesFromDependencies
> Task :solr:ui:convertXmlValueResourcesForCommonMain
> Task :solr:ui:copyNonXmlValueResourcesForCommonMain
> Task :solr:ui:prepareComposeResourcesTaskForCommonMain
> Task :solr:ui:convertXmlValueResourcesForWasmJsMain NO-SOURCE
> Task :solr:ui:copyNonXmlValueResourcesForWasmJsMain NO-SOURCE
> Task :solr:ui:prepareComposeResourcesTaskForWasmJsMain NO-SOURCE
> Task :solr:ui:assembleWasmJsMainResources
> Task :solr:ui:wasmJsResolveSelfResourcesCopyHierarchicalMultiplatformResources
> Task :solr:ui:wasmJsAggregateResources
> Task :solr:ui:wasmJsProcessResources
> Task :solr:ui:checkKotlinGradlePluginConfigurationErrors SKIPPED
> Task :solr:ui:generateResourceAccessorsForCommonMain
> Task :solr:ui:generateResourceAccessorsForWasmJsMain NO-SOURCE
> Task :solr:ui:generateActualResourceCollectorsForWasmJsMain
> Task :solr:ui:generateComposeResClass
> Task :solr:ui:generateExpectResourceCollectorsForCommonMain
> Task :solr:ui:kotlinWasmBinaryenSetup
> Task :solr:ui:unpackSkikoWasmRuntime
> Task :solr:ui:processSkikoRuntimeForKWasm

> Task :solr:modules:analysis-extras:compileJava
Note: /home/jenkins/jenkins-agent/workspace/Solr/Solr-Docker-Nightly-main/solr/modules/analysis-extras/src/java/org/apache/solr/schema/ICUCollationField.java uses or overrides a deprecated API.
Note: Recompile with -Xlint:deprecation for details.

> Task :solr:modules:analysis-extras:processResources NO-SOURCE
> Task :solr:modules:analysis-extras:classes
> Task :solr:modules:analysis-extras:jar
> Task :solr:modules:analysis-extras:assemblePackaging

> Task :solr:modules:clustering:compileJava
Note: /home/jenkins/jenkins-agent/workspace/Solr/Solr-Docker-Nightly-main/solr/modules/clustering/src/java/org/apache/solr/handler/clustering/ClusteringComponent.java uses or overrides a deprecated API.
Note: Recompile with -Xlint:deprecation for details.

> Task :solr:modules:clustering:processResources NO-SOURCE
> Task :solr:modules:clustering:classes
> Task :solr:modules:clustering:jar
> Task :solr:modules:clustering:assemblePackaging
> Task :solr:modules:cross-dc:processResources NO-SOURCE
> Task :solr:modules:cross-dc:classes
> Task :solr:modules:cross-dc:jar
> Task :solr:modules:cross-dc:assemblePackaging
> Task :solr:modules:cuvs:compileJava
> Task :solr:modules:cuvs:processResources NO-SOURCE
> Task :solr:modules:cuvs:classes
> Task :solr:modules:cuvs:jar
> Task :solr:modules:cuvs:assemblePackaging

> Task :solr:modules:extraction:compileJava
Note: /home/jenkins/jenkins-agent/workspace/Solr/Solr-Docker-Nightly-main/solr/modules/extraction/src/java/org/apache/solr/handler/extraction/ExtractingDocumentLoader.java uses or overrides a deprecated API.
Note: Recompile with -Xlint:deprecation for details.

> Task :solr:modules:extraction:processResources
> Task :solr:modules:extraction:classes
> Task :solr:modules:extraction:jar
> Task :solr:modules:extraction:assemblePackaging

> Task :solr:modules:gcs-repository:compileJava
Note: /home/jenkins/jenkins-agent/workspace/Solr/Solr-Docker-Nightly-main/solr/modules/gcs-repository/src/java/org/apache/solr/gcs/GCSConfigParser.java uses or overrides a deprecated API.
Note: Recompile with -Xlint:deprecation for details.

> Task :solr:modules:gcs-repository:processResources NO-SOURCE
> Task :solr:modules:gcs-repository:classes
> Task :solr:modules:gcs-repository:jar
> Task :solr:modules:gcs-repository:assemblePackaging
> Task :solr:modules:jwt-auth:compileJava
> Task :solr:modules:jwt-auth:processResources NO-SOURCE
> Task :solr:modules:jwt-auth:classes
> Task :solr:modules:jwt-auth:jar
> Task :solr:modules:jwt-auth:assemblePackaging
> Task :solr:ui:compileKotlinWasmJs
> Task :solr:modules:langid:compileJava
> Task :solr:ui:wasmJsMainClasses
> Task :solr:modules:langid:processResources
> Task :solr:modules:langid:classes
> Task :solr:modules:langid:jar
> Task :solr:modules:langid:assemblePackaging
> Task :solr:modules:language-models:compileJava
> Task :solr:modules:language-models:processResources NO-SOURCE
> Task :solr:modules:language-models:classes
> Task :solr:modules:language-models:jar
> Task :solr:modules:language-models:assemblePackaging

> Task :solr:modules:ltr:compileJava
Note: Some input files use or override a deprecated API.
Note: Recompile with -Xlint:deprecation for details.

> Task :solr:modules:ltr:processResources NO-SOURCE
> Task :solr:modules:ltr:classes
> Task :solr:modules:ltr:jar
> Task :solr:modules:ltr:assemblePackaging
> Task :solr:modules:opentelemetry:compileJava
> Task :solr:modules:opentelemetry:processResources NO-SOURCE
> Task :solr:modules:opentelemetry:classes
> Task :solr:modules:opentelemetry:jar
> Task :solr:modules:opentelemetry:assemblePackaging
> Task :solr:modules:s3-repository:compileJava
> Task :solr:modules:s3-repository:processResources NO-SOURCE
> Task :solr:modules:s3-repository:classes
> Task :solr:modules:s3-repository:jar
> Task :solr:modules:s3-repository:assemblePackaging

> Task :solr:modules:scripting:compileJava
Note: Some input files use or override a deprecated API.
Note: Recompile with -Xlint:deprecation for details.

> Task :solr:modules:scripting:processResources NO-SOURCE
> Task :solr:modules:scripting:classes
> Task :solr:modules:scripting:jar
> Task :solr:modules:scripting:assemblePackaging

> Task :solr:modules:sql:compileJava
Note: Some input files use or override a deprecated API.
Note: Recompile with -Xlint:deprecation for details.

> Task :solr:modules:sql:processResources
> Task :solr:modules:sql:classes
> Task :solr:modules:sql:jar
> Task :solr:modules:sql:assemblePackaging
> Task :solr:ui:compileProductionExecutableKotlinWasmJs
> Task :solr:ui:compileProductionExecutableKotlinWasmJsOptimize
> Task :solr:ui:wasmJsProductionExecutableCompileSync

> Task :solr:ui:wasmJsBrowserProductionWebpack
Critical dependency: the request of a dependency is an expression
asset 8bc1b48ee28fd6b51bb9.wasm 8.01 MiB [emitted] [immutable] [from: kotlin/skiko.wasm] [big] (auxiliary name: main)
asset 58b32cfed875a4b49431.wasm 3.74 MiB [emitted] [immutable] [from: kotlin/composeApp.wasm] [big] (auxiliary name: main)
asset composeApp.js 556 KiB [emitted] [minimized] [big] (name: main) 2 related assets
runtime modules 4.33 KiB 7 modules
built modules 909 KiB (javascript) 11.8 MiB (asset) [built]
  javascript modules 908 KiB
    modules by path ./kotlin/*.mjs 516 KiB
      ./kotlin/composeApp.mjs 355 bytes [built] [code generated]
      ./kotlin/skiko.mjs 478 KiB [built] [code generated]
      ./kotlin/composeApp.uninstantiated.mjs 38.3 KiB [built] [code generated] [3 warnings]
    ../../node_modules/@js-joda/core/dist/js-joda.esm.js 392 KiB [built] [code generated]
    ./kotlin/ lazy strict namespace object 160 bytes [built] [code generated]
  asset modules 84 bytes (javascript) 11.8 MiB (asset)
    ./kotlin/skiko.wasm 42 bytes (javascript) 8.01 MiB (asset) [built] [code generated]
    ./kotlin/composeApp.wasm 42 bytes (javascript) 3.74 MiB (asset) [built] [code generated]
webpack 5.94.0 compiled with 1 warning in 4129 ms

> Task :solr:ui:wasmJsBrowserDistribution
> Task :solr:webapp:generateUiProdFiles
> Task :solr:webapp:war
> Task :solr:server:assemblePackaging
> Task :solr:packaging:fullDistTar

> Task :solr:docker:dockerBuild
#0 building with "default" instance using docker driver

#1 [internal] load remote build context
#1 DONE 9.8s

#1 [internal] load remote build context
#1 DONE 9.8s

#2 copy /context /
#2 DONE 1.5s

#3 [internal] load metadata for docker.io/library/eclipse-temurin:25-jre-noble
#3 ...

#4 [auth] library/eclipse-temurin:pull token for registry-1.docker.io
#4 DONE 0.0s

#3 [internal] load metadata for docker.io/library/eclipse-temurin:25-jre-noble
#3 DONE 0.6s

#5 [1/7] FROM docker.io/library/eclipse-temurin:25-jre-noble@sha256:d8dd4342b7dbb5a9c06d0499eecca86315346acc6a20026080642610344ceb2c
#5 resolve docker.io/library/eclipse-temurin:25-jre-noble@sha256:d8dd4342b7dbb5a9c06d0499eecca86315346acc6a20026080642610344ceb2c 0.0s done
#5 DONE 0.0s

#5 [1/7] FROM docker.io/library/eclipse-temurin:25-jre-noble@sha256:d8dd4342b7dbb5a9c06d0499eecca86315346acc6a20026080642610344ceb2c
#5 CACHED

#6 [2/7] COPY / /opt/
#6 DONE 1.7s

#7 [3/7] RUN set -ex;   groupadd -r --gid "8983" "solr";   useradd -r --uid "8983" --gid "8983" "solr"
#7 0.486 + groupadd -r --gid 8983 solr
#7 0.790 + useradd -r --uid 8983 --gid 8983 solr
#7 0.852 useradd warning: solr's uid 8983 is greater than SYS_UID_MAX 999
#7 DONE 0.9s

#8 [4/7] RUN set -ex;   (cd /opt; ln -s solr-*/ solr);   rm -Rf /opt/solr/docs /opt/solr/docker/Dockerfile;
#8 0.225 + cd /opt
#8 0.225 + ln -s solr-11.0.0-SNAPSHOT/ solr
#8 0.233 + rm -Rf /opt/solr/docs /opt/solr/docker/Dockerfile
#8 DONE 0.3s

#9 [5/7] RUN set -ex;   mkdir -p /opt/solr/server/solr/lib /docker-entrypoint-initdb.d;   cp /opt/solr/bin/solr.in.sh /etc/default/solr.in.sh;   mv /opt/solr/bin/solr.in.sh /opt/solr/bin/solr.in.sh.orig;   mv /opt/solr/bin/solr.in.cmd /opt/solr/bin/solr.in.cmd.orig;   chmod 0664 /etc/default/solr.in.sh;   mkdir -p -m0770 /var/solr;   chown -R "solr:0" /var/solr;
#9 0.200 + mkdir -p /opt/solr/server/solr/lib /docker-entrypoint-initdb.d
#9 0.220 + cp /opt/solr/bin/solr.in.sh /etc/default/solr.in.sh
#9 0.234 + mv /opt/solr/bin/solr.in.sh /opt/solr/bin/solr.in.sh.orig
#9 0.245 + mv /opt/solr/bin/solr.in.cmd /opt/solr/bin/solr.in.cmd.orig
#9 0.249 + chmod 0664 /etc/default/solr.in.sh
#9 0.260 + mkdir -p -m0770 /var/solr
#9 0.262 + chown -R solr:0 /var/solr
#9 DONE 0.3s

#10 [6/7] RUN set -ex;     apt-get update;     apt-get -y --no-install-recommends install curl acl lsof procps wget netcat-openbsd gosu tini jattach;     rm -rf /var/lib/apt/lists/*;
#10 0.215 + apt-get update
#10 0.932 Get:1 http://security.ubuntu.com/ubuntu noble-security InRelease [126 kB]
#10 0.995 Get:2 http://archive.ubuntu.com/ubuntu noble InRelease [256 kB]
#10 1.578 Get:3 http://security.ubuntu.com/ubuntu noble-security/universe amd64 Packages [1,183 kB]
#10 1.938 Get:4 http://archive.ubuntu.com/ubuntu noble-updates InRelease [126 kB]
#10 2.157 Get:5 http://security.ubuntu.com/ubuntu noble-security/main amd64 Packages [1,752 kB]
#10 2.172 Get:6 http://archive.ubuntu.com/ubuntu noble-backports InRelease [126 kB]
#10 2.313 Get:7 http://security.ubuntu.com/ubuntu noble-security/restricted amd64 Packages [2,898 kB]
#10 2.407 Get:8 http://archive.ubuntu.com/ubuntu noble/universe amd64 Packages [19.3 MB]
#10 2.454 Get:9 http://security.ubuntu.com/ubuntu noble-security/multiverse amd64 Packages [33.1 kB]
#10 3.787 Get:10 http://archive.ubuntu.com/ubuntu noble/main amd64 Packages [1,808 kB]
#10 3.848 Get:11 http://archive.ubuntu.com/ubuntu noble/multiverse amd64 Packages [331 kB]
#10 3.867 Get:12 http://archive.ubuntu.com/ubuntu noble/restricted amd64 Packages [117 kB]
#10 3.872 Get:13 http://archive.ubuntu.com/ubuntu noble-updates/universe amd64 Packages [1,950 kB]
#10 3.958 Get:14 http://archive.ubuntu.com/ubuntu noble-updates/main amd64 Packages [2,130 kB]
#10 4.039 Get:15 http://archive.ubuntu.com/ubuntu noble-updates/restricted amd64 Packages [3,059 kB]
#10 4.156 Get:16 http://archive.ubuntu.com/ubuntu noble-updates/multiverse amd64 Packages [35.9 kB]
#10 4.156 Get:17 http://archive.ubuntu.com/ubuntu noble-backports/universe amd64 Packages [34.6 kB]
#10 4.159 Get:18 http://archive.ubuntu.com/ubuntu noble-backports/main amd64 Packages [49.5 kB]
#10 5.045 Fetched 35.3 MB in 4s (8,032 kB/s)
#10 5.045 Reading package lists...
#10 6.263 + apt-get -y --no-install-recommends install curl acl lsof procps wget netcat-openbsd gosu tini jattach
#10 6.278 Reading package lists...
#10 7.423 Building dependency tree...
#10 7.765 Reading state information...
#10 8.050 procps is already the newest version (2:4.0.4-4ubuntu3.2).
#10 8.050 The following additional packages will be installed:
#10 8.050   libbsd0 libcurl4t64 libgssapi-krb5-2 libk5crypto3 libkeyutils1 libkrb5-3
#10 8.051   libkrb5support0 libldap2 libnghttp2-14 libpsl5t64 librtmp1 libsasl2-2
#10 8.052   libsasl2-modules-db libssh-4 libtirpc-common libtirpc3t64
#10 8.054 Suggested packages:
#10 8.054   krb5-doc krb5-user
#10 8.054 Recommended packages:
#10 8.054   krb5-locales libldap-common publicsuffix libsasl2-modules
#10 8.161 The following NEW packages will be installed:
#10 8.162   acl curl gosu jattach libbsd0 libcurl4t64 libgssapi-krb5-2 libk5crypto3
#10 8.163   libkeyutils1 libkrb5-3 libkrb5support0 libldap2 libnghttp2-14 libpsl5t64
#10 8.164   librtmp1 libsasl2-2 libsasl2-modules-db libssh-4 libtirpc-common
#10 8.165   libtirpc3t64 lsof netcat-openbsd tini wget
#10 8.456 0 upgraded, 24 newly installed, 0 to remove and 10 not upgraded.
#10 8.456 Need to get 3,835 kB of archives.
#10 8.456 After this operation, 10.6 MB of additional disk space will be used.
#10 8.456 Get:1 http://archive.ubuntu.com/ubuntu noble-updates/main amd64 libbsd0 amd64 0.12.1-1build1.1 [41.2 kB]
#10 8.777 Get:2 http://archive.ubuntu.com/ubuntu noble-updates/main amd64 libkrb5support0 amd64 1.20.1-6ubuntu2.6 [34.4 kB]
#10 8.859 Get:3 http://archive.ubuntu.com/ubuntu noble-updates/main amd64 libk5crypto3 amd64 1.20.1-6ubuntu2.6 [82.0 kB]
#10 9.146 Get:4 http://archive.ubuntu.com/ubuntu noble/main amd64 libkeyutils1 amd64 1.6.3-3build1 [9,490 B]
#10 9.146 Get:5 http://archive.ubuntu.com/ubuntu noble-updates/main amd64 libkrb5-3 amd64 1.20.1-6ubuntu2.6 [348 kB]
#10 9.339 Get:6 http://archive.ubuntu.com/ubuntu noble-updates/main amd64 libgssapi-krb5-2 amd64 1.20.1-6ubuntu2.6 [143 kB]
#10 9.394 Get:7 http://archive.ubuntu.com/ubuntu noble/main amd64 libtirpc-common all 1.3.4+ds-1.1build1 [8,094 B]
#10 9.397 Get:8 http://archive.ubuntu.com/ubuntu noble/main amd64 libtirpc3t64 amd64 1.3.4+ds-1.1build1 [82.6 kB]
#10 9.429 Get:9 http://archive.ubuntu.com/ubuntu noble/main amd64 netcat-openbsd amd64 1.226-1ubuntu2 [44.3 kB]
#10 9.450 Get:10 http://archive.ubuntu.com/ubuntu noble-updates/main amd64 libnghttp2-14 amd64 1.59.0-1ubuntu0.2 [74.3 kB]
#10 9.468 Get:11 http://archive.ubuntu.com/ubuntu noble/main amd64 libpsl5t64 amd64 0.21.2-1.1build1 [57.1 kB]
#10 9.481 Get:12 http://archive.ubuntu.com/ubuntu noble/main amd64 lsof amd64 4.95.0-1build3 [247 kB]
#10 9.526 Get:13 http://archive.ubuntu.com/ubuntu noble-updates/main amd64 wget amd64 1.21.4-1ubuntu4.1 [334 kB]
#10 9.581 Get:14 http://archive.ubuntu.com/ubuntu noble-updates/main amd64 acl amd64 2.3.2-1build1.1 [39.4 kB]
#10 9.586 Get:15 http://archive.ubuntu.com/ubuntu noble-updates/main amd64 libsasl2-modules-db amd64 2.1.28+dfsg1-5ubuntu3.1 [20.4 kB]
#10 9.590 Get:16 http://archive.ubuntu.com/ubuntu noble-updates/main amd64 libsasl2-2 amd64 2.1.28+dfsg1-5ubuntu3.1 [53.2 kB]
#10 9.644 Get:17 http://archive.ubuntu.com/ubuntu noble-updates/main amd64 libldap2 amd64 2.6.7+dfsg-1~exp1ubuntu8.2 [196 kB]
#10 9.660 Get:18 http://archive.ubuntu.com/ubuntu noble/main amd64 librtmp1 amd64 2.4+20151223.gitfa8646d.1-2build7 [56.3 kB]
#10 9.664 Get:19 http://archive.ubuntu.com/ubuntu noble-updates/main amd64 libssh-4 amd64 0.10.6-2ubuntu0.2 [188 kB]
#10 9.679 Get:20 http://archive.ubuntu.com/ubuntu noble-updates/main amd64 libcurl4t64 amd64 8.5.0-2ubuntu10.6 [341 kB]
#10 9.702 Get:21 http://archive.ubuntu.com/ubuntu noble-updates/main amd64 curl amd64 8.5.0-2ubuntu10.6 [226 kB]
#10 9.767 Get:22 http://archive.ubuntu.com/ubuntu noble/universe amd64 jattach amd64 2.2-1 [13.0 kB]
#10 9.767 Get:23 http://archive.ubuntu.com/ubuntu noble/universe amd64 tini amd64 0.19.0-1 [276 kB]
#10 9.784 Get:24 http://archive.ubuntu.com/ubuntu noble-updates/universe amd64 gosu amd64 1.17-1ubuntu0.24.04.3 [921 kB]
#10 10.30 debconf: delaying package configuration, since apt-utils is not installed
#10 10.36 Fetched 3,835 kB in 2s (2,328 kB/s)
#10 10.41 Selecting previously unselected package libbsd0:amd64.
#10 10.41 (Reading database ... (Reading database ... 5%(Reading database ... 10%(Reading database ... 15%(Reading database ... 20%(Reading database ... 25%(Reading database ... 30%(Reading database ... 35%(Reading database ... 40%(Reading database ... 45%(Reading database ... 50%(Reading database ... 55%(Reading database ... 60%(Reading database ... 65%(Reading database ... 70%(Reading database ... 75%(Reading database ... 80%(Reading database ... 85%(Reading database ... 90%(Reading database ... 95%(Reading database ... 100%(Reading database ... 6292 files and directories currently installed.)
#10 10.51 Preparing to unpack .../00-libbsd0_0.12.1-1build1.1_amd64.deb ...
#10 10.52 Unpacking libbsd0:amd64 (0.12.1-1build1.1) ...
#10 10.57 Selecting previously unselected package libkrb5support0:amd64.
#10 10.57 Preparing to unpack .../01-libkrb5support0_1.20.1-6ubuntu2.6_amd64.deb ...
#10 10.58 Unpacking libkrb5support0:amd64 (1.20.1-6ubuntu2.6) ...
#10 10.61 Selecting previously unselected package libk5crypto3:amd64.
#10 10.62 Preparing to unpack .../02-libk5crypto3_1.20.1-6ubuntu2.6_amd64.deb ...
#10 10.62 Unpacking libk5crypto3:amd64 (1.20.1-6ubuntu2.6) ...
#10 10.66 Selecting previously unselected package libkeyutils1:amd64.
#10 10.66 Preparing to unpack .../03-libkeyutils1_1.6.3-3build1_amd64.deb ...
#10 10.66 Unpacking libkeyutils1:amd64 (1.6.3-3build1) ...
#10 10.70 Selecting previously unselected package libkrb5-3:amd64.
#10 10.70 Preparing to unpack .../04-libkrb5-3_1.20.1-6ubuntu2.6_amd64.deb ...
#10 10.70 Unpacking libkrb5-3:amd64 (1.20.1-6ubuntu2.6) ...
#10 10.76 Selecting previously unselected package libgssapi-krb5-2:amd64.
#10 10.76 Preparing to unpack .../05-libgssapi-krb5-2_1.20.1-6ubuntu2.6_amd64.deb ...
#10 10.76 Unpacking libgssapi-krb5-2:amd64 (1.20.1-6ubuntu2.6) ...
#10 10.80 Selecting previously unselected package libtirpc-common.
#10 10.80 Preparing to unpack .../06-libtirpc-common_1.3.4+ds-1.1build1_all.deb ...
#10 10.81 Unpacking libtirpc-common (1.3.4+ds-1.1build1) ...
#10 10.85 Selecting previously unselected package libtirpc3t64:amd64.
#10 10.85 Preparing to unpack .../07-libtirpc3t64_1.3.4+ds-1.1build1_amd64.deb ...
#10 10.86 Adding 'diversion of /lib/x86_64-linux-gnu/libtirpc.so.3 to /lib/x86_64-linux-gnu/libtirpc.so.3.usr-is-merged by libtirpc3t64'
#10 10.87 Adding 'diversion of /lib/x86_64-linux-gnu/libtirpc.so.3.0.0 to /lib/x86_64-linux-gnu/libtirpc.so.3.0.0.usr-is-merged by libtirpc3t64'
#10 10.88 Unpacking libtirpc3t64:amd64 (1.3.4+ds-1.1build1) ...
#10 10.92 Selecting previously unselected package netcat-openbsd.
#10 10.92 Preparing to unpack .../08-netcat-openbsd_1.226-1ubuntu2_amd64.deb ...
#10 10.92 Unpacking netcat-openbsd (1.226-1ubuntu2) ...
#10 10.96 Selecting previously unselected package libnghttp2-14:amd64.
#10 10.96 Preparing to unpack .../09-libnghttp2-14_1.59.0-1ubuntu0.2_amd64.deb ...
#10 10.96 Unpacking libnghttp2-14:amd64 (1.59.0-1ubuntu0.2) ...
#10 11.00 Selecting previously unselected package libpsl5t64:amd64.
#10 11.00 Preparing to unpack .../10-libpsl5t64_0.21.2-1.1build1_amd64.deb ...
#10 11.00 Unpacking libpsl5t64:amd64 (0.21.2-1.1build1) ...
#10 11.03 Selecting previously unselected package lsof.
#10 11.03 Preparing to unpack .../11-lsof_4.95.0-1build3_amd64.deb ...
#10 11.03 Unpacking lsof (4.95.0-1build3) ...
#10 11.06 Selecting previously unselected package wget.
#10 11.07 Preparing to unpack .../12-wget_1.21.4-1ubuntu4.1_amd64.deb ...
#10 11.07 Unpacking wget (1.21.4-1ubuntu4.1) ...
#10 11.10 Selecting previously unselected package acl.
#10 11.10 Preparing to unpack .../13-acl_2.3.2-1build1.1_amd64.deb ...
#10 11.11 Unpacking acl (2.3.2-1build1.1) ...
#10 11.13 Selecting previously unselected package libsasl2-modules-db:amd64.
#10 11.14 Preparing to unpack .../14-libsasl2-modules-db_2.1.28+dfsg1-5ubuntu3.1_amd64.deb ...
#10 11.14 Unpacking libsasl2-modules-db:amd64 (2.1.28+dfsg1-5ubuntu3.1) ...
#10 11.17 Selecting previously unselected package libsasl2-2:amd64.
#10 11.17 Preparing to unpack .../15-libsasl2-2_2.1.28+dfsg1-5ubuntu3.1_amd64.deb ...
#10 11.18 Unpacking libsasl2-2:amd64 (2.1.28+dfsg1-5ubuntu3.1) ...
#10 11.22 Selecting previously unselected package libldap2:amd64.
#10 11.22 Preparing to unpack .../16-libldap2_2.6.7+dfsg-1~exp1ubuntu8.2_amd64.deb ...
#10 11.22 Unpacking libldap2:amd64 (2.6.7+dfsg-1~exp1ubuntu8.2) ...
#10 11.26 Selecting previously unselected package librtmp1:amd64.
#10 11.26 Preparing to unpack .../17-librtmp1_2.4+20151223.gitfa8646d.1-2build7_amd64.deb ...
#10 11.27 Unpacking librtmp1:amd64 (2.4+20151223.gitfa8646d.1-2build7) ...
#10 11.30 Selecting previously unselected package libssh-4:amd64.
#10 11.31 Preparing to unpack .../18-libssh-4_0.10.6-2ubuntu0.2_amd64.deb ...
#10 11.31 Unpacking libssh-4:amd64 (0.10.6-2ubuntu0.2) ...
#10 11.35 Selecting previously unselected package libcurl4t64:amd64.
#10 11.35 Preparing to unpack .../19-libcurl4t64_8.5.0-2ubuntu10.6_amd64.deb ...
#10 11.35 Unpacking libcurl4t64:amd64 (8.5.0-2ubuntu10.6) ...
#10 11.38 Selecting previously unselected package curl.
#10 11.39 Preparing to unpack .../20-curl_8.5.0-2ubuntu10.6_amd64.deb ...
#10 11.39 Unpacking curl (8.5.0-2ubuntu10.6) ...
#10 11.42 Selecting previously unselected package jattach.
#10 11.42 Preparing to unpack .../21-jattach_2.2-1_amd64.deb ...
#10 11.42 Unpacking jattach (2.2-1) ...
#10 11.45 Selecting previously unselected package tini.
#10 11.45 Preparing to unpack .../22-tini_0.19.0-1_amd64.deb ...
#10 11.45 Unpacking tini (0.19.0-1) ...
#10 11.50 Selecting previously unselected package gosu.
#10 11.50 Preparing to unpack .../23-gosu_1.17-1ubuntu0.24.04.3_amd64.deb ...
#10 11.50 Unpacking gosu (1.17-1ubuntu0.24.04.3) ...
#10 11.56 Setting up libkeyutils1:amd64 (1.6.3-3build1) ...
#10 11.57 Setting up libtirpc-common (1.3.4+ds-1.1build1) ...
#10 11.59 Setting up libpsl5t64:amd64 (0.21.2-1.1build1) ...
#10 11.60 Setting up libnghttp2-14:amd64 (1.59.0-1ubuntu0.2) ...
#10 11.60 Setting up jattach (2.2-1) ...
#10 11.61 Setting up acl (2.3.2-1build1.1) ...
#10 11.62 Setting up libkrb5support0:amd64 (1.20.1-6ubuntu2.6) ...
#10 11.63 Setting up libsasl2-modules-db:amd64 (2.1.28+dfsg1-5ubuntu3.1) ...
#10 11.64 Setting up librtmp1:amd64 (2.4+20151223.gitfa8646d.1-2build7) ...
#10 11.65 Setting up gosu (1.17-1ubuntu0.24.04.3) ...
#10 11.65 Setting up tini (0.19.0-1) ...
#10 11.66 Setting up libk5crypto3:amd64 (1.20.1-6ubuntu2.6) ...
#10 11.68 Setting up libsasl2-2:amd64 (2.1.28+dfsg1-5ubuntu3.1) ...
#10 11.69 Setting up libkrb5-3:amd64 (1.20.1-6ubuntu2.6) ...
#10 11.70 Setting up libbsd0:amd64 (0.12.1-1build1.1) ...
#10 11.71 Setting up libldap2:amd64 (2.6.7+dfsg-1~exp1ubuntu8.2) ...
#10 11.71 Setting up wget (1.21.4-1ubuntu4.1) ...
#10 11.72 Setting up netcat-openbsd (1.226-1ubuntu2) ...
#10 11.74 update-alternatives: using /bin/nc.openbsd to provide /bin/nc (nc) in auto mode
#10 11.74 update-alternatives: warning: skip creation of /usr/share/man/man1/nc.1.gz because associated file /usr/share/man/man1/nc_openbsd.1.gz (of link group nc) doesn't exist
#10 11.74 update-alternatives: warning: skip creation of /usr/share/man/man1/netcat.1.gz because associated file /usr/share/man/man1/nc_openbsd.1.gz (of link group nc) doesn't exist
#10 11.75 Setting up libgssapi-krb5-2:amd64 (1.20.1-6ubuntu2.6) ...
#10 11.76 Setting up libssh-4:amd64 (0.10.6-2ubuntu0.2) ...
#10 11.77 Setting up libcurl4t64:amd64 (8.5.0-2ubuntu10.6) ...
#10 11.77 Setting up libtirpc3t64:amd64 (1.3.4+ds-1.1build1) ...
#10 11.78 Setting up lsof (4.95.0-1build3) ...
#10 11.79 Setting up curl (8.5.0-2ubuntu10.6) ...
#10 11.80 Processing triggers for libc-bin (2.39-0ubuntu8.6) ...
#10 12.11 + rm -rf /var/lib/apt/lists/archive.ubuntu.com_ubuntu_dists_noble-backports_InRelease /var/lib/apt/lists/archive.ubuntu.com_ubuntu_dists_noble-backports_main_binary-amd64_Packages.lz4 /var/lib/apt/lists/archive.ubuntu.com_ubuntu_dists_noble-backports_universe_binary-amd64_Packages.lz4 /var/lib/apt/lists/archive.ubuntu.com_ubuntu_dists_noble-updates_InRelease /var/lib/apt/lists/archive.ubuntu.com_ubuntu_dists_noble-updates_main_binary-amd64_Packages.lz4 /var/lib/apt/lists/archive.ubuntu.com_ubuntu_dists_noble-updates_multiverse_binary-amd64_Packages.lz4 /var/lib/apt/lists/archive.ubuntu.com_ubuntu_dists_noble-updates_restricted_binary-amd64_Packages.lz4 /var/lib/apt/lists/archive.ubuntu.com_ubuntu_dists_noble-updates_universe_binary-amd64_Packages.lz4 /var/lib/apt/lists/archive.ubuntu.com_ubuntu_dists_noble_InRelease /var/lib/apt/lists/archive.ubuntu.com_ubuntu_dists_noble_main_binary-amd64_Packages.lz4 /var/lib/apt/lists/archive.ubuntu.com_ubuntu_dists_noble_multiverse_binary-amd64_Packages.lz4 /var/lib/apt/lists/archive.ubuntu.com_ubuntu_dists_noble_restricted_binary-amd64_Packages.lz4 /var/lib/apt/lists/archive.ubuntu.com_ubuntu_dists_noble_universe_binary-amd64_Packages.lz4 /var/lib/apt/lists/auxfiles /var/lib/apt/lists/lock /var/lib/apt/lists/partial /var/lib/apt/lists/security.ubuntu.com_ubuntu_dists_noble-security_InRelease /var/lib/apt/lists/security.ubuntu.com_ubuntu_dists_noble-security_main_binary-amd64_Packages.lz4 /var/lib/apt/lists/security.ubuntu.com_ubuntu_dists_noble-security_multiverse_binary-amd64_Packages.lz4 /var/lib/apt/lists/security.ubuntu.com_ubuntu_dists_noble-security_restricted_binary-amd64_Packages.lz4 /var/lib/apt/lists/security.ubuntu.com_ubuntu_dists_noble-security_universe_binary-amd64_Packages.lz4
#10 DONE 12.1s

#11 [7/7] WORKDIR /opt/solr
#11 DONE 0.0s

#12 exporting to image
#12 exporting layers
#12 exporting layers 1.8s done
#12 writing image sha256:32bd3162fb59cff47b07ba6615599a2c66b5b13f8aac4fba251a8ae894e5b257 done
#12 DONE 1.8s
Solr Docker Image Created
	ID: 	sha256:32bd3162fb59cff47b07ba6615599a2c66b5b13f8aac4fba251a8ae894e5b257
	Base Image: 	eclipse-temurin:25-jre-noble
	Solr Version: 	11.0.0-SNAPSHOT
	Solr Distribution: 	Full

> Task :solr:docker:testDocker
Testing Solr Image ID: sha256:32bd3162fb59cff47b07ba6615599a2c66b5b13f8aac4fba251a8ae894e5b257 (sequentially)
Starting Solr Docker test: create_core_randomuser_rootgroup
Completed Solr Docker test: create_core_randomuser_rootgroup
Starting Solr Docker test: empty-varsolr-vol-solr-nocopy
Completed Solr Docker test: empty-varsolr-vol-solr-nocopy
Starting Solr Docker test: precreate_core_randomuser_rootgroup
Completed Solr Docker test: precreate_core_randomuser_rootgroup
Starting Solr Docker test: create_core
Completed Solr Docker test: create_core
Starting Solr Docker test: demo
Completed Solr Docker test: demo
Starting Solr Docker test: cloud_multi_node_embedded_zk
Completed Solr Docker test: cloud_multi_node_embedded_zk
Starting Solr Docker test: demo-tini
Completed Solr Docker test: demo-tini
Starting Solr Docker test: initdb
Completed Solr Docker test: initdb
Starting Solr Docker test: precreate_core
Completed Solr Docker test: precreate_core
Starting Solr Docker test: empty-varsolr-dir-user
Completed Solr Docker test: empty-varsolr-dir-user
Starting Solr Docker test: gosu
Completed Solr Docker test: gosu
Starting Solr Docker test: empty-varsolr-vol-user
Completed Solr Docker test: empty-varsolr-vol-user
Starting Solr Docker test: empty-varsolr-dir-ramdomuser-rootgroup
Completed Solr Docker test: empty-varsolr-dir-ramdomuser-rootgroup
Starting Solr Docker test: empty-varsolr-dir-solr
Completed Solr Docker test: empty-varsolr-dir-solr
Starting Solr Docker test: create_bad_core
Completed Solr Docker test: create_bad_core
Starting Solr Docker test: user_volume
Completed Solr Docker test: user_volume
Starting Solr Docker test: log4j2_migration
Completed Solr Docker test: log4j2_migration
Starting Solr Docker test: empty-varsolr-vol-ramdomuser-rootgroup
Completed Solr Docker test: empty-varsolr-vol-ramdomuser-rootgroup
Starting Solr Docker test: empty-varsolr-vol-solr
Completed Solr Docker test: empty-varsolr-vol-solr
Starting Solr Docker test: create_core_exec
Completed Solr Docker test: create_core_exec
Starting Solr Docker test: test_log4j
Completed Solr Docker test: test_log4j

> Task :solr:docker:dockerTag
Solr Docker Image Tagged
	ID: 	sha256:32bd3162fb59cff47b07ba6615599a2c66b5b13f8aac4fba251a8ae894e5b257
	Tag: 	apache/solr-nightly:11.0.0-SNAPSHOT

> Task :solr:docker:dockerPush FAILED

FAILURE: Build failed with an exception.

* Where:
Build file '/home/jenkins/jenkins-agent/workspace/Solr/Solr-Docker-Nightly-main/solr/docker/build.gradle' line: 303

* What went wrong:
Execution failed for task ':solr:docker:dockerPush'.
> Current builder does not support all requested platforms: [linux/arm64]
  Supported platforms: linux/amd64, linux/amd64/v2, linux/amd64/v3, linux/amd64/v4, linux/386
  To add platform support, Install QEMU with proper binfmt support.

* Try:
> Run with --stacktrace option to get the stack trace.
> Run with --info or --debug option to get more log output.
> Get more help at https://help.gradle.org.

Deprecated Gradle features were used in this build, making it incompatible with Gradle 9.0.

You can use '--warning-mode all' to show the individual deprecation warnings and determine if they come from your own scripts or plugins.

For more on this, please refer to https://docs.gradle.org/8.10/userguide/command_line_interface.html#sec:command_line_warnings in the Gradle documentation.

BUILD FAILED in 10m 38s
129 actionable tasks: 129 executed

Publishing build scan...
https://develocity.apache.org/s/vb3ifie65a4yg

Build step 'Invoke Gradle script' changed build result to FAILURE
Build step 'Invoke Gradle script' marked build as failure
Email was triggered for: Failure - Any
Sending email for trigger: Failure - Any

[JENKINS] Solr » Solr-Docker-Nightly-main - Build # 1451 - Still Failing!

Posted by Apache Jenkins Server <je...@builds.apache.org>.
Build: https://ci-builds.apache.org/job/Solr/job/Solr-Docker-Nightly-main/1451/

Log: 
Started by timer
Running as SYSTEM
[EnvInject] - Loading node environment variables.
Building remotely on lucene-solr-4 (solr lucene) in workspace /home/jenkins/jenkins-agent/workspace/Solr/Solr-Docker-Nightly-main
[WS-CLEANUP] Deleting project workspace...
[WS-CLEANUP] Deferred wipeout is used...
[WS-CLEANUP] Done
The recommended git tool is: NONE
No credentials specified
Cloning the remote Git repository
Cloning repository https://gitbox.apache.org/repos/asf/solr.git
 > git init /home/jenkins/jenkins-agent/workspace/Solr/Solr-Docker-Nightly-main # timeout=10
Fetching upstream changes from https://gitbox.apache.org/repos/asf/solr.git
 > git --version # timeout=10
 > git --version # 'git version 2.43.0'
 > git fetch --tags --force --progress -- https://gitbox.apache.org/repos/asf/solr.git +refs/heads/*:refs/remotes/origin/* # timeout=10
 > git config remote.origin.url https://gitbox.apache.org/repos/asf/solr.git # timeout=10
 > git config --add remote.origin.fetch +refs/heads/*:refs/remotes/origin/* # timeout=10
Avoid second fetch
 > git rev-parse refs/remotes/origin/main^{commit} # timeout=10
Checking out Revision de9c90f97c9b6663914e53ac8881e0415844105f (refs/remotes/origin/main)
 > git config core.sparsecheckout # timeout=10
 > git checkout -f de9c90f97c9b6663914e53ac8881e0415844105f # timeout=10
 > git branch -a -v --no-abbrev # timeout=10
 > git checkout -b main de9c90f97c9b6663914e53ac8881e0415844105f # timeout=10
Commit message: "SOLR-18027 Increase socket timeout in addition to request timeout (#3975)"
 > git rev-list --no-walk de9c90f97c9b6663914e53ac8881e0415844105f # timeout=10
No emails were triggered.
provisioning config files...
copy managed file [gradle.properties] to file:/home/jenkins/jenkins-agent/workspace/Solr/Solr-Docker-Nightly-main/gradle.properties
[Solr-Docker-Nightly-main] $ /bin/sh -xe /tmp/jenkins1759970072386426078.sh
+ echo ****
+ docker login -u **** --password-stdin
Login Succeeded
[Gradle] - Launching build.
[Solr-Docker-Nightly-main] $ /home/jenkins/jenkins-agent/workspace/Solr/Solr-Docker-Nightly-main/gradlew -Psolr.docker.imageRepo=apache/solr-nightly -Psolr.docker.platform=linux/arm64,linux/amd64 -Psolr.docker.dist=full testDocker dockerPush
Downloading gradle-wrapper.jar from https://raw.githubusercontent.com/gradle/gradle/v8.10.2/gradle/wrapper/gradle-wrapper.jar
To honour the JVM settings for this build a single-use Daemon process will be forked. For more on this, please refer to https://docs.gradle.org/8.10/userguide/gradle_daemon.html#sec:disabling_the_daemon in the Gradle documentation.
Daemon will be stopped at the end of the build 

> Task :build-infra:compileJava
Note: /home/jenkins/jenkins-agent/workspace/Solr/Solr-Docker-Nightly-main/build-tools/build-infra/src/main/java/org/apache/lucene/gradle/Checksum.java uses or overrides a deprecated API.
Note: Recompile with -Xlint:deprecation for details.

> Task :build-infra:pluginDescriptors
> Task :build-infra:processResources
> Task :build-infra:classes
> Task :build-infra:jar
> Task :gitStatus
> Task :checkJdkInternalsExportedToGradle

> Task :solr:api:compileJava
Note: Some input files use or override a deprecated API.
Note: Recompile with -Xlint:deprecation for details.

> Task :solr:api:processResources NO-SOURCE
> Task :solr:api:classes

> Task :solr:api:resolve
SLF4J(W): No SLF4J providers were found.
SLF4J(W): Defaulting to no-operation (NOP) logger implementation
SLF4J(W): See https://www.slf4j.org/codes.html#noProviders for further details.

> Task :solr:solrj:openApiGenerate
Cleaned up output directory /home/jenkins/jenkins-agent/workspace/Solr/Solr-Docker-Nightly-main/solr/solrj/build/generated/ before code generation (cleanupOutput set to true).
No application/json content media type found in response. Response examples can currently only be generated for application/json media type.
############################################################################################
# Thanks for using OpenAPI Generator.                                                      #
# We appreciate your support! Please consider donation to help us maintain this project.   #
# https://opencollective.com/openapi_generator/donate                                      #
############################################################################################
Successfully generated code to /home/jenkins/jenkins-agent/workspace/Solr/Solr-Docker-Nightly-main/solr/solrj/build/generated/

> Task :spotlessInternalRegisterDependencies
> Task :solr:solrj:generatedSpotlessHelper
> Task :solr:solrj:generatedSpotless

> Task :solr:solrj:compileJava
Note: Some input files use or override a deprecated API.
Note: Recompile with -Xlint:deprecation for details.

> Task :solr:solrj-streaming:compileJava
Note: Some input files use or override a deprecated API.
Note: Recompile with -Xlint:deprecation for details.

> Task :solr:solrj-zookeeper:compileJava
Note: Some input files use or override a deprecated API.
Note: Recompile with -Xlint:deprecation for details.

> Task :solr:core:compileJava
Note: Some input files use or override a deprecated API.
Note: Recompile with -Xlint:deprecation for details.

> Task :solr:modules:cross-dc:compileJava
Note: Some input files use or override a deprecated API.
Note: Recompile with -Xlint:deprecation for details.

> Task :solr:cross-dc-manager:compileJava
Note: Some input files use or override a deprecated API.
Note: Recompile with -Xlint:deprecation for details.

> Task :solr:cross-dc-manager:processResources NO-SOURCE
> Task :solr:cross-dc-manager:classes
> Task :solr:cross-dc-manager:jar
> Task :solr:cross-dc-manager:assemblePackaging
> Task :solr:docker:createBodySnippetDockerfile
> Task :solr:docker:createDockerfileLocal
> Task :solr:docker:assemblePackaging
> Task :solr:documentation:changesToHtml
> Task :solr:documentation:copyDocumentationAssets
> Task :solr:documentation:markdownToHtml
> Task :solr:documentation:copyChangesToHtmlForMiniSite
> Task :solr:documentation:copyMiniDocumentationAssets
> Task :solr:documentation:createMiniDocumentationIndex
> Task :solr:documentation:documentationMinimal
> Task :solr:example:assemblePackaging
> Task :solr:api:jar
> Task :solr:core:processResources
> Task :solr:core:classes
> Task :solr:core:jar
> Task :solr:solrj:processResources
> Task :solr:solrj:classes
> Task :solr:solrj:jar
> Task :solr:solrj-streaming:processResources
> Task :solr:solrj-streaming:classes
> Task :solr:solrj-streaming:jar
> Task :solr:solrj-zookeeper:processResources NO-SOURCE
> Task :solr:solrj-zookeeper:classes
> Task :solr:solrj-zookeeper:jar
> Task :solr:webapp:compileJava NO-SOURCE
> Task :solr:webapp:processResources NO-SOURCE
> Task :solr:webapp:classes UP-TO-DATE

> Task :solr:api:buildJSClient
No application/json content media type found in response. Response examples can currently only be generated for application/json media type.
############################################################################################
# Thanks for using OpenAPI Generator.                                                      #
# We appreciate your support! Please consider donation to help us maintain this project.   #
# https://opencollective.com/openapi_generator/donate                                      #
############################################################################################
Successfully generated code to /home/jenkins/jenkins-agent/workspace/Solr/Solr-Docker-Nightly-main/solr/api/build/generated/js

> Task :solr:webapp:nodeSetup
> Task :solr:webapp:npmSetup SKIPPED

> Task :solr:webapp:downloadBrowserify
npm warn deprecated inflight@1.0.6: This module is not supported, and leaks memory. Do not use it. Check out lru-cache if you want a good and tested way to coalesce async requests by a key value, which is much more comprehensive and powerful.
npm warn deprecated glob@7.2.3: Glob versions prior to v9 are no longer supported

added 178 packages, and changed 1 package in 4s

39 packages are looking for funding
  run `npm fund` for details

> Task :solr:webapp:syncJSClientSourceCode

> Task :solr:webapp:jsClientDownloadDeps
npm warn deprecated inflight@1.0.6: This module is not supported, and leaks memory. Do not use it. Check out lru-cache if you want a good and tested way to coalesce async requests by a key value, which is much more comprehensive and powerful.
npm warn deprecated @babel/plugin-proposal-numeric-separator@7.18.6: This proposal has been merged to the ECMAScript standard and thus this plugin is no longer maintained. Please use @babel/plugin-transform-numeric-separator instead.
npm warn deprecated @babel/plugin-proposal-nullish-coalescing-operator@7.18.6: This proposal has been merged to the ECMAScript standard and thus this plugin is no longer maintained. Please use @babel/plugin-transform-nullish-coalescing-operator instead.
npm warn deprecated @babel/plugin-proposal-json-strings@7.18.6: This proposal has been merged to the ECMAScript standard and thus this plugin is no longer maintained. Please use @babel/plugin-transform-json-strings instead.
npm warn deprecated @babel/plugin-proposal-export-namespace-from@7.18.9: This proposal has been merged to the ECMAScript standard and thus this plugin is no longer maintained. Please use @babel/plugin-transform-export-namespace-from instead.
npm warn deprecated @babel/plugin-proposal-class-properties@7.18.6: This proposal has been merged to the ECMAScript standard and thus this plugin is no longer maintained. Please use @babel/plugin-transform-class-properties instead.
npm warn deprecated @babel/plugin-proposal-logical-assignment-operators@7.20.7: This proposal has been merged to the ECMAScript standard and thus this plugin is no longer maintained. Please use @babel/plugin-transform-logical-assignment-operators instead.
npm warn deprecated @babel/plugin-proposal-optional-chaining@7.21.0: This proposal has been merged to the ECMAScript standard and thus this plugin is no longer maintained. Please use @babel/plugin-transform-optional-chaining instead.
npm warn deprecated glob@7.2.3: Glob versions prior to v9 are no longer supported
npm warn deprecated glob@7.1.6: Glob versions prior to v9 are no longer supported
npm warn deprecated formidable@1.2.6: Please upgrade to latest, formidable@v2 or formidable@v3! Check these notes: https://bit.ly/2ZEqIau
npm warn deprecated superagent@5.3.1: Please upgrade to superagent v10.2.2+, see release notes at https://github.com/forwardemail/superagent/releases/tag/v10.2.2 - maintenance is supported by Forward Email @ https://forwardemail.net
npm warn deprecated sinon@7.5.0: 16.1.1

> v2_api@11.0.0 prepare
> npm run build


> v2_api@11.0.0 build
> babel src -d dist

Successfully compiled 153 files with Babel (2808ms).

added 331 packages, and audited 332 packages in 11s

43 packages are looking for funding
  run `npm fund` for details

4 vulnerabilities (2 moderate, 2 high)

To address all issues (including breaking changes), run:
  npm audit fix --force

Run `npm audit` for details.

> Task :solr:webapp:jsClientBuild

> v2_api@11.0.0 build
> babel src -d dist

Successfully compiled 153 files with Babel (3039ms).

> Task :solr:webapp:generateJsClientBundle
> Task :solr:webapp:finalizeJsBundleDir
> Task :kotlinWasmKotlinNpmCachesSetup
> Task :kotlinWasmNodeJsSetup
> Task :kotlinWasmRestoreYarnLock
> Task :kotlinWasmYarnSetup
> Task :solr:ui:wasmJsPackageJson
> Task :solr:ui:wasmJsTestPackageJson
> Task :solr:ui:wasmJsPublicPackageJson
> Task :solr:ui:wasmJsTestPublicPackageJson
> Task :kotlinWasmPackageJsonUmbrella
> Task :wasmRootPackageJson

> Task :kotlinWasmNpmInstall
warning Ignored scripts due to flag.

> Task :kotlinWasmStoreYarnLock
> Task :solr:ui:wasmJsResolveResourcesFromDependencies
> Task :solr:ui:convertXmlValueResourcesForCommonMain
> Task :solr:ui:copyNonXmlValueResourcesForCommonMain
> Task :solr:ui:prepareComposeResourcesTaskForCommonMain
> Task :solr:ui:convertXmlValueResourcesForWasmJsMain NO-SOURCE
> Task :solr:ui:copyNonXmlValueResourcesForWasmJsMain NO-SOURCE
> Task :solr:ui:prepareComposeResourcesTaskForWasmJsMain NO-SOURCE
> Task :solr:ui:assembleWasmJsMainResources
> Task :solr:ui:wasmJsResolveSelfResourcesCopyHierarchicalMultiplatformResources
> Task :solr:ui:wasmJsAggregateResources
> Task :solr:ui:wasmJsProcessResources
> Task :solr:ui:checkKotlinGradlePluginConfigurationErrors SKIPPED
> Task :solr:ui:generateResourceAccessorsForCommonMain
> Task :solr:ui:generateResourceAccessorsForWasmJsMain NO-SOURCE
> Task :solr:ui:generateActualResourceCollectorsForWasmJsMain
> Task :solr:ui:generateComposeResClass
> Task :solr:ui:generateExpectResourceCollectorsForCommonMain
> Task :solr:ui:kotlinWasmBinaryenSetup
> Task :solr:ui:unpackSkikoWasmRuntime
> Task :solr:ui:processSkikoRuntimeForKWasm

> Task :solr:modules:analysis-extras:compileJava
Note: /home/jenkins/jenkins-agent/workspace/Solr/Solr-Docker-Nightly-main/solr/modules/analysis-extras/src/java/org/apache/solr/schema/ICUCollationField.java uses or overrides a deprecated API.
Note: Recompile with -Xlint:deprecation for details.

> Task :solr:modules:analysis-extras:processResources NO-SOURCE
> Task :solr:modules:analysis-extras:classes
> Task :solr:modules:analysis-extras:jar
> Task :solr:modules:analysis-extras:assemblePackaging

> Task :solr:modules:clustering:compileJava
Note: /home/jenkins/jenkins-agent/workspace/Solr/Solr-Docker-Nightly-main/solr/modules/clustering/src/java/org/apache/solr/handler/clustering/ClusteringComponent.java uses or overrides a deprecated API.
Note: Recompile with -Xlint:deprecation for details.

> Task :solr:modules:clustering:processResources NO-SOURCE
> Task :solr:modules:clustering:classes
> Task :solr:modules:clustering:jar
> Task :solr:modules:clustering:assemblePackaging
> Task :solr:modules:cross-dc:processResources NO-SOURCE
> Task :solr:modules:cross-dc:classes
> Task :solr:modules:cross-dc:jar
> Task :solr:modules:cross-dc:assemblePackaging
> Task :solr:modules:cuvs:compileJava
> Task :solr:modules:cuvs:processResources NO-SOURCE
> Task :solr:modules:cuvs:classes
> Task :solr:modules:cuvs:jar
> Task :solr:modules:cuvs:assemblePackaging

> Task :solr:modules:extraction:compileJava
Note: /home/jenkins/jenkins-agent/workspace/Solr/Solr-Docker-Nightly-main/solr/modules/extraction/src/java/org/apache/solr/handler/extraction/ExtractingDocumentLoader.java uses or overrides a deprecated API.
Note: Recompile with -Xlint:deprecation for details.

> Task :solr:modules:extraction:processResources
> Task :solr:modules:extraction:classes
> Task :solr:modules:extraction:jar
> Task :solr:modules:extraction:assemblePackaging

> Task :solr:modules:gcs-repository:compileJava
Note: /home/jenkins/jenkins-agent/workspace/Solr/Solr-Docker-Nightly-main/solr/modules/gcs-repository/src/java/org/apache/solr/gcs/GCSConfigParser.java uses or overrides a deprecated API.
Note: Recompile with -Xlint:deprecation for details.

> Task :solr:modules:gcs-repository:processResources NO-SOURCE
> Task :solr:modules:gcs-repository:classes
> Task :solr:modules:gcs-repository:jar
> Task :solr:modules:gcs-repository:assemblePackaging
> Task :solr:modules:jwt-auth:compileJava
> Task :solr:modules:jwt-auth:processResources NO-SOURCE
> Task :solr:modules:jwt-auth:classes
> Task :solr:modules:jwt-auth:jar
> Task :solr:modules:jwt-auth:assemblePackaging
> Task :solr:ui:compileKotlinWasmJs
> Task :solr:modules:langid:compileJava
> Task :solr:ui:wasmJsMainClasses
> Task :solr:modules:langid:processResources
> Task :solr:modules:langid:classes
> Task :solr:modules:langid:jar
> Task :solr:modules:langid:assemblePackaging
> Task :solr:modules:language-models:compileJava
> Task :solr:modules:language-models:processResources NO-SOURCE
> Task :solr:modules:language-models:classes
> Task :solr:modules:language-models:jar
> Task :solr:modules:language-models:assemblePackaging

> Task :solr:modules:ltr:compileJava
Note: Some input files use or override a deprecated API.
Note: Recompile with -Xlint:deprecation for details.

> Task :solr:modules:ltr:processResources NO-SOURCE
> Task :solr:modules:ltr:classes
> Task :solr:modules:ltr:jar
> Task :solr:modules:ltr:assemblePackaging
> Task :solr:modules:opentelemetry:compileJava
> Task :solr:modules:opentelemetry:processResources NO-SOURCE
> Task :solr:modules:opentelemetry:classes
> Task :solr:modules:opentelemetry:jar
> Task :solr:modules:opentelemetry:assemblePackaging
> Task :solr:modules:s3-repository:compileJava
> Task :solr:modules:s3-repository:processResources NO-SOURCE
> Task :solr:modules:s3-repository:classes
> Task :solr:modules:s3-repository:jar
> Task :solr:modules:s3-repository:assemblePackaging

> Task :solr:modules:scripting:compileJava
Note: Some input files use or override a deprecated API.
Note: Recompile with -Xlint:deprecation for details.

> Task :solr:modules:scripting:processResources NO-SOURCE
> Task :solr:modules:scripting:classes
> Task :solr:modules:scripting:jar
> Task :solr:modules:scripting:assemblePackaging

> Task :solr:modules:sql:compileJava
Note: Some input files use or override a deprecated API.
Note: Recompile with -Xlint:deprecation for details.

> Task :solr:modules:sql:processResources
> Task :solr:modules:sql:classes
> Task :solr:modules:sql:jar
> Task :solr:modules:sql:assemblePackaging
> Task :solr:ui:compileProductionExecutableKotlinWasmJs
> Task :solr:ui:compileProductionExecutableKotlinWasmJsOptimize
> Task :solr:ui:wasmJsProductionExecutableCompileSync

> Task :solr:ui:wasmJsBrowserProductionWebpack
asset 8bc1b48ee28fd6b51bb9.wasm 8.01 MiB [emitted] [immutable] [from: kotlin/skiko.wasm] [big] (auxiliary name: main)
asset 58b32cfed875a4b49431.wasm 3.74 MiB [emitted] [immutable] [from: kotlin/composeApp.wasm] [big] (auxiliary name: main)
asset composeApp.js 556 KiB [emitted] [minimized] [big] (name: main) 2 related assets
runtime modules 4.33 KiB 7 modules
built modules 909 KiB (javascript) 11.8 MiB (asset) [built]
  javascript modules 908 KiB
Critical dependency: the request of a dependency is an expression
    modules by path ./kotlin/*.mjs 516 KiB
      ./kotlin/composeApp.mjs 355 bytes [built] [code generated]
      ./kotlin/skiko.mjs 478 KiB [built] [code generated]
      ./kotlin/composeApp.uninstantiated.mjs 38.3 KiB [built] [code generated] [3 warnings]
    ../../node_modules/@js-joda/core/dist/js-joda.esm.js 392 KiB [built] [code generated]
    ./kotlin/ lazy strict namespace object 160 bytes [built] [code generated]
  asset modules 84 bytes (javascript) 11.8 MiB (asset)
    ./kotlin/skiko.wasm 42 bytes (javascript) 8.01 MiB (asset) [built] [code generated]
    ./kotlin/composeApp.wasm 42 bytes (javascript) 3.74 MiB (asset) [built] [code generated]
webpack 5.94.0 compiled with 1 warning in 3940 ms

> Task :solr:ui:wasmJsBrowserDistribution
> Task :solr:webapp:generateUiProdFiles
> Task :solr:webapp:war
> Task :solr:server:assemblePackaging
> Task :solr:packaging:fullDistTar

> Task :solr:docker:dockerBuild
#0 building with "default" instance using docker driver

#1 [internal] load remote build context
#1 DONE 9.1s

#1 [internal] load remote build context
#1 DONE 9.1s

#2 copy /context /
#2 DONE 1.5s

#3 [internal] load metadata for docker.io/library/eclipse-temurin:25-jre-noble
#3 ...

#4 [auth] library/eclipse-temurin:pull token for registry-1.docker.io
#4 DONE 0.0s

#3 [internal] load metadata for docker.io/library/eclipse-temurin:25-jre-noble
#3 DONE 0.6s

#5 [1/7] FROM docker.io/library/eclipse-temurin:25-jre-noble@sha256:d8dd4342b7dbb5a9c06d0499eecca86315346acc6a20026080642610344ceb2c
#5 resolve docker.io/library/eclipse-temurin:25-jre-noble@sha256:d8dd4342b7dbb5a9c06d0499eecca86315346acc6a20026080642610344ceb2c done
#5 DONE 0.0s

#5 [1/7] FROM docker.io/library/eclipse-temurin:25-jre-noble@sha256:d8dd4342b7dbb5a9c06d0499eecca86315346acc6a20026080642610344ceb2c
#5 CACHED

#6 [2/7] COPY / /opt/
#6 DONE 1.3s

#7 [3/7] RUN set -ex;   groupadd -r --gid "8983" "solr";   useradd -r --uid "8983" --gid "8983" "solr"
#7 0.215 + groupadd -r --gid 8983 solr
#7 0.250 + useradd -r --uid 8983 --gid 8983 solr
#7 0.263 useradd warning: solr's uid 8983 is greater than SYS_UID_MAX 999
#7 DONE 0.3s

#8 [4/7] RUN set -ex;   (cd /opt; ln -s solr-*/ solr);   rm -Rf /opt/solr/docs /opt/solr/docker/Dockerfile;
#8 0.166 + cd /opt
#8 0.166 + ln -s solr-11.0.0-SNAPSHOT/ solr
#8 0.172 + rm -Rf /opt/solr/docs /opt/solr/docker/Dockerfile
#8 DONE 0.2s

#9 [5/7] RUN set -ex;   mkdir -p /opt/solr/server/solr/lib /docker-entrypoint-initdb.d;   cp /opt/solr/bin/solr.in.sh /etc/default/solr.in.sh;   mv /opt/solr/bin/solr.in.sh /opt/solr/bin/solr.in.sh.orig;   mv /opt/solr/bin/solr.in.cmd /opt/solr/bin/solr.in.cmd.orig;   chmod 0664 /etc/default/solr.in.sh;   mkdir -p -m0770 /var/solr;   chown -R "solr:0" /var/solr;
#9 0.168 + mkdir -p /opt/solr/server/solr/lib /docker-entrypoint-initdb.d
#9 0.179 + cp /opt/solr/bin/solr.in.sh /etc/default/solr.in.sh
#9 0.189 + mv /opt/solr/bin/solr.in.sh /opt/solr/bin/solr.in.sh.orig
#9 0.197 + mv /opt/solr/bin/solr.in.cmd /opt/solr/bin/solr.in.cmd.orig
#9 0.200 + chmod 0664 /etc/default/solr.in.sh
#9 0.203 + mkdir -p -m0770 /var/solr
#9 0.205 + chown -R solr:0 /var/solr
#9 DONE 0.3s

#10 [6/7] RUN set -ex;     apt-get update;     apt-get -y --no-install-recommends install curl acl lsof procps wget netcat-openbsd gosu tini jattach;     rm -rf /var/lib/apt/lists/*;
#10 0.179 + apt-get update
#10 0.359 Get:1 http://archive.ubuntu.com/ubuntu noble InRelease [256 kB]
#10 0.549 Get:2 http://security.ubuntu.com/ubuntu noble-security InRelease [126 kB]
#10 0.692 Get:3 http://archive.ubuntu.com/ubuntu noble-updates InRelease [126 kB]
#10 0.775 Get:4 http://archive.ubuntu.com/ubuntu noble-backports InRelease [126 kB]
#10 0.859 Get:5 http://archive.ubuntu.com/ubuntu noble/multiverse amd64 Packages [331 kB]
#10 0.929 Get:6 http://archive.ubuntu.com/ubuntu noble/main amd64 Packages [1,808 kB]
#10 1.067 Get:7 http://archive.ubuntu.com/ubuntu noble/universe amd64 Packages [19.3 MB]
#10 1.261 Get:8 http://security.ubuntu.com/ubuntu noble-security/restricted amd64 Packages [2,898 kB]
#10 1.391 Get:9 http://archive.ubuntu.com/ubuntu noble/restricted amd64 Packages [117 kB]
#10 1.392 Get:10 http://archive.ubuntu.com/ubuntu noble-updates/universe amd64 Packages [1,950 kB]
#10 1.411 Get:11 http://archive.ubuntu.com/ubuntu noble-updates/multiverse amd64 Packages [35.9 kB]
#10 1.411 Get:12 http://archive.ubuntu.com/ubuntu noble-updates/main amd64 Packages [2,130 kB]
#10 1.453 Get:13 http://archive.ubuntu.com/ubuntu noble-updates/restricted amd64 Packages [3,059 kB]
#10 1.488 Get:14 http://archive.ubuntu.com/ubuntu noble-backports/universe amd64 Packages [34.6 kB]
#10 1.488 Get:15 http://archive.ubuntu.com/ubuntu noble-backports/main amd64 Packages [49.5 kB]
#10 2.147 Get:16 http://security.ubuntu.com/ubuntu noble-security/universe amd64 Packages [1,183 kB]
#10 2.189 Get:17 http://security.ubuntu.com/ubuntu noble-security/main amd64 Packages [1,752 kB]
#10 2.253 Get:18 http://security.ubuntu.com/ubuntu noble-security/multiverse amd64 Packages [33.1 kB]
#10 2.819 Fetched 35.3 MB in 3s (13.7 MB/s)
#10 2.819 Reading package lists...
#10 3.747 + apt-get -y --no-install-recommends install curl acl lsof procps wget netcat-openbsd gosu tini jattach
#10 3.758 Reading package lists...
#10 4.710 Building dependency tree...
#10 4.927 Reading state information...
#10 5.122 procps is already the newest version (2:4.0.4-4ubuntu3.2).
#10 5.122 The following additional packages will be installed:
#10 5.122   libbsd0 libcurl4t64 libgssapi-krb5-2 libk5crypto3 libkeyutils1 libkrb5-3
#10 5.122   libkrb5support0 libldap2 libnghttp2-14 libpsl5t64 librtmp1 libsasl2-2
#10 5.123   libsasl2-modules-db libssh-4 libtirpc-common libtirpc3t64
#10 5.124 Suggested packages:
#10 5.124   krb5-doc krb5-user
#10 5.124 Recommended packages:
#10 5.124   krb5-locales libldap-common publicsuffix libsasl2-modules
#10 5.213 The following NEW packages will be installed:
#10 5.213   acl curl gosu jattach libbsd0 libcurl4t64 libgssapi-krb5-2 libk5crypto3
#10 5.213   libkeyutils1 libkrb5-3 libkrb5support0 libldap2 libnghttp2-14 libpsl5t64
#10 5.214   librtmp1 libsasl2-2 libsasl2-modules-db libssh-4 libtirpc-common
#10 5.214   libtirpc3t64 lsof netcat-openbsd tini wget
#10 5.557 0 upgraded, 24 newly installed, 0 to remove and 10 not upgraded.
#10 5.557 Need to get 3,835 kB of archives.
#10 5.557 After this operation, 10.6 MB of additional disk space will be used.
#10 5.557 Get:1 http://archive.ubuntu.com/ubuntu noble-updates/main amd64 libbsd0 amd64 0.12.1-1build1.1 [41.2 kB]
#10 5.951 Get:2 http://archive.ubuntu.com/ubuntu noble-updates/main amd64 libkrb5support0 amd64 1.20.1-6ubuntu2.6 [34.4 kB]
#10 6.054 Get:3 http://archive.ubuntu.com/ubuntu noble-updates/main amd64 libk5crypto3 amd64 1.20.1-6ubuntu2.6 [82.0 kB]
#10 6.277 Get:4 http://archive.ubuntu.com/ubuntu noble/main amd64 libkeyutils1 amd64 1.6.3-3build1 [9,490 B]
#10 6.291 Get:5 http://archive.ubuntu.com/ubuntu noble-updates/main amd64 libkrb5-3 amd64 1.20.1-6ubuntu2.6 [348 kB]
#10 6.558 Get:6 http://archive.ubuntu.com/ubuntu noble-updates/main amd64 libgssapi-krb5-2 amd64 1.20.1-6ubuntu2.6 [143 kB]
#10 6.613 Get:7 http://archive.ubuntu.com/ubuntu noble/main amd64 libtirpc-common all 1.3.4+ds-1.1build1 [8,094 B]
#10 6.616 Get:8 http://archive.ubuntu.com/ubuntu noble/main amd64 libtirpc3t64 amd64 1.3.4+ds-1.1build1 [82.6 kB]
#10 6.644 Get:9 http://archive.ubuntu.com/ubuntu noble/main amd64 netcat-openbsd amd64 1.226-1ubuntu2 [44.3 kB]
#10 6.657 Get:10 http://archive.ubuntu.com/ubuntu noble-updates/main amd64 libnghttp2-14 amd64 1.59.0-1ubuntu0.2 [74.3 kB]
#10 6.679 Get:11 http://archive.ubuntu.com/ubuntu noble/main amd64 libpsl5t64 amd64 0.21.2-1.1build1 [57.1 kB]
#10 6.693 Get:12 http://archive.ubuntu.com/ubuntu noble/main amd64 lsof amd64 4.95.0-1build3 [247 kB]
#10 6.746 Get:13 http://archive.ubuntu.com/ubuntu noble-updates/main amd64 wget amd64 1.21.4-1ubuntu4.1 [334 kB]
#10 6.800 Get:14 http://archive.ubuntu.com/ubuntu noble-updates/main amd64 acl amd64 2.3.2-1build1.1 [39.4 kB]
#10 6.805 Get:15 http://archive.ubuntu.com/ubuntu noble-updates/main amd64 libsasl2-modules-db amd64 2.1.28+dfsg1-5ubuntu3.1 [20.4 kB]
#10 6.903 Get:16 http://archive.ubuntu.com/ubuntu noble-updates/main amd64 libsasl2-2 amd64 2.1.28+dfsg1-5ubuntu3.1 [53.2 kB]
#10 6.907 Get:17 http://archive.ubuntu.com/ubuntu noble-updates/main amd64 libldap2 amd64 2.6.7+dfsg-1~exp1ubuntu8.2 [196 kB]
#10 6.923 Get:18 http://archive.ubuntu.com/ubuntu noble/main amd64 librtmp1 amd64 2.4+20151223.gitfa8646d.1-2build7 [56.3 kB]
#10 6.929 Get:19 http://archive.ubuntu.com/ubuntu noble-updates/main amd64 libssh-4 amd64 0.10.6-2ubuntu0.2 [188 kB]
#10 6.944 Get:20 http://archive.ubuntu.com/ubuntu noble-updates/main amd64 libcurl4t64 amd64 8.5.0-2ubuntu10.6 [341 kB]
#10 6.967 Get:21 http://archive.ubuntu.com/ubuntu noble-updates/main amd64 curl amd64 8.5.0-2ubuntu10.6 [226 kB]
#10 6.983 Get:22 http://archive.ubuntu.com/ubuntu noble/universe amd64 jattach amd64 2.2-1 [13.0 kB]
#10 7.055 Get:23 http://archive.ubuntu.com/ubuntu noble/universe amd64 tini amd64 0.19.0-1 [276 kB]
#10 7.073 Get:24 http://archive.ubuntu.com/ubuntu noble-updates/universe amd64 gosu amd64 1.17-1ubuntu0.24.04.3 [921 kB]
#10 7.358 debconf: delaying package configuration, since apt-utils is not installed
#10 7.400 Fetched 3,835 kB in 2s (2,013 kB/s)
#10 7.434 Selecting previously unselected package libbsd0:amd64.
#10 7.434 (Reading database ... (Reading database ... 5%(Reading database ... 10%(Reading database ... 15%(Reading database ... 20%(Reading database ... 25%(Reading database ... 30%(Reading database ... 35%(Reading database ... 40%(Reading database ... 45%(Reading database ... 50%(Reading database ... 55%(Reading database ... 60%(Reading database ... 65%(Reading database ... 70%(Reading database ... 75%(Reading database ... 80%(Reading database ... 85%(Reading database ... 90%(Reading database ... 95%(Reading database ... 100%(Reading database ... 6292 files and directories currently installed.)
#10 7.518 Preparing to unpack .../00-libbsd0_0.12.1-1build1.1_amd64.deb ...
#10 7.524 Unpacking libbsd0:amd64 (0.12.1-1build1.1) ...
#10 7.567 Selecting previously unselected package libkrb5support0:amd64.
#10 7.568 Preparing to unpack .../01-libkrb5support0_1.20.1-6ubuntu2.6_amd64.deb ...
#10 7.571 Unpacking libkrb5support0:amd64 (1.20.1-6ubuntu2.6) ...
#10 7.596 Selecting previously unselected package libk5crypto3:amd64.
#10 7.597 Preparing to unpack .../02-libk5crypto3_1.20.1-6ubuntu2.6_amd64.deb ...
#10 7.599 Unpacking libk5crypto3:amd64 (1.20.1-6ubuntu2.6) ...
#10 7.623 Selecting previously unselected package libkeyutils1:amd64.
#10 7.624 Preparing to unpack .../03-libkeyutils1_1.6.3-3build1_amd64.deb ...
#10 7.626 Unpacking libkeyutils1:amd64 (1.6.3-3build1) ...
#10 7.649 Selecting previously unselected package libkrb5-3:amd64.
#10 7.650 Preparing to unpack .../04-libkrb5-3_1.20.1-6ubuntu2.6_amd64.deb ...
#10 7.652 Unpacking libkrb5-3:amd64 (1.20.1-6ubuntu2.6) ...
#10 7.691 Selecting previously unselected package libgssapi-krb5-2:amd64.
#10 7.692 Preparing to unpack .../05-libgssapi-krb5-2_1.20.1-6ubuntu2.6_amd64.deb ...
#10 7.694 Unpacking libgssapi-krb5-2:amd64 (1.20.1-6ubuntu2.6) ...
#10 7.720 Selecting previously unselected package libtirpc-common.
#10 7.721 Preparing to unpack .../06-libtirpc-common_1.3.4+ds-1.1build1_all.deb ...
#10 7.723 Unpacking libtirpc-common (1.3.4+ds-1.1build1) ...
#10 7.752 Selecting previously unselected package libtirpc3t64:amd64.
#10 7.752 Preparing to unpack .../07-libtirpc3t64_1.3.4+ds-1.1build1_amd64.deb ...
#10 7.760 Adding 'diversion of /lib/x86_64-linux-gnu/libtirpc.so.3 to /lib/x86_64-linux-gnu/libtirpc.so.3.usr-is-merged by libtirpc3t64'
#10 7.768 Adding 'diversion of /lib/x86_64-linux-gnu/libtirpc.so.3.0.0 to /lib/x86_64-linux-gnu/libtirpc.so.3.0.0.usr-is-merged by libtirpc3t64'
#10 7.770 Unpacking libtirpc3t64:amd64 (1.3.4+ds-1.1build1) ...
#10 7.808 Selecting previously unselected package netcat-openbsd.
#10 7.809 Preparing to unpack .../08-netcat-openbsd_1.226-1ubuntu2_amd64.deb ...
#10 7.811 Unpacking netcat-openbsd (1.226-1ubuntu2) ...
#10 7.838 Selecting previously unselected package libnghttp2-14:amd64.
#10 7.838 Preparing to unpack .../09-libnghttp2-14_1.59.0-1ubuntu0.2_amd64.deb ...
#10 7.841 Unpacking libnghttp2-14:amd64 (1.59.0-1ubuntu0.2) ...
#10 7.866 Selecting previously unselected package libpsl5t64:amd64.
#10 7.866 Preparing to unpack .../10-libpsl5t64_0.21.2-1.1build1_amd64.deb ...
#10 7.869 Unpacking libpsl5t64:amd64 (0.21.2-1.1build1) ...
#10 7.888 Selecting previously unselected package lsof.
#10 7.889 Preparing to unpack .../11-lsof_4.95.0-1build3_amd64.deb ...
#10 7.891 Unpacking lsof (4.95.0-1build3) ...
#10 7.915 Selecting previously unselected package wget.
#10 7.916 Preparing to unpack .../12-wget_1.21.4-1ubuntu4.1_amd64.deb ...
#10 7.918 Unpacking wget (1.21.4-1ubuntu4.1) ...
#10 7.946 Selecting previously unselected package acl.
#10 7.946 Preparing to unpack .../13-acl_2.3.2-1build1.1_amd64.deb ...
#10 7.949 Unpacking acl (2.3.2-1build1.1) ...
#10 7.968 Selecting previously unselected package libsasl2-modules-db:amd64.
#10 7.969 Preparing to unpack .../14-libsasl2-modules-db_2.1.28+dfsg1-5ubuntu3.1_amd64.deb ...
#10 7.971 Unpacking libsasl2-modules-db:amd64 (2.1.28+dfsg1-5ubuntu3.1) ...
#10 7.993 Selecting previously unselected package libsasl2-2:amd64.
#10 7.994 Preparing to unpack .../15-libsasl2-2_2.1.28+dfsg1-5ubuntu3.1_amd64.deb ...
#10 8.002 Unpacking libsasl2-2:amd64 (2.1.28+dfsg1-5ubuntu3.1) ...
#10 8.028 Selecting previously unselected package libldap2:amd64.
#10 8.028 Preparing to unpack .../16-libldap2_2.6.7+dfsg-1~exp1ubuntu8.2_amd64.deb ...
#10 8.030 Unpacking libldap2:amd64 (2.6.7+dfsg-1~exp1ubuntu8.2) ...
#10 8.056 Selecting previously unselected package librtmp1:amd64.
#10 8.057 Preparing to unpack .../17-librtmp1_2.4+20151223.gitfa8646d.1-2build7_amd64.deb ...
#10 8.059 Unpacking librtmp1:amd64 (2.4+20151223.gitfa8646d.1-2build7) ...
#10 8.082 Selecting previously unselected package libssh-4:amd64.
#10 8.083 Preparing to unpack .../18-libssh-4_0.10.6-2ubuntu0.2_amd64.deb ...
#10 8.086 Unpacking libssh-4:amd64 (0.10.6-2ubuntu0.2) ...
#10 8.113 Selecting previously unselected package libcurl4t64:amd64.
#10 8.113 Preparing to unpack .../19-libcurl4t64_8.5.0-2ubuntu10.6_amd64.deb ...
#10 8.116 Unpacking libcurl4t64:amd64 (8.5.0-2ubuntu10.6) ...
#10 8.141 Selecting previously unselected package curl.
#10 8.142 Preparing to unpack .../20-curl_8.5.0-2ubuntu10.6_amd64.deb ...
#10 8.145 Unpacking curl (8.5.0-2ubuntu10.6) ...
#10 8.178 Selecting previously unselected package jattach.
#10 8.178 Preparing to unpack .../21-jattach_2.2-1_amd64.deb ...
#10 8.184 Unpacking jattach (2.2-1) ...
#10 8.207 Selecting previously unselected package tini.
#10 8.207 Preparing to unpack .../22-tini_0.19.0-1_amd64.deb ...
#10 8.210 Unpacking tini (0.19.0-1) ...
#10 8.250 Selecting previously unselected package gosu.
#10 8.250 Preparing to unpack .../23-gosu_1.17-1ubuntu0.24.04.3_amd64.deb ...
#10 8.254 Unpacking gosu (1.17-1ubuntu0.24.04.3) ...
#10 8.298 Setting up libkeyutils1:amd64 (1.6.3-3build1) ...
#10 8.305 Setting up libtirpc-common (1.3.4+ds-1.1build1) ...
#10 8.317 Setting up libpsl5t64:amd64 (0.21.2-1.1build1) ...
#10 8.327 Setting up libnghttp2-14:amd64 (1.59.0-1ubuntu0.2) ...
#10 8.334 Setting up jattach (2.2-1) ...
#10 8.341 Setting up acl (2.3.2-1build1.1) ...
#10 8.351 Setting up libkrb5support0:amd64 (1.20.1-6ubuntu2.6) ...
#10 8.358 Setting up libsasl2-modules-db:amd64 (2.1.28+dfsg1-5ubuntu3.1) ...
#10 8.365 Setting up librtmp1:amd64 (2.4+20151223.gitfa8646d.1-2build7) ...
#10 8.371 Setting up gosu (1.17-1ubuntu0.24.04.3) ...
#10 8.378 Setting up tini (0.19.0-1) ...
#10 8.384 Setting up libk5crypto3:amd64 (1.20.1-6ubuntu2.6) ...
#10 8.391 Setting up libsasl2-2:amd64 (2.1.28+dfsg1-5ubuntu3.1) ...
#10 8.398 Setting up libkrb5-3:amd64 (1.20.1-6ubuntu2.6) ...
#10 8.405 Setting up libbsd0:amd64 (0.12.1-1build1.1) ...
#10 8.412 Setting up libldap2:amd64 (2.6.7+dfsg-1~exp1ubuntu8.2) ...
#10 8.419 Setting up wget (1.21.4-1ubuntu4.1) ...
#10 8.428 Setting up netcat-openbsd (1.226-1ubuntu2) ...
#10 8.450 update-alternatives: using /bin/nc.openbsd to provide /bin/nc (nc) in auto mode
#10 8.451 update-alternatives: warning: skip creation of /usr/share/man/man1/nc.1.gz because associated file /usr/share/man/man1/nc_openbsd.1.gz (of link group nc) doesn't exist
#10 8.451 update-alternatives: warning: skip creation of /usr/share/man/man1/netcat.1.gz because associated file /usr/share/man/man1/nc_openbsd.1.gz (of link group nc) doesn't exist
#10 8.461 Setting up libgssapi-krb5-2:amd64 (1.20.1-6ubuntu2.6) ...
#10 8.469 Setting up libssh-4:amd64 (0.10.6-2ubuntu0.2) ...
#10 8.477 Setting up libcurl4t64:amd64 (8.5.0-2ubuntu10.6) ...
#10 8.484 Setting up libtirpc3t64:amd64 (1.3.4+ds-1.1build1) ...
#10 8.491 Setting up lsof (4.95.0-1build3) ...
#10 8.497 Setting up curl (8.5.0-2ubuntu10.6) ...
#10 8.505 Processing triggers for libc-bin (2.39-0ubuntu8.6) ...
#10 8.581 + rm -rf /var/lib/apt/lists/archive.ubuntu.com_ubuntu_dists_noble-backports_InRelease /var/lib/apt/lists/archive.ubuntu.com_ubuntu_dists_noble-backports_main_binary-amd64_Packages.lz4 /var/lib/apt/lists/archive.ubuntu.com_ubuntu_dists_noble-backports_universe_binary-amd64_Packages.lz4 /var/lib/apt/lists/archive.ubuntu.com_ubuntu_dists_noble-updates_InRelease /var/lib/apt/lists/archive.ubuntu.com_ubuntu_dists_noble-updates_main_binary-amd64_Packages.lz4 /var/lib/apt/lists/archive.ubuntu.com_ubuntu_dists_noble-updates_multiverse_binary-amd64_Packages.lz4 /var/lib/apt/lists/archive.ubuntu.com_ubuntu_dists_noble-updates_restricted_binary-amd64_Packages.lz4 /var/lib/apt/lists/archive.ubuntu.com_ubuntu_dists_noble-updates_universe_binary-amd64_Packages.lz4 /var/lib/apt/lists/archive.ubuntu.com_ubuntu_dists_noble_InRelease /var/lib/apt/lists/archive.ubuntu.com_ubuntu_dists_noble_main_binary-amd64_Packages.lz4 /var/lib/apt/lists/archive.ubuntu.com_ubuntu_dists_noble_multiverse_binary-amd64_Packages.lz4 /var/lib/apt/lists/archive.ubuntu.com_ubuntu_dists_noble_restricted_binary-amd64_Packages.lz4 /var/lib/apt/lists/archive.ubuntu.com_ubuntu_dists_noble_universe_binary-amd64_Packages.lz4 /var/lib/apt/lists/auxfiles /var/lib/apt/lists/lock /var/lib/apt/lists/partial /var/lib/apt/lists/security.ubuntu.com_ubuntu_dists_noble-security_InRelease /var/lib/apt/lists/security.ubuntu.com_ubuntu_dists_noble-security_main_binary-amd64_Packages.lz4 /var/lib/apt/lists/security.ubuntu.com_ubuntu_dists_noble-security_multiverse_binary-amd64_Packages.lz4 /var/lib/apt/lists/security.ubuntu.com_ubuntu_dists_noble-security_restricted_binary-amd64_Packages.lz4 /var/lib/apt/lists/security.ubuntu.com_ubuntu_dists_noble-security_universe_binary-amd64_Packages.lz4
#10 DONE 8.6s

#11 [7/7] WORKDIR /opt/solr
#11 DONE 0.0s

#12 exporting to image
#12 exporting layers
#12 exporting layers 1.9s done
#12 writing image sha256:9c46074dd6a41fbf09f885fb4196e4545f8414bc29bac5f4fea9114f8b5c7c02 done
#12 DONE 2.0s
Solr Docker Image Created
	ID: 	sha256:9c46074dd6a41fbf09f885fb4196e4545f8414bc29bac5f4fea9114f8b5c7c02
	Base Image: 	eclipse-temurin:25-jre-noble
	Solr Version: 	11.0.0-SNAPSHOT
	Solr Distribution: 	Full

> Task :solr:docker:testDocker
Testing Solr Image ID: sha256:9c46074dd6a41fbf09f885fb4196e4545f8414bc29bac5f4fea9114f8b5c7c02 (sequentially)
Starting Solr Docker test: create_core_randomuser_rootgroup
Completed Solr Docker test: create_core_randomuser_rootgroup
Starting Solr Docker test: empty-varsolr-vol-solr-nocopy
Completed Solr Docker test: empty-varsolr-vol-solr-nocopy
Starting Solr Docker test: precreate_core_randomuser_rootgroup
Completed Solr Docker test: precreate_core_randomuser_rootgroup
Starting Solr Docker test: create_core
Completed Solr Docker test: create_core
Starting Solr Docker test: demo
Completed Solr Docker test: demo
Starting Solr Docker test: cloud_multi_node_embedded_zk
Completed Solr Docker test: cloud_multi_node_embedded_zk
Starting Solr Docker test: demo-tini
Completed Solr Docker test: demo-tini
Starting Solr Docker test: initdb
Completed Solr Docker test: initdb
Starting Solr Docker test: precreate_core
Completed Solr Docker test: precreate_core
Starting Solr Docker test: empty-varsolr-dir-user
Completed Solr Docker test: empty-varsolr-dir-user
Starting Solr Docker test: gosu
Completed Solr Docker test: gosu
Starting Solr Docker test: empty-varsolr-vol-user
Completed Solr Docker test: empty-varsolr-vol-user
Starting Solr Docker test: empty-varsolr-dir-ramdomuser-rootgroup
Completed Solr Docker test: empty-varsolr-dir-ramdomuser-rootgroup
Starting Solr Docker test: empty-varsolr-dir-solr
Completed Solr Docker test: empty-varsolr-dir-solr
Starting Solr Docker test: create_bad_core
Completed Solr Docker test: create_bad_core
Starting Solr Docker test: user_volume
Completed Solr Docker test: user_volume
Starting Solr Docker test: log4j2_migration
Completed Solr Docker test: log4j2_migration
Starting Solr Docker test: empty-varsolr-vol-ramdomuser-rootgroup
Completed Solr Docker test: empty-varsolr-vol-ramdomuser-rootgroup
Starting Solr Docker test: empty-varsolr-vol-solr
Completed Solr Docker test: empty-varsolr-vol-solr
Starting Solr Docker test: create_core_exec
Completed Solr Docker test: create_core_exec
Starting Solr Docker test: test_log4j
Completed Solr Docker test: test_log4j

> Task :solr:docker:dockerTag
Solr Docker Image Tagged
	ID: 	sha256:9c46074dd6a41fbf09f885fb4196e4545f8414bc29bac5f4fea9114f8b5c7c02
	Tag: 	apache/solr-nightly:11.0.0-SNAPSHOT

> Task :solr:docker:dockerPush FAILED

FAILURE: Build failed with an exception.

* Where:
Build file '/home/jenkins/jenkins-agent/workspace/Solr/Solr-Docker-Nightly-main/solr/docker/build.gradle' line: 303

* What went wrong:
Execution failed for task ':solr:docker:dockerPush'.
> Current builder does not support all requested platforms: [linux/arm64]
  Supported platforms: linux/amd64, linux/amd64/v2, linux/amd64/v3, linux/amd64/v4, linux/386
  To add platform support, Install QEMU with proper binfmt support.

* Try:
> Run with --stacktrace option to get the stack trace.
> Run with --info or --debug option to get more log output.
> Get more help at https://help.gradle.org.

Deprecated Gradle features were used in this build, making it incompatible with Gradle 9.0.

You can use '--warning-mode all' to show the individual deprecation warnings and determine if they come from your own scripts or plugins.

For more on this, please refer to https://docs.gradle.org/8.10/userguide/command_line_interface.html#sec:command_line_warnings in the Gradle documentation.

BUILD FAILED in 10m 6s
129 actionable tasks: 129 executed

Publishing build scan...
https://develocity.apache.org/s/eiem5rxk4nsjc

Build step 'Invoke Gradle script' changed build result to FAILURE
Build step 'Invoke Gradle script' marked build as failure
Email was triggered for: Failure - Any
Sending email for trigger: Failure - Any