You are viewing a plain text version of this content. The canonical link for it is here.
Posted to builds@beam.apache.org by Apache Jenkins Server <je...@builds.apache.org> on 2019/07/19 19:05:43 UTC
Build failed in Jenkins: beam_PostCommit_Python3_Verify #1400
See <https://builds.apache.org/job/beam_PostCommit_Python3_Verify/1400/display/redirect>
------------------------------------------
[...truncated 390.79 KB...]
kms_key=transform.kms_key))
Found: https://console.cloud.google.com/dataflow/jobsDetail/locations/us-central1/jobs/2019-07-19_11_29_50-8616524898562956659?project=apache-beam-testing.
<https://builds.apache.org/job/beam_PostCommit_Python3_Verify/ws/src/sdks/python/apache_beam/io/fileio_test.py>:232: FutureWarning: MatchAll is experimental.
Found: https://console.cloud.google.com/dataflow/jobsDetail/locations/us-central1/jobs/2019-07-19_11_40_15-5839653881050964439?project=apache-beam-testing.
| 'GetPath' >> beam.Map(lambda metadata: metadata.path))
<https://builds.apache.org/job/beam_PostCommit_Python3_Verify/ws/src/sdks/python/apache_beam/io/fileio_test.py>:243: FutureWarning: MatchAll is experimental.
| 'Checksums' >> beam.Map(compute_hash))
<https://builds.apache.org/job/beam_PostCommit_Python3_Verify/ws/src/sdks/python/apache_beam/io/fileio_test.py>:243: FutureWarning: ReadMatches is experimental.
| 'Checksums' >> beam.Map(compute_hash))
Found: https://console.cloud.google.com/dataflow/jobsDetail/locations/us-central1/jobs/2019-07-19_11_07_12-12758864274291334861?project=apache-beam-testing.
Found: https://console.cloud.google.com/dataflow/jobsDetail/locations/us-central1/jobs/2019-07-19_11_20_38-11527209701417661604?project=apache-beam-testing.
<https://builds.apache.org/job/beam_PostCommit_Python3_Verify/ws/src/sdks/python/apache_beam/io/gcp/bigquery.py>:1140: BeamDeprecationWarning: options is deprecated since First stable release. References to <pipeline>.options will not be supported
method_to_use = self._compute_method(p, p.options)
<https://builds.apache.org/job/beam_PostCommit_Python3_Verify/ws/src/sdks/python/apache_beam/runners/dataflow/dataflow_runner.py>:686: BeamDeprecationWarning: BigQuerySink is deprecated since 2.11.0. Use WriteToBigQuery instead.
Found: https://console.cloud.google.com/dataflow/jobsDetail/locations/us-central1/jobs/2019-07-19_11_29_05-13184729600320084665?project=apache-beam-testing.
kms_key=transform.kms_key))
Found: https://console.cloud.google.com/dataflow/jobsDetail/locations/us-central1/jobs/2019-07-19_11_39_38-6693521092125853325?project=apache-beam-testing.
Found: https://console.cloud.google.com/dataflow/jobsDetail/locations/us-central1/jobs/2019-07-19_11_49_37-16021020219857477598?project=apache-beam-testing.
Found: https://console.cloud.google.com/dataflow/jobsDetail/locations/us-central1/jobs/2019-07-19_11_07_10-5241912996140734875?project=apache-beam-testing.
Found: https://console.cloud.google.com/dataflow/jobsDetail/locations/us-central1/jobs/2019-07-19_11_29_43-7521715139112070907?project=apache-beam-testing.
Found: https://console.cloud.google.com/dataflow/jobsDetail/locations/us-central1/jobs/2019-07-19_11_40_10-5457430942681638502?project=apache-beam-testing.
Found: https://console.cloud.google.com/dataflow/jobsDetail/locations/us-central1/jobs/2019-07-19_11_07_07-17080727798910362275?project=apache-beam-testing.
Found: https://console.cloud.google.com/dataflow/jobsDetail/locations/us-central1/jobs/2019-07-19_11_16_04-15535657195903370640?project=apache-beam-testing.
Found: https://console.cloud.google.com/dataflow/jobsDetail/locations/us-central1/jobs/2019-07-19_11_25_56-2171703314687692133?project=apache-beam-testing.
Found: https://console.cloud.google.com/dataflow/jobsDetail/locations/us-central1/jobs/2019-07-19_11_34_54-18243261383975232992?project=apache-beam-testing.
<https://builds.apache.org/job/beam_PostCommit_Python3_Verify/ws/src/sdks/python/apache_beam/runners/dataflow/dataflow_runner.py>:686: BeamDeprecationWarning: BigQuerySink is deprecated since 2.11.0. Use WriteToBigQuery instead.
kms_key=transform.kms_key))
<https://builds.apache.org/job/beam_PostCommit_Python3_Verify/ws/src/sdks/python/apache_beam/io/gcp/bigquery_test.py>:565: BeamDeprecationWarning: options is deprecated since First stable release. References to <pipeline>.options will not be supported
streaming = self.test_pipeline.options.view_as(StandardOptions).streaming
<https://builds.apache.org/job/beam_PostCommit_Python3_Verify/ws/src/sdks/python/apache_beam/io/gcp/bigquery.py>:1140: BeamDeprecationWarning: options is deprecated since First stable release. References to <pipeline>.options will not be supported
method_to_use = self._compute_method(p, p.options)
<https://builds.apache.org/job/beam_PostCommit_Python3_Verify/ws/src/sdks/python/apache_beam/io/gcp/bigquery_file_loads.py>:557: BeamDeprecationWarning: options is deprecated since First stable release. References to <pipeline>.options will not be supported
temp_location = p.options.view_as(GoogleCloudOptions).temp_location
Found: https://console.cloud.google.com/dataflow/jobsDetail/locations/us-central1/jobs/2019-07-19_11_07_09-2382545243504149747?project=apache-beam-testing.
Found: https://console.cloud.google.com/dataflow/jobsDetail/locations/us-central1/jobs/2019-07-19_11_19_07-10595178089277620723?project=apache-beam-testing.
Found: https://console.cloud.google.com/dataflow/jobsDetail/locations/us-central1/jobs/2019-07-19_11_28_58-6417825384003534461?project=apache-beam-testing.
Found: https://console.cloud.google.com/dataflow/jobsDetail/locations/us-central1/jobs/2019-07-19_11_39_36-18016822667361723526?project=apache-beam-testing.
<https://builds.apache.org/job/beam_PostCommit_Python3_Verify/ws/src/sdks/python/apache_beam/io/gcp/bigquery.py>:1140: BeamDeprecationWarning: options is deprecated since First stable release. References to <pipeline>.options will not be supported
method_to_use = self._compute_method(p, p.options)
Found: https://console.cloud.google.com/dataflow/jobsDetail/locations/us-central1/jobs/2019-07-19_11_50_03-13556753221133076708?project=apache-beam-testing.
<https://builds.apache.org/job/beam_PostCommit_Python3_Verify/ws/src/sdks/python/apache_beam/io/gcp/bigquery_file_loads.py>:557: BeamDeprecationWarning: options is deprecated since First stable release. References to <pipeline>.options will not be supported
temp_location = p.options.view_as(GoogleCloudOptions).temp_location
Found: https://console.cloud.google.com/dataflow/jobsDetail/locations/us-central1/jobs/2019-07-19_11_07_12-12628749094801949578?project=apache-beam-testing.
Found: https://console.cloud.google.com/dataflow/jobsDetail/locations/us-central1/jobs/2019-07-19_11_17_00-4637318051634172937?project=apache-beam-testing.
Found: https://console.cloud.google.com/dataflow/jobsDetail/locations/us-central1/jobs/2019-07-19_11_24_26-4592912617218794542?project=apache-beam-testing.
Found: https://console.cloud.google.com/dataflow/jobsDetail/locations/us-central1/jobs/2019-07-19_11_33_34-14107347325518189237?project=apache-beam-testing.
Found: https://console.cloud.google.com/dataflow/jobsDetail/locations/us-central1/jobs/2019-07-19_11_44_06-16453198703564066876?project=apache-beam-testing.
Found: https://console.cloud.google.com/dataflow/jobsDetail/locations/us-central1/jobs/2019-07-19_11_53_52-8005276988541753836?project=apache-beam-testing.
Found: https://console.cloud.google.com/dataflow/jobsDetail/locations/us-central1/jobs/2019-07-19_11_07_11-2557666780643860259?project=apache-beam-testing.
Found: https://console.cloud.google.com/dataflow/jobsDetail/locations/us-central1/jobs/2019-07-19_11_17_13-13540166796984249502?project=apache-beam-testing.
Found: https://console.cloud.google.com/dataflow/jobsDetail/locations/us-central1/jobs/2019-07-19_11_26_11-9140842965233608636?project=apache-beam-testing.
Found: https://console.cloud.google.com/dataflow/jobsDetail/locations/us-central1/jobs/2019-07-19_11_35_18-416145120568536515?project=apache-beam-testing.
<https://builds.apache.org/job/beam_PostCommit_Python3_Verify/ws/src/sdks/python/apache_beam/runners/dataflow/dataflow_runner.py>:686: BeamDeprecationWarning: BigQuerySink is deprecated since 2.11.0. Use WriteToBigQuery instead.
Found: https://console.cloud.google.com/dataflow/jobsDetail/locations/us-central1/jobs/2019-07-19_11_45_20-8733415094180624400?project=apache-beam-testing.
kms_key=transform.kms_key))
<https://builds.apache.org/job/beam_PostCommit_Python3_Verify/ws/src/sdks/python/apache_beam/io/gcp/big_query_query_to_table_pipeline.py>:73: BeamDeprecationWarning: BigQuerySink is deprecated since 2.11.0. Use WriteToBigQuery instead.
kms_key=kms_key))
test_datastore_wordcount_it (apache_beam.examples.cookbook.datastore_wordcount_it_test.DatastoreWordCountIT) ... SKIP: This test still needs to be fixed on Python 3TODO: BEAM-4543
test_avro_it (apache_beam.examples.fastavro_it_test.FastavroIT) ... SKIP: Due to a known issue in avro-python3 package, thistest is skipped until BEAM-6522 is addressed.
test_bigquery_tornadoes_it (apache_beam.examples.cookbook.bigquery_tornadoes_it_test.BigqueryTornadoesIT) ... ok
test_streaming_wordcount_it (apache_beam.examples.streaming_wordcount_it_test.StreamingWordCountIT) ... ok
test_wordcount_fnapi_it (apache_beam.examples.wordcount_it_test.WordCountIT) ... ok
test_autocomplete_it (apache_beam.examples.complete.autocomplete_test.AutocompleteTest) ... ok
test_leader_board_it (apache_beam.examples.complete.game.leader_board_it_test.LeaderBoardIT) ... ok
test_game_stats_it (apache_beam.examples.complete.game.game_stats_it_test.GameStatsIT) ... ok
test_wordcount_it (apache_beam.examples.wordcount_it_test.WordCountIT) ... ok
test_bigquery_read_1M_python (apache_beam.io.gcp.bigquery_io_read_it_test.BigqueryIOReadIT) ... ok
test_user_score_it (apache_beam.examples.complete.game.user_score_it_test.UserScoreIT) ... ok
test_datastore_write_limit (apache_beam.io.gcp.datastore_write_it_test.DatastoreWriteIT) ... SKIP: This test still needs to be fixed on Python 3TODO: BEAM-4543
test_copy (apache_beam.io.gcp.gcsio_integration_test.GcsIOIntegrationTest) ... ok
test_copy_batch (apache_beam.io.gcp.gcsio_integration_test.GcsIOIntegrationTest) ... ok
test_copy_batch_kms (apache_beam.io.gcp.gcsio_integration_test.GcsIOIntegrationTest) ... ok
test_copy_batch_rewrite_token (apache_beam.io.gcp.gcsio_integration_test.GcsIOIntegrationTest) ... ok
test_copy_kms (apache_beam.io.gcp.gcsio_integration_test.GcsIOIntegrationTest) ... ok
test_copy_rewrite_token (apache_beam.io.gcp.gcsio_integration_test.GcsIOIntegrationTest) ... ok
test_hourly_team_score_it (apache_beam.examples.complete.game.hourly_team_score_it_test.HourlyTeamScoreIT) ... ok
test_big_query_read (apache_beam.io.gcp.bigquery_read_it_test.BigQueryReadIntegrationTests) ... ok
test_big_query_read_new_types (apache_beam.io.gcp.bigquery_read_it_test.BigQueryReadIntegrationTests) ... ok
test_multiple_destinations_transform (apache_beam.io.gcp.bigquery_file_loads_test.BigQueryFileLoadsIT) ... ok
test_one_job_fails_all_jobs_fail (apache_beam.io.gcp.bigquery_file_loads_test.BigQueryFileLoadsIT) ... ok
test_transform_on_gcs (apache_beam.io.fileio_test.MatchIntegrationTest) ... ok
test_multiple_destinations_transform (apache_beam.io.gcp.bigquery_test.BigQueryStreamingInsertTransformIntegrationTests) ... ok
test_value_provider_transform (apache_beam.io.gcp.bigquery_test.BigQueryStreamingInsertTransformIntegrationTests) ... ok
test_streaming_data_only (apache_beam.io.gcp.pubsub_integration_test.PubSubIntegrationTest) ... ok
test_streaming_with_attributes (apache_beam.io.gcp.pubsub_integration_test.PubSubIntegrationTest) ... ok
test_job_python_from_python_it (apache_beam.transforms.external_test_it.ExternalTransformIT) ... ok
test_parquetio_it (apache_beam.io.parquetio_it_test.TestParquetIT) ... ok
test_big_query_legacy_sql (apache_beam.io.gcp.big_query_query_to_table_it_test.BigQueryQueryToTableIT) ... ok
test_big_query_new_types (apache_beam.io.gcp.big_query_query_to_table_it_test.BigQueryQueryToTableIT) ... ok
test_big_query_standard_sql (apache_beam.io.gcp.big_query_query_to_table_it_test.BigQueryQueryToTableIT) ... ok
test_big_query_standard_sql_kms_key_native (apache_beam.io.gcp.big_query_query_to_table_it_test.BigQueryQueryToTableIT) ... ok
test_big_query_write (apache_beam.io.gcp.bigquery_write_it_test.BigQueryWriteIntegrationTests) ... ok
test_big_query_write_new_types (apache_beam.io.gcp.bigquery_write_it_test.BigQueryWriteIntegrationTests) ... ok
test_big_query_write_schema_autodetect (apache_beam.io.gcp.bigquery_write_it_test.BigQueryWriteIntegrationTests) ... SKIP: DataflowRunner does not support schema autodetection
test_big_query_write_without_schema (apache_beam.io.gcp.bigquery_write_it_test.BigQueryWriteIntegrationTests) ... ok
test_metrics_fnapi_it (apache_beam.runners.dataflow.dataflow_exercise_metrics_pipeline_test.ExerciseMetricsPipelineTest) ... ok
test_metrics_it (apache_beam.runners.dataflow.dataflow_exercise_metrics_pipeline_test.ExerciseMetricsPipelineTest) ... ok
test_datastore_write_limit (apache_beam.io.gcp.datastore.v1new.datastore_write_it_test.DatastoreWriteIT) ... ok
----------------------------------------------------------------------
XML: nosetests-postCommitIT-df-py37.xml
----------------------------------------------------------------------
XML: <https://builds.apache.org/job/beam_PostCommit_Python3_Verify/ws/src/sdks/python/nosetests.xml>
----------------------------------------------------------------------
Ran 41 tests in 3443.408s
OK (SKIP=4)
> Task :sdks:python:test-suites:dataflow:py36:postCommitIT
Found: https://console.cloud.google.com/dataflow/jobsDetail/locations/us-central1/jobs/2019-07-19_11_07_11-7581735325491046738?project=apache-beam-testing.
<https://builds.apache.org/job/beam_PostCommit_Python3_Verify/ws/src/sdks/python/apache_beam/io/gcp/bigquery.py>:1140: BeamDeprecationWarning: options is deprecated since First stable release. References to <pipeline>.options will not be supported
method_to_use = self._compute_method(p, p.options)
Found: https://console.cloud.google.com/dataflow/jobsDetail/locations/us-central1/jobs/2019-07-19_11_22_38-1554268256709607553?project=apache-beam-testing.
Found: https://console.cloud.google.com/dataflow/jobsDetail/locations/us-central1/jobs/2019-07-19_11_32_15-9346281032698001457?project=apache-beam-testing.
Found: https://console.cloud.google.com/dataflow/jobsDetail/locations/us-central1/jobs/2019-07-19_11_42_09-15141256595231444651?project=apache-beam-testing.
Found: https://console.cloud.google.com/dataflow/jobsDetail/locations/us-central1/jobs/2019-07-19_11_07_06-9067569347135479865?project=apache-beam-testing.
<https://builds.apache.org/job/beam_PostCommit_Python3_Verify/ws/src/sdks/python/apache_beam/runners/dataflow/dataflow_runner.py>:686: BeamDeprecationWarning: BigQuerySink is deprecated since 2.11.0. Use WriteToBigQuery instead.
Found: https://console.cloud.google.com/dataflow/jobsDetail/locations/us-central1/jobs/2019-07-19_11_29_53-3620607262163387861?project=apache-beam-testing.
Found: https://console.cloud.google.com/dataflow/jobsDetail/locations/us-central1/jobs/2019-07-19_11_40_29-8973431367093402606?project=apache-beam-testing.
kms_key=transform.kms_key))
Found: https://console.cloud.google.com/dataflow/jobsDetail/locations/us-central1/jobs/2019-07-19_11_50_04-6276543197014754147?project=apache-beam-testing.
<https://builds.apache.org/job/beam_PostCommit_Python3_Verify/ws/src/sdks/python/apache_beam/io/fileio_test.py>:232: FutureWarning: MatchAll is experimental.
| 'GetPath' >> beam.Map(lambda metadata: metadata.path))
<https://builds.apache.org/job/beam_PostCommit_Python3_Verify/ws/src/sdks/python/apache_beam/io/fileio_test.py>:243: FutureWarning: MatchAll is experimental.
| 'Checksums' >> beam.Map(compute_hash))
<https://builds.apache.org/job/beam_PostCommit_Python3_Verify/ws/src/sdks/python/apache_beam/io/fileio_test.py>:243: FutureWarning: ReadMatches is experimental.
| 'Checksums' >> beam.Map(compute_hash))
Found: https://console.cloud.google.com/dataflow/jobsDetail/locations/us-central1/jobs/2019-07-19_11_07_10-567812511312021280?project=apache-beam-testing.
Found: https://console.cloud.google.com/dataflow/jobsDetail/locations/us-central1/jobs/2019-07-19_11_20_37-16241219480390852919?project=apache-beam-testing.
Found: https://console.cloud.google.com/dataflow/jobsDetail/locations/us-central1/jobs/2019-07-19_11_29_15-14623328442653675828?project=apache-beam-testing.
Found: https://console.cloud.google.com/dataflow/jobsDetail/locations/us-central1/jobs/2019-07-19_11_38_33-7947912387941343953?project=apache-beam-testing.
<https://builds.apache.org/job/beam_PostCommit_Python3_Verify/ws/src/sdks/python/apache_beam/io/gcp/bigquery.py>:1140: BeamDeprecationWarning: options is deprecated since First stable release. References to <pipeline>.options will not be supported
method_to_use = self._compute_method(p, p.options)
Found: https://console.cloud.google.com/dataflow/jobsDetail/locations/us-central1/jobs/2019-07-19_11_07_07-4886685024281119605?project=apache-beam-testing.
<https://builds.apache.org/job/beam_PostCommit_Python3_Verify/ws/src/sdks/python/apache_beam/io/gcp/bigquery_test.py>:565: BeamDeprecationWarning: options is deprecated since First stable release. References to <pipeline>.options will not be supported
Found: https://console.cloud.google.com/dataflow/jobsDetail/locations/us-central1/jobs/2019-07-19_11_16_03-5983058320185702586?project=apache-beam-testing.
streaming = self.test_pipeline.options.view_as(StandardOptions).streaming
Found: https://console.cloud.google.com/dataflow/jobsDetail/locations/us-central1/jobs/2019-07-19_11_25_50-14911878915059524353?project=apache-beam-testing.
<https://builds.apache.org/job/beam_PostCommit_Python3_Verify/ws/src/sdks/python/apache_beam/io/gcp/bigquery.py>:1140: BeamDeprecationWarning: options is deprecated since First stable release. References to <pipeline>.options will not be supported
Found: https://console.cloud.google.com/dataflow/jobsDetail/locations/us-central1/jobs/2019-07-19_11_34_54-14745827965952981065?project=apache-beam-testing.
method_to_use = self._compute_method(p, p.options)
<https://builds.apache.org/job/beam_PostCommit_Python3_Verify/ws/src/sdks/python/apache_beam/io/gcp/bigquery_file_loads.py>:557: BeamDeprecationWarning: options is deprecated since First stable release. References to <pipeline>.options will not be supported
temp_location = p.options.view_as(GoogleCloudOptions).temp_location
Found: https://console.cloud.google.com/dataflow/jobsDetail/locations/us-central1/jobs/2019-07-19_11_07_07-5156235581358927914?project=apache-beam-testing.
<https://builds.apache.org/job/beam_PostCommit_Python3_Verify/ws/src/sdks/python/apache_beam/runners/dataflow/dataflow_runner.py>:686: BeamDeprecationWarning: BigQuerySink is deprecated since 2.11.0. Use WriteToBigQuery instead.
Found: https://console.cloud.google.com/dataflow/jobsDetail/locations/us-central1/jobs/2019-07-19_11_28_34-2988684771243418241?project=apache-beam-testing.
Found: https://console.cloud.google.com/dataflow/jobsDetail/locations/us-central1/jobs/2019-07-19_11_38_35-11781083905390790635?project=apache-beam-testing.
kms_key=transform.kms_key))
Found: https://console.cloud.google.com/dataflow/jobsDetail/locations/us-central1/jobs/2019-07-19_11_48_32-1262545895771251885?project=apache-beam-testing.
Found: https://console.cloud.google.com/dataflow/jobsDetail/locations/us-central1/jobs/2019-07-19_11_07_06-5765796289066142951?project=apache-beam-testing.
<https://builds.apache.org/job/beam_PostCommit_Python3_Verify/ws/src/sdks/python/apache_beam/runners/dataflow/dataflow_runner.py>:686: BeamDeprecationWarning: BigQuerySink is deprecated since 2.11.0. Use WriteToBigQuery instead.
kms_key=transform.kms_key))
Found: https://console.cloud.google.com/dataflow/jobsDetail/locations/us-central1/jobs/2019-07-19_11_16_57-14997878043738579350?project=apache-beam-testing.
Found: https://console.cloud.google.com/dataflow/jobsDetail/locations/us-central1/jobs/2019-07-19_11_24_34-14166816368798711013?project=apache-beam-testing.
Found: https://console.cloud.google.com/dataflow/jobsDetail/locations/us-central1/jobs/2019-07-19_11_32_50-12724843282557673100?project=apache-beam-testing.
Found: https://console.cloud.google.com/dataflow/jobsDetail/locations/us-central1/jobs/2019-07-19_11_42_41-1772934344140646405?project=apache-beam-testing.
<https://builds.apache.org/job/beam_PostCommit_Python3_Verify/ws/src/sdks/python/apache_beam/io/gcp/big_query_query_to_table_pipeline.py>:73: BeamDeprecationWarning: BigQuerySink is deprecated since 2.11.0. Use WriteToBigQuery instead.
kms_key=kms_key))
Found: https://console.cloud.google.com/dataflow/jobsDetail/locations/us-central1/jobs/2019-07-19_11_07_10-9048952774534594857?project=apache-beam-testing.
Found: https://console.cloud.google.com/dataflow/jobsDetail/locations/us-central1/jobs/2019-07-19_11_16_50-17116475485529129647?project=apache-beam-testing.
Found: https://console.cloud.google.com/dataflow/jobsDetail/locations/us-central1/jobs/2019-07-19_11_25_10-9258981273600306652?project=apache-beam-testing.
Found: https://console.cloud.google.com/dataflow/jobsDetail/locations/us-central1/jobs/2019-07-19_11_34_50-3693466761181796738?project=apache-beam-testing.
Found: https://console.cloud.google.com/dataflow/jobsDetail/locations/us-central1/jobs/2019-07-19_11_45_36-11611065165210805138?project=apache-beam-testing.
Found: https://console.cloud.google.com/dataflow/jobsDetail/locations/us-central1/jobs/2019-07-19_11_55_13-17981814163205267316?project=apache-beam-testing.
Found: https://console.cloud.google.com/dataflow/jobsDetail/locations/us-central1/jobs/2019-07-19_11_07_13-1588723786248506901?project=apache-beam-testing.
Found: https://console.cloud.google.com/dataflow/jobsDetail/locations/us-central1/jobs/2019-07-19_11_17_01-3119955900699268458?project=apache-beam-testing.
Found: https://console.cloud.google.com/dataflow/jobsDetail/locations/us-central1/jobs/2019-07-19_11_26_08-5912800645770171635?project=apache-beam-testing.
Found: https://console.cloud.google.com/dataflow/jobsDetail/locations/us-central1/jobs/2019-07-19_11_36_21-15754808581944465608?project=apache-beam-testing.
<https://builds.apache.org/job/beam_PostCommit_Python3_Verify/ws/src/sdks/python/apache_beam/io/gcp/bigquery.py>:1140: BeamDeprecationWarning: options is deprecated since First stable release. References to <pipeline>.options will not be supported
method_to_use = self._compute_method(p, p.options)
<https://builds.apache.org/job/beam_PostCommit_Python3_Verify/ws/src/sdks/python/apache_beam/io/gcp/bigquery_file_loads.py>:557: BeamDeprecationWarning: options is deprecated since First stable release. References to <pipeline>.options will not be supported
temp_location = p.options.view_as(GoogleCloudOptions).temp_location
test_datastore_wordcount_it (apache_beam.examples.cookbook.datastore_wordcount_it_test.DatastoreWordCountIT) ... SKIP: This test still needs to be fixed on Python 3TODO: BEAM-4543
test_avro_it (apache_beam.examples.fastavro_it_test.FastavroIT) ... SKIP: Due to a known issue in avro-python3 package, thistest is skipped until BEAM-6522 is addressed.
test_autocomplete_it (apache_beam.examples.complete.autocomplete_test.AutocompleteTest) ... ok
test_streaming_wordcount_it (apache_beam.examples.streaming_wordcount_it_test.StreamingWordCountIT) ... ok
test_bigquery_tornadoes_it (apache_beam.examples.cookbook.bigquery_tornadoes_it_test.BigqueryTornadoesIT) ... ok
test_wordcount_fnapi_it (apache_beam.examples.wordcount_it_test.WordCountIT) ... ok
test_leader_board_it (apache_beam.examples.complete.game.leader_board_it_test.LeaderBoardIT) ... ok
test_game_stats_it (apache_beam.examples.complete.game.game_stats_it_test.GameStatsIT) ... ok
test_wordcount_it (apache_beam.examples.wordcount_it_test.WordCountIT) ... ok
test_user_score_it (apache_beam.examples.complete.game.user_score_it_test.UserScoreIT) ... ok
test_hourly_team_score_it (apache_beam.examples.complete.game.hourly_team_score_it_test.HourlyTeamScoreIT) ... ok
test_datastore_write_limit (apache_beam.io.gcp.datastore_write_it_test.DatastoreWriteIT) ... SKIP: This test still needs to be fixed on Python 3TODO: BEAM-4543
test_bigquery_read_1M_python (apache_beam.io.gcp.bigquery_io_read_it_test.BigqueryIOReadIT) ... ok
test_copy (apache_beam.io.gcp.gcsio_integration_test.GcsIOIntegrationTest) ... ok
test_copy_batch (apache_beam.io.gcp.gcsio_integration_test.GcsIOIntegrationTest) ... ok
test_copy_batch_kms (apache_beam.io.gcp.gcsio_integration_test.GcsIOIntegrationTest) ... ok
test_copy_batch_rewrite_token (apache_beam.io.gcp.gcsio_integration_test.GcsIOIntegrationTest) ... ok
test_copy_kms (apache_beam.io.gcp.gcsio_integration_test.GcsIOIntegrationTest) ... ok
test_copy_rewrite_token (apache_beam.io.gcp.gcsio_integration_test.GcsIOIntegrationTest) ... ok
test_multiple_destinations_transform (apache_beam.io.gcp.bigquery_file_loads_test.BigQueryFileLoadsIT) ... ok
test_one_job_fails_all_jobs_fail (apache_beam.io.gcp.bigquery_file_loads_test.BigQueryFileLoadsIT) ... ok
test_transform_on_gcs (apache_beam.io.fileio_test.MatchIntegrationTest) ... ok
test_big_query_read (apache_beam.io.gcp.bigquery_read_it_test.BigQueryReadIntegrationTests) ... ok
test_big_query_read_new_types (apache_beam.io.gcp.bigquery_read_it_test.BigQueryReadIntegrationTests) ... ok
test_multiple_destinations_transform (apache_beam.io.gcp.bigquery_test.BigQueryStreamingInsertTransformIntegrationTests) ... ok
test_value_provider_transform (apache_beam.io.gcp.bigquery_test.BigQueryStreamingInsertTransformIntegrationTests) ... ok
test_streaming_data_only (apache_beam.io.gcp.pubsub_integration_test.PubSubIntegrationTest) ... ok
test_streaming_with_attributes (apache_beam.io.gcp.pubsub_integration_test.PubSubIntegrationTest) ... ok
test_parquetio_it (apache_beam.io.parquetio_it_test.TestParquetIT) ... ok
test_job_python_from_python_it (apache_beam.transforms.external_test_it.ExternalTransformIT) ... ok
test_big_query_legacy_sql (apache_beam.io.gcp.big_query_query_to_table_it_test.BigQueryQueryToTableIT) ... ok
test_big_query_new_types (apache_beam.io.gcp.big_query_query_to_table_it_test.BigQueryQueryToTableIT) ... ok
test_big_query_standard_sql (apache_beam.io.gcp.big_query_query_to_table_it_test.BigQueryQueryToTableIT) ... ok
test_big_query_standard_sql_kms_key_native (apache_beam.io.gcp.big_query_query_to_table_it_test.BigQueryQueryToTableIT) ... ok
test_big_query_write (apache_beam.io.gcp.bigquery_write_it_test.BigQueryWriteIntegrationTests) ... ok
test_big_query_write_new_types (apache_beam.io.gcp.bigquery_write_it_test.BigQueryWriteIntegrationTests) ... ok
test_big_query_write_schema_autodetect (apache_beam.io.gcp.bigquery_write_it_test.BigQueryWriteIntegrationTests) ... SKIP: DataflowRunner does not support schema autodetection
test_big_query_write_without_schema (apache_beam.io.gcp.bigquery_write_it_test.BigQueryWriteIntegrationTests) ... ok
test_metrics_fnapi_it (apache_beam.runners.dataflow.dataflow_exercise_metrics_pipeline_test.ExerciseMetricsPipelineTest) ... ok
test_metrics_it (apache_beam.runners.dataflow.dataflow_exercise_metrics_pipeline_test.ExerciseMetricsPipelineTest) ... ok
test_datastore_write_limit (apache_beam.io.gcp.datastore.v1new.datastore_write_it_test.DatastoreWriteIT) ... ok
----------------------------------------------------------------------
XML: nosetests-postCommitIT-df-py36.xml
----------------------------------------------------------------------
XML: <https://builds.apache.org/job/beam_PostCommit_Python3_Verify/ws/src/sdks/python/nosetests.xml>
----------------------------------------------------------------------
Ran 41 tests in 3549.840s
OK (SKIP=4)
FAILURE: Build failed with an exception.
* Where:
Build file '<https://builds.apache.org/job/beam_PostCommit_Python3_Verify/ws/src/sdks/python/test-suites/dataflow/py35/build.gradle'> line: 49
* What went wrong:
Execution failed for task ':sdks:python:test-suites:dataflow:py35:postCommitIT'.
> Process 'command 'sh'' finished with non-zero exit value 1
* Try:
Run with --stacktrace option to get the stack trace. Run with --info or --debug option to get more log output. Run with --scan to get full insights.
* Get more help at https://help.gradle.org
Deprecated Gradle features were used in this build, making it incompatible with Gradle 6.0.
Use '--warning-mode all' to show the individual deprecation warnings.
See https://docs.gradle.org/5.2.1/userguide/command_line_interface.html#sec:command_line_warnings
BUILD FAILED in 1h 0m 25s
78 actionable tasks: 61 executed, 17 from cache
Publishing build scan...
https://gradle.com/s/baztqxenkqhvw
Build step 'Invoke Gradle script' changed build result to FAILURE
Build step 'Invoke Gradle script' marked build as failure
---------------------------------------------------------------------
To unsubscribe, e-mail: builds-unsubscribe@beam.apache.org
For additional commands, e-mail: builds-help@beam.apache.org
Build failed in Jenkins: beam_PostCommit_Python3_Verify #1401
Posted by Apache Jenkins Server <je...@builds.apache.org>.
See <https://builds.apache.org/job/beam_PostCommit_Python3_Verify/1401/display/redirect?page=changes>
Changes:
[valentyn] Split Python 3 Postcommits into several jobs
------------------------------------------
Started by GitHub push by udim
[EnvInject] - Loading node environment variables.
Building remotely on apache-beam-jenkins-13 (beam) in workspace <https://builds.apache.org/job/beam_PostCommit_Python3_Verify/ws/>
No credentials specified
> git rev-parse --is-inside-work-tree # timeout=10
Fetching changes from the remote Git repository
> git config remote.origin.url https://github.com/apache/beam.git # timeout=10
Fetching upstream changes from https://github.com/apache/beam.git
> git --version # timeout=10
> git fetch --tags --progress https://github.com/apache/beam.git +refs/heads/*:refs/remotes/origin/* +refs/pull/${ghprbPullId}/*:refs/remotes/origin/pr/${ghprbPullId}/*
> git rev-parse origin/master^{commit} # timeout=10
Checking out Revision 2bbf6eb1f65f49625d2f17b2703ec1e774f8c85f (origin/master)
> git config core.sparsecheckout # timeout=10
> git checkout -f 2bbf6eb1f65f49625d2f17b2703ec1e774f8c85f
Commit message: "Merge pull request #9093: [BEAM-7714] [BEAM-7257] Split Python 3 postcommits into several Jenkins jobs."
> git rev-list --no-walk 9589835073cd0908a47c4c0c50b8a17925a300e9 # timeout=10
Cleaning workspace
> git rev-parse --verify HEAD # timeout=10
Resetting working tree
> git reset --hard # timeout=10
> git clean -fdx # timeout=10
No emails were triggered.
[EnvInject] - Executing scripts and injecting environment variables after the SCM step.
[EnvInject] - Injecting as environment variables the properties content
SPARK_LOCAL_IP=127.0.0.1
[EnvInject] - Variables injected successfully.
[Gradle] - Launching build.
[src] $ <https://builds.apache.org/job/beam_PostCommit_Python3_Verify/ws/src/gradlew> --continue --max-workers=12 -Dorg.gradle.jvmargs=-Xms2g -Dorg.gradle.jvmargs=-Xmx4g :python3PostCommit
Starting a Gradle Daemon, 1 busy Daemon could not be reused, use --status for details
> Task :buildSrc:compileJava NO-SOURCE
> Task :buildSrc:compileGroovy FROM-CACHE
> Task :buildSrc:pluginDescriptors
> Task :buildSrc:processResources
> Task :buildSrc:classes
> Task :buildSrc:jar
> Task :buildSrc:assemble
> Task :buildSrc:spotlessGroovy
> Task :buildSrc:spotlessGroovyCheck
> Task :buildSrc:spotlessGroovyGradle
> Task :buildSrc:spotlessGroovyGradleCheck
> Task :buildSrc:spotlessCheck
> Task :buildSrc:pluginUnderTestMetadata
> Task :buildSrc:compileTestJava NO-SOURCE
> Task :buildSrc:compileTestGroovy NO-SOURCE
> Task :buildSrc:processTestResources NO-SOURCE
> Task :buildSrc:testClasses UP-TO-DATE
> Task :buildSrc:test NO-SOURCE
> Task :buildSrc:validateTaskProperties FROM-CACHE
> Task :buildSrc:check
> Task :buildSrc:build
Configuration on demand is an incubating feature.
FAILURE: Build failed with an exception.
* What went wrong:
Task 'python3PostCommit' not found in root project 'beam'. Some candidates are: 'python2PostCommit', 'python35PostCommit', 'python36PostCommit', 'python37PostCommit'.
* Try:
Run gradlew_orig tasks to get a list of available tasks. Run with --stacktrace option to get the stack trace. Run with --info or --debug option to get more log output. Run with --scan to get full insights.
* Get more help at https://help.gradle.org
Deprecated Gradle features were used in this build, making it incompatible with Gradle 6.0.
Use '--warning-mode all' to show the individual deprecation warnings.
See https://docs.gradle.org/5.2.1/userguide/command_line_interface.html#sec:command_line_warnings
BUILD FAILED in 10s
Publishing build scan...
https://gradle.com/s/ld4dqbn5i7c44
Build step 'Invoke Gradle script' changed build result to FAILURE
Build step 'Invoke Gradle script' marked build as failure
---------------------------------------------------------------------
To unsubscribe, e-mail: builds-unsubscribe@beam.apache.org
For additional commands, e-mail: builds-help@beam.apache.org