You are viewing a plain text version of this content. The canonical link for it is here.
Posted to notifications@archiva.apache.org by Continuum VMBuild Server <co...@apache.org> on 2008/04/27 18:40:26 UTC
[continuum] BUILD FAILURE: Archiva Web :: RSS
Online report : http://vmbuild.apache.org/continuum/buildResult.action?buildId=81414&projectId=704
Build statistics:
State: Failed
Previous State: Error
Started at: Sun 27 Apr 2008 09:39:54 -0700
Finished at: Sun 27 Apr 2008 09:40:11 -0700
Total time: 17s
Build Trigger: Schedule
Build Number: 32
Exit code: 1
Building machine hostname: vmbuild.apache.org
Operating system : Linux(unknown)
Java Home version :
java version "1.5.0_12"
Java(TM) 2 Runtime Environment, Standard Edition (build 1.5.0_12-b04)
Java HotSpot(TM) Client VM (build 1.5.0_12-b04, mixed mode, sharing)
Builder version :
Maven version: 2.0.8
Java version: 1.5.0_12
OS name: "linux" version: "2.6.20-16-server" arch: "i386" Family: "unix"
****************************************************************************
SCM Changes:
****************************************************************************
Changed: oching @ Sun 27 Apr 2008 07:04:28 -0700
Comment: [MRM-773]
-get feed contents from the database
-generate the feed without writing to a file
Files changed:
/archiva/trunk/archiva-modules/archiva-web/archiva-rss/pom.xml ( 651956 )
/archiva/trunk/archiva-modules/archiva-web/archiva-rss/src/main/java/org/apache/archiva/rss/RssFeedEntry.java ( 651956 )
/archiva/trunk/archiva-modules/archiva-web/archiva-rss/src/main/java/org/apache/archiva/rss/RssFeedGenerator.java ( 651956 )
/archiva/trunk/archiva-modules/archiva-web/archiva-rss/src/main/java/org/apache/archiva/rss/processor/AbstractArtifactsRssFeedProcessor.java ( 651956 )
/archiva/trunk/archiva-modules/archiva-web/archiva-rss/src/main/java/org/apache/archiva/rss/processor/NewArtifactsRssFeedProcessor.java ( 651956 )
/archiva/trunk/archiva-modules/archiva-web/archiva-rss/src/main/java/org/apache/archiva/rss/processor/NewVersionsOfArtifactRssFeedProcessor.java ( 651956 )
/archiva/trunk/archiva-modules/archiva-web/archiva-rss/src/main/java/org/apache/archiva/rss/processor/RssFeedProcessor.java ( 651956 )
/archiva/trunk/archiva-modules/archiva-web/archiva-rss/src/test/java/org/apache/archiva/rss/RssFeedGeneratorTest.java ( 651956 )
/archiva/trunk/archiva-modules/archiva-web/archiva-rss/src/test/java/org/apache/archiva/rss/processor/NewArtifactsRssFeedProcessorTest.java ( 651956 )
/archiva/trunk/archiva-modules/archiva-web/archiva-rss/src/test/java/org/apache/archiva/rss/processor/NewVersionsOfArtifactRssFeedProcessorTest.java ( 651956 )
/archiva/trunk/archiva-modules/archiva-web/archiva-rss/src/test/java/org/apache/archiva/rss/stubs ( 651956 )
/archiva/trunk/archiva-modules/archiva-web/archiva-rss/src/test/java/org/apache/archiva/rss/stubs/ArtifactDAOStub.java ( 651956 )
****************************************************************************
Dependencies Changes:
****************************************************************************
org.apache.archiva:archiva-model:1.1-SNAPSHOT
org.apache.archiva:archiva-web:1.1-SNAPSHOT
****************************************************************************
Build Defintion:
****************************************************************************
POM filename: pom.xml
Goals: clean install
Arguments: --batch-mode --non-recursive
Build Fresh: false
Always Build: false
Default Build Definition: true
Schedule: DEFAULT_SCHEDULE
Profile Name: Maven 2.0.8, Java 5
Description:
****************************************************************************
Test Summary:
****************************************************************************
Tests: 0
Failures: 0
Total time: 0
****************************************************************************
Output:
****************************************************************************
[INFO] Scanning for projects...
[INFO] ------------------------------------------------------------------------
[INFO] Building Archiva Web :: RSS
[INFO] task-segment: [clean, install]
[INFO] ------------------------------------------------------------------------
[INFO] [clean:clean]
[INFO] Deleting directory /home/continuum/data/working-directory/704/target
[WARNING] POM for 'jpox:jpox:pom:1.1.9:compile' is invalid. It will be ignored for artifact resolution. Reason: Not a v4.0.0 POM. for project jpox:jpox at /home/continuum/.m2/repository/jpox/jpox/1.1.9/jpox-1.1.9.pom
[INFO] [enforcer:enforce {execution: default}]
[INFO] [plexus:descriptor {execution: generate}]
[WARNING] POM for 'jpox:jpox:pom:1.1.9:compile' is invalid. It will be ignored for artifact resolution. Reason: Not a v4.0.0 POM. for project jpox:jpox at /home/continuum/.m2/repository/jpox/jpox/1.1.9/jpox-1.1.9.pom
[INFO] Setting property: classpath.resource.loader.class => 'org.codehaus.plexus.velocity.ContextClassLoaderResourceLoader'.
[INFO] Setting property: velocimacro.messages.on => 'false'.
[INFO] Setting property: resource.loader => 'classpath'.
[INFO] Setting property: resource.manager.logwhenfound => 'false'.
[INFO] [remote-resources:process {execution: default}]
[WARNING] Attempting to build MavenProject instance for Artifact (org.apache.commons:commons-io:1.3.2) of type: jar; constructing POM artifact instead.
[WARNING] Attempting to build MavenProject instance for Artifact (jpox:jpox:1.1.9) of type: jar; constructing POM artifact instead.
[WARNING] Invalid project model for artifact [jpox:jpox:1.1.9]. It will be ignored by the remote resources Mojo.
[INFO] [resources:resources]
[INFO] Using default encoding to copy filtered resources.
[WARNING] POM for 'jpox:jpox:pom:1.1.9:compile' is invalid. It will be ignored for artifact resolution. Reason: Not a v4.0.0 POM. for project jpox:jpox at /home/continuum/.m2/repository/jpox/jpox/1.1.9/jpox-1.1.9.pom
[INFO] [compiler:compile]
[INFO] Compiling 6 source files to /home/continuum/data/working-directory/704/target/classes
[INFO] ------------------------------------------------------------------------
[ERROR] BUILD FAILURE
[INFO] ------------------------------------------------------------------------
[INFO] Compilation failure
/home/continuum/data/working-directory/704/src/main/java/org/apache/archiva/rss/processor/NewVersionsOfArtifactRssFeedProcessor.java:[31,53] cannot find symbol
symbol : class ArtifactVersionsConstraint
location: package org.apache.maven.archiva.database.constraints
/home/continuum/data/working-directory/704/src/main/java/org/apache/archiva/rss/processor/AbstractArtifactsRssFeedProcessor.java:[50,49] cannot find symbol
symbol : method getWhenGathered()
location: class org.apache.maven.archiva.model.ArchivaArtifactModel
/home/continuum/data/working-directory/704/src/main/java/org/apache/archiva/rss/processor/NewArtifactsRssFeedProcessor.java:[86,41] cannot find symbol
symbol : constructor ArtifactsByRepositoryConstraint(java.lang.String,java.lang.String)
location: class org.apache.maven.archiva.database.constraints.ArtifactsByRepositoryConstraint
/home/continuum/data/working-directory/704/src/main/java/org/apache/archiva/rss/processor/NewVersionsOfArtifactRssFeedProcessor.java:[87,46] cannot find symbol
symbol : class ArtifactVersionsConstraint
location: class org.apache.archiva.rss.processor.NewVersionsOfArtifactRssFeedProcessor
[INFO] ------------------------------------------------------------------------
[INFO] For more information, run Maven with the -e switch
[INFO] ------------------------------------------------------------------------
[INFO] Total time: 9 seconds
[INFO] Finished at: Sun Apr 27 09:40:11 PDT 2008
[INFO] Final Memory: 16M/28M
[INFO] ------------------------------------------------------------------------
****************************************************************************