You are viewing a plain text version of this content. The canonical link for it is here.
Posted to builds@beam.apache.org by Apache Jenkins Server <je...@builds.apache.org> on 2023/10/19 19:28:31 UTC

Build failed in Jenkins: beam_PostCommit_Python311 #801

See <https://ci-beam.apache.org/job/beam_PostCommit_Python311/801/display/redirect>

Changes:


------------------------------------------
[...truncated 12.08 MB...]
[gw7] SKIPPED apache_beam/testing/test_stream_it_test.py::TestStreamIntegrationTests::test_multiple_outputs_with_watermark_advancement 
[gw2] PASSED apache_beam/io/gcp/bigquery_read_it_test.py::ReadUsingStorageApiTests::test_iobase_source 
apache_beam/io/gcp/bigquery_read_it_test.py::ReadUsingStorageApiTests::test_iobase_source_with_column_selection 
[gw2] PASSED apache_beam/io/gcp/bigquery_read_it_test.py::ReadUsingStorageApiTests::test_iobase_source_with_column_selection 
apache_beam/io/gcp/bigquery_read_it_test.py::ReadUsingStorageApiTests::test_iobase_source_with_column_selection_and_row_restriction 
[gw2] PASSED apache_beam/io/gcp/bigquery_read_it_test.py::ReadUsingStorageApiTests::test_iobase_source_with_column_selection_and_row_restriction 
apache_beam/io/gcp/bigquery_read_it_test.py::ReadUsingStorageApiTests::test_iobase_source_with_column_selection_and_row_restriction_rows 
[gw2] PASSED apache_beam/io/gcp/bigquery_read_it_test.py::ReadUsingStorageApiTests::test_iobase_source_with_column_selection_and_row_restriction_rows 
apache_beam/io/gcp/bigquery_read_it_test.py::ReadUsingStorageApiTests::test_iobase_source_with_native_datetime 
[gw2] PASSED apache_beam/io/gcp/bigquery_read_it_test.py::ReadUsingStorageApiTests::test_iobase_source_with_native_datetime 
apache_beam/io/gcp/bigquery_read_it_test.py::ReadUsingStorageApiTests::test_iobase_source_with_query 
[gw2] PASSED apache_beam/io/gcp/bigquery_read_it_test.py::ReadUsingStorageApiTests::test_iobase_source_with_query 
apache_beam/io/gcp/bigquery_read_it_test.py::ReadUsingStorageApiTests::test_iobase_source_with_query_and_filters 
[gw2] PASSED apache_beam/io/gcp/bigquery_read_it_test.py::ReadUsingStorageApiTests::test_iobase_source_with_query_and_filters 
apache_beam/io/gcp/bigquery_read_it_test.py::ReadUsingStorageApiTests::test_iobase_source_with_row_restriction 
[gw2] FAILED apache_beam/io/gcp/bigquery_read_it_test.py::ReadUsingStorageApiTests::test_iobase_source_with_row_restriction 
apache_beam/io/gcp/bigquery_read_it_test.py::ReadUsingStorageApiTests::test_iobase_source_with_very_selective_filters 
[gw2] PASSED apache_beam/io/gcp/bigquery_read_it_test.py::ReadUsingStorageApiTests::test_iobase_source_with_very_selective_filters 
apache_beam/io/gcp/bigquery_read_it_test.py::ReadNewTypesTests::test_iobase_source 
[gw2] PASSED apache_beam/io/gcp/bigquery_read_it_test.py::ReadNewTypesTests::test_iobase_source 
apache_beam/io/gcp/bigquery_read_it_test.py::ReadNewTypesTests::test_native_source 
[gw2] PASSED apache_beam/io/gcp/bigquery_read_it_test.py::ReadNewTypesTests::test_native_source 
apache_beam/io/gcp/bigquery_read_it_test.py::ReadAllBQTests::test_read_queries 
[gw2] PASSED apache_beam/io/gcp/bigquery_read_it_test.py::ReadAllBQTests::test_read_queries 
apache_beam/io/gcp/bigquery_read_it_test.py::ReadInteractiveRunnerTests::test_read_in_interactive_runner 
[gw2] PASSED apache_beam/io/gcp/bigquery_read_it_test.py::ReadInteractiveRunnerTests::test_read_in_interactive_runner 

=================================== FAILURES ===================================
_______ ReadUsingStorageApiTests.test_iobase_source_with_row_restriction _______
[gw2] linux -- Python 3.11.2 <https://ci-beam.apache.org/job/beam_PostCommit_Python311/ws/src/build/gradleenv/2050596099/bin/python3.11>

self = <apache_beam.io.gcp.bigquery_read_it_test.ReadUsingStorageApiTests testMethod=test_iobase_source_with_row_restriction>

    @pytest.mark.it_postcommit
    def test_iobase_source_with_row_restriction(self):
      EXPECTED_TABLE_DATA = [{
          'number': 1,
          'string': '你好',
          'time': datetime.time(12, 44, 31),
          'datetime': datetime.datetime(2018, 12, 31, 12, 44, 31),
          'rec': None
      }]
>     with beam.Pipeline(argv=self.args) as p:

apache_beam/io/gcp/bigquery_read_it_test.py:505: 
_ _ _ _ _ _ _ _ _ _ _ _ _ _ _ _ _ _ _ _ _ _ _ _ _ _ _ _ _ _ _ _ _ _ _ _ _ _ _ _ 
apache_beam/pipeline.py:607: in __exit__
    self.result = self.run()
apache_beam/pipeline.py:560: in run
    self._options).run(False)
apache_beam/pipeline.py:584: in run
    return self.runner.run_pipeline(self, self._options)
apache_beam/runners/dataflow/test_dataflow_runner.py:53: in run_pipeline
    self.result = super().run_pipeline(pipeline, options)
apache_beam/runners/dataflow/dataflow_runner.py:479: in run_pipeline
    self.dataflow_client.create_job(self.job), self)
apache_beam/utils/retry.py:275: in wrapper
    return fun(*args, **kwargs)
apache_beam/runners/dataflow/internal/apiclient.py:693: in create_job
    self.create_job_description(job)
apache_beam/runners/dataflow/internal/apiclient.py:779: in create_job_description
    resources = self._stage_resources(job.proto_pipeline, job.options)
apache_beam/runners/dataflow/internal/apiclient.py:645: in _stage_resources
    staged_resources = resource_stager.stage_job_resources(
apache_beam/runners/portability/stager.py:397: in stage_job_resources
    self.stage_artifact(
apache_beam/runners/dataflow/internal/apiclient.py:1062: in stage_artifact
    self._dataflow_application_client._gcs_file_copy(
apache_beam/runners/dataflow/internal/apiclient.py:545: in _gcs_file_copy
    self._uncached_gcs_file_copy(from_path, to_path)
apache_beam/utils/retry.py:275: in wrapper
    return fun(*args, **kwargs)
apache_beam/runners/dataflow/internal/apiclient.py:567: in _uncached_gcs_file_copy
    self.stage_file(to_folder, to_name, f, total_size=total_size)
apache_beam/runners/dataflow/internal/apiclient.py:671: in stage_file
    response = self._storage_client.objects.Insert(request, upload=upload)
apache_beam/io/gcp/internal/clients/storage/storage_v1_client.py:1207: in Insert
    return self._RunMethod(
../../build/gradleenv/2050596099/lib/python3.11/site-packages/apitools/base/py/base_api.py:714: in _RunMethod
    http_response = upload.InitializeUpload(
../../build/gradleenv/2050596099/lib/python3.11/site-packages/apitools/base/py/transfer.py:908: in InitializeUpload
    return self.StreamInChunks()
../../build/gradleenv/2050596099/lib/python3.11/site-packages/apitools/base/py/transfer.py:1018: in StreamInChunks
    return self.__StreamMedia(
../../build/gradleenv/2050596099/lib/python3.11/site-packages/apitools/base/py/transfer.py:971: in __StreamMedia
    self.RefreshResumableUploadState()
_ _ _ _ _ _ _ _ _ _ _ _ _ _ _ _ _ _ _ _ _ _ _ _ _ _ _ _ _ _ _ _ _ _ _ _ _ _ _ _ 

self = Upload with 36700159/670166245 bytes transferred for url https://www.googleapis.com/resumable/upload/storage/v1/b/temp...Type=resumable&upload_id=ADPycdvI2Y83ST2iT0mOg0YfqiBSDm77B5SdIEyycKpHp9pgLVPzw4tnLueS5cO7ZCDdb-CHFAwWUNZ-hNbXihnfxC_zhA

    def RefreshResumableUploadState(self):
        """Talk to the server and refresh the state of this resumable upload.
    
        Returns:
          Response if the upload is complete.
        """
        if self.strategy != RESUMABLE_UPLOAD:
            return
        self.EnsureInitialized()
        refresh_request = http_wrapper.Request(
            url=self.url, http_method='PUT',
            headers={'Content-Range': 'bytes */*'})
        refresh_response = http_wrapper.MakeRequest(
            self.http, refresh_request, redirections=0,
            retries=self.num_retries)
        range_header = self._GetRangeHeaderFromResponse(refresh_response)
        if refresh_response.status_code in (http_client.OK,
                                            http_client.CREATED):
            self.__complete = True
            self.__progress = self.total_size
            self.stream.seek(self.progress)
            # If we're finished, the refresh response will contain the metadata
            # originally requested. Cache it so it can be returned in
            # StreamInChunks.
            self.__final_response = refresh_response
        elif refresh_response.status_code == http_wrapper.RESUME_INCOMPLETE:
            if range_header is None:
                self.__progress = 0
            else:
                self.__progress = self.__GetLastByte(range_header) + 1
            self.stream.seek(self.progress)
        else:
>           raise exceptions.HttpError.FromResponse(refresh_response)
E           apitools.base.py.exceptions.HttpError: HttpError accessing <https://www.googleapis.com/resumable/upload/storage/v1/b/temp-storage-for-end-to-end-tests/o?alt=json&name=staging-it%2Fbeamapp-jenkins-1019185858-218181-ctlnfeis.1697741938.218334%2Ftorch-2.1.0-cp38-cp38-manylinux1_x86_64.whl&uploadType=resumable&upload_id=ADPycdvI2Y83ST2iT0mOg0YfqiBSDm77B5SdIEyycKpHp9pgLVPzw4tnLueS5cO7ZCDdb-CHFAwWUNZ-hNbXihnfxC_zhA>: response: <{'x-guploader-uploadid': 'ADPycdvI2Y83ST2iT0mOg0YfqiBSDm77B5SdIEyycKpHp9pgLVPzw4tnLueS5cO7ZCDdb-CHFAwWUNZ-hNbXihnfxC_zhA', 'content-type': 'application/json; charset=UTF-8', 'date': 'Thu, 19 Oct 2023 18:59:53 GMT', 'vary': 'Origin, X-Origin', 'cache-control': 'no-cache, no-store, max-age=0, must-revalidate', 'expires': 'Mon, 01 Jan 1990 00:00:00 GMT', 'pragma': 'no-cache', 'content-length': '205', 'server': 'UploadServer', 'status': '410'}>, content <{
E             "error": {
E               "code": 503,
E               "message": "Backend Error",
E               "errors": [
E                 {
E                   "message": "Backend Error",
E                   "domain": "global",
E                   "reason": "backendError"
E                 }
E               ]
E             }
E           }
E           >

../../build/gradleenv/2050596099/lib/python3.11/site-packages/apitools/base/py/transfer.py:875: HttpError
------------------------------ Captured log call -------------------------------
INFO     apache_beam.runners.portability.stager:stager.py:761 Executing command: ['<https://ci-beam.apache.org/job/beam_PostCommit_Python311/ws/src/build/gradleenv/2050596099/bin/python3.11',> '-m', 'pip', 'download', '--dest', '/tmp/dataflow-requirements-cache', '-r', '/tmp/tmp__hqc8gz/tmp_requirements.txt', '--exists-action', 'i', '--no-deps', '--implementation', 'cp', '--abi', 'cp311', '--platform', 'manylinux2014_x86_64']
INFO     apache_beam.runners.portability.stager:stager.py:322 Copying Beam SDK "<https://ci-beam.apache.org/job/beam_PostCommit_Python311/ws/src/sdks/python/build/apache_beam-2.52.0.dev0-cp311-cp311-manylinux_2_17_x86_64.manylinux2014_x86_64.whl"> to staging location.
INFO     apache_beam.runners.dataflow.dataflow_runner:dataflow_runner.py:395 Pipeline has additional dependencies to be installed in SDK worker container, consider using the SDK container image pre-building workflow to avoid repetitive installations. Learn more on https://cloud.google.com/dataflow/docs/guides/using-custom-containers#prebuild
INFO     root:environments.py:313 Using provided Python SDK container image: gcr.io/cloud-dataflow/v1beta3/beam_python3.11_sdk:beam-master-20231009
INFO     root:environments.py:320 Python SDK container image set to "gcr.io/cloud-dataflow/v1beta3/beam_python3.11_sdk:beam-master-20231009" for Docker environment
INFO     apache_beam.runners.portability.fn_api_runner.translations:translations.py:712 ==================== <function pack_combiners at 0x7f4d07d434c0> ====================
INFO     apache_beam.runners.portability.fn_api_runner.translations:translations.py:712 ==================== <function sort_stages at 0x7f4d07d43d80> ====================
INFO     apache_beam.runners.dataflow.internal.apiclient:apiclient.py:668 Starting GCS upload to gs://temp-storage-for-end-to-end-tests/staging-it/beamapp-jenkins-1019185858-218181-ctlnfeis.1697741938.218334/requirements.txt...
INFO     apache_beam.runners.dataflow.internal.apiclient:apiclient.py:684 Completed GCS upload to gs://temp-storage-for-end-to-end-tests/staging-it/beamapp-jenkins-1019185858-218181-ctlnfeis.1697741938.218334/requirements.txt in 0 seconds.
INFO     apache_beam.runners.dataflow.internal.apiclient:apiclient.py:668 Starting GCS upload to gs://temp-storage-for-end-to-end-tests/staging-it/beamapp-jenkins-1019185858-218181-ctlnfeis.1697741938.218334/mock-2.0.0-py2.py3-none-any.whl...
INFO     apache_beam.runners.dataflow.internal.apiclient:apiclient.py:684 Completed GCS upload to gs://temp-storage-for-end-to-end-tests/staging-it/beamapp-jenkins-1019185858-218181-ctlnfeis.1697741938.218334/mock-2.0.0-py2.py3-none-any.whl in 0 seconds.
INFO     apache_beam.runners.dataflow.internal.apiclient:apiclient.py:668 Starting GCS upload to gs://temp-storage-for-end-to-end-tests/staging-it/beamapp-jenkins-1019185858-218181-ctlnfeis.1697741938.218334/seaborn-0.13.0-py3-none-any.whl...
INFO     apache_beam.runners.dataflow.internal.apiclient:apiclient.py:684 Completed GCS upload to gs://temp-storage-for-end-to-end-tests/staging-it/beamapp-jenkins-1019185858-218181-ctlnfeis.1697741938.218334/seaborn-0.13.0-py3-none-any.whl in 0 seconds.
INFO     apache_beam.runners.dataflow.internal.apiclient:apiclient.py:668 Starting GCS upload to gs://temp-storage-for-end-to-end-tests/staging-it/beamapp-jenkins-1019185858-218181-ctlnfeis.1697741938.218334/PyHamcrest-1.10.1-py3-none-any.whl...
INFO     apache_beam.runners.dataflow.internal.apiclient:apiclient.py:684 Completed GCS upload to gs://temp-storage-for-end-to-end-tests/staging-it/beamapp-jenkins-1019185858-218181-ctlnfeis.1697741938.218334/PyHamcrest-1.10.1-py3-none-any.whl in 0 seconds.
INFO     apache_beam.runners.dataflow.internal.apiclient:apiclient.py:668 Starting GCS upload to gs://temp-storage-for-end-to-end-tests/staging-it/beamapp-jenkins-1019185858-218181-ctlnfeis.1697741938.218334/transformers-4.34.0-py3-none-any.whl...
INFO     apache_beam.runners.dataflow.internal.apiclient:apiclient.py:684 Completed GCS upload to gs://temp-storage-for-end-to-end-tests/staging-it/beamapp-jenkins-1019185858-218181-ctlnfeis.1697741938.218334/transformers-4.34.0-py3-none-any.whl in 0 seconds.
INFO     apache_beam.runners.dataflow.internal.apiclient:apiclient.py:668 Starting GCS upload to gs://temp-storage-for-end-to-end-tests/staging-it/beamapp-jenkins-1019185858-218181-ctlnfeis.1697741938.218334/inflection-0.5.1-py2.py3-none-any.whl...
INFO     apache_beam.runners.dataflow.internal.apiclient:apiclient.py:684 Completed GCS upload to gs://temp-storage-for-end-to-end-tests/staging-it/beamapp-jenkins-1019185858-218181-ctlnfeis.1697741938.218334/inflection-0.5.1-py2.py3-none-any.whl in 0 seconds.
INFO     apache_beam.runners.dataflow.internal.apiclient:apiclient.py:668 Starting GCS upload to gs://temp-storage-for-end-to-end-tests/staging-it/beamapp-jenkins-1019185858-218181-ctlnfeis.1697741938.218334/beautifulsoup4-4.12.2-py3-none-any.whl...
INFO     apache_beam.runners.dataflow.internal.apiclient:apiclient.py:684 Completed GCS upload to gs://temp-storage-for-end-to-end-tests/staging-it/beamapp-jenkins-1019185858-218181-ctlnfeis.1697741938.218334/beautifulsoup4-4.12.2-py3-none-any.whl in 0 seconds.
INFO     apache_beam.runners.dataflow.internal.apiclient:apiclient.py:668 Starting GCS upload to gs://temp-storage-for-end-to-end-tests/staging-it/beamapp-jenkins-1019185858-218181-ctlnfeis.1697741938.218334/parameterized-0.7.5-py2.py3-none-any.whl...
INFO     apache_beam.runners.dataflow.internal.apiclient:apiclient.py:684 Completed GCS upload to gs://temp-storage-for-end-to-end-tests/staging-it/beamapp-jenkins-1019185858-218181-ctlnfeis.1697741938.218334/parameterized-0.7.5-py2.py3-none-any.whl in 0 seconds.
INFO     apache_beam.runners.dataflow.internal.apiclient:apiclient.py:668 Starting GCS upload to gs://temp-storage-for-end-to-end-tests/staging-it/beamapp-jenkins-1019185858-218181-ctlnfeis.1697741938.218334/torch-2.1.0-cp38-cp38-manylinux1_x86_64.whl...
=============================== warnings summary ===============================
../../build/gradleenv/2050596099/lib/python3.11/site-packages/google/api_core/operations_v1/abstract_operations_client.py:17
../../build/gradleenv/2050596099/lib/python3.11/site-packages/google/api_core/operations_v1/abstract_operations_client.py:17
../../build/gradleenv/2050596099/lib/python3.11/site-packages/google/api_core/operations_v1/abstract_operations_client.py:17
../../build/gradleenv/2050596099/lib/python3.11/site-packages/google/api_core/operations_v1/abstract_operations_client.py:17
../../build/gradleenv/2050596099/lib/python3.11/site-packages/google/api_core/operations_v1/abstract_operations_client.py:17
../../build/gradleenv/2050596099/lib/python3.11/site-packages/google/api_core/operations_v1/abstract_operations_client.py:17
../../build/gradleenv/2050596099/lib/python3.11/site-packages/google/api_core/operations_v1/abstract_operations_client.py:17
../../build/gradleenv/2050596099/lib/python3.11/site-packages/google/api_core/operations_v1/abstract_operations_client.py:17
  <https://ci-beam.apache.org/job/beam_PostCommit_Python311/ws/src/build/gradleenv/2050596099/lib/python3.11/site-packages/google/api_core/operations_v1/abstract_operations_client.py>:17: DeprecationWarning: The distutils package is deprecated and slated for removal in Python 3.12. Use setuptools or check PEP 632 for potential alternatives
    from distutils import util

apache_beam/examples/complete/game/hourly_team_score_it_test.py::HourlyTeamScoreIT::test_hourly_team_score_it
apache_beam/examples/complete/game/game_stats_it_test.py::GameStatsIT::test_game_stats_it
apache_beam/examples/complete/game/leader_board_it_test.py::LeaderBoardIT::test_leader_board_it
apache_beam/io/gcp/bigquery_test.py::PubSubBigQueryIT::test_file_loads
apache_beam/io/gcp/bigquery_test.py::PubSubBigQueryIT::test_streaming_inserts
  <https://ci-beam.apache.org/job/beam_PostCommit_Python311/ws/src/sdks/python/apache_beam/io/gcp/tests/utils.py>:63: PendingDeprecationWarning: Client.dataset is deprecated and will be removed in a future version. Use a string like 'my_project.my_dataset' or a cloud.google.bigquery.DatasetReference object, instead.
    dataset_ref = client.dataset(unique_dataset_name, project=project)

apache_beam/examples/cookbook/bigquery_tornadoes_it_test.py::BigqueryTornadoesIT::test_bigquery_tornadoes_it
  <https://ci-beam.apache.org/job/beam_PostCommit_Python311/ws/src/sdks/python/apache_beam/io/gcp/tests/utils.py>:100: PendingDeprecationWarning: Client.dataset is deprecated and will be removed in a future version. Use a string like 'my_project.my_dataset' or a cloud.google.bigquery.DatasetReference object, instead.
    table_ref = client.dataset(dataset_id).table(table_id)

apache_beam/examples/dataframe/flight_delays_it_test.py::FlightDelaysTest::test_flight_delays
  <https://ci-beam.apache.org/job/beam_PostCommit_Python311/ws/src/sdks/python/apache_beam/examples/dataframe/flight_delays.py>:47: FutureWarning: The default value of numeric_only in DataFrame.mean is deprecated. In a future version, it will default to False. In addition, specifying 'numeric_only=None' is deprecated. Select only valid columns or specify the value of numeric_only to silence this warning.
    return airline_df[at_top_airports].mean()

apache_beam/io/gcp/bigquery_read_it_test.py::ReadTests::test_native_source
  <https://ci-beam.apache.org/job/beam_PostCommit_Python311/ws/src/sdks/python/apache_beam/io/gcp/bigquery_read_it_test.py>:170: BeamDeprecationWarning: BigQuerySource is deprecated since 2.25.0. Use ReadFromBigQuery instead.
    beam.io.BigQuerySource(query=self.query, use_standard_sql=True)))

apache_beam/io/gcp/bigquery_read_it_test.py::ReadNewTypesTests::test_native_source
  <https://ci-beam.apache.org/job/beam_PostCommit_Python311/ws/src/sdks/python/apache_beam/io/gcp/bigquery_read_it_test.py>:706: BeamDeprecationWarning: BigQuerySource is deprecated since 2.25.0. Use ReadFromBigQuery instead.
    beam.io.BigQuerySource(query=self.query, use_standard_sql=True)))

-- Docs: https://docs.pytest.org/en/stable/how-to/capture-warnings.html
- generated xml file: <https://ci-beam.apache.org/job/beam_PostCommit_Python311/ws/src/sdks/python/pytest_postCommitIT-df-py311.xml> -
=========================== short test summary info ============================
FAILED apache_beam/io/gcp/bigquery_read_it_test.py::ReadUsingStorageApiTests::test_iobase_source_with_row_restriction - apitools.base.py.exceptions.HttpError: HttpError accessing <https://www.googleapis.com/resumable/upload/storage/v1/b/temp-storage-for-end-to-end-tests/o?alt=json&name=staging-it%2Fbeamapp-jenkins-1019185858-218181-ctlnfeis.1697741938.218334%2Ftorch-2.1.0-cp38-cp38-manylinux1_x86_64.whl&uploadType=resumable&upload_id=ADPycdvI2Y83ST2iT0mOg0YfqiBSDm77B5SdIEyycKpHp9pgLVPzw4tnLueS5cO7ZCDdb-CHFAwWUNZ-hNbXihnfxC_zhA>: response: <{'x-guploader-uploadid': 'ADPycdvI2Y83ST2iT0mOg0YfqiBSDm77B5SdIEyycKpHp9pgLVPzw4tnLueS5cO7ZCDdb-CHFAwWUNZ-hNbXihnfxC_zhA', 'content-type': 'application/json; charset=UTF-8', 'date': 'Thu, 19 Oct 2023 18:59:53 GMT', 'vary': 'Origin, X-Origin', 'cache-control': 'no-cache, no-store, max-age=0, must-revalidate', 'expires': 'Mon, 01 Jan 1990 00:00:00 GMT', 'pragma': 'no-cache', 'content-length': '205', 'server': 'UploadServer', 'status': '410'}>, content <{
  "error": {
    "code": 503,
    "message": "Backend Error",
    "errors": [
      {
        "message": "Backend Error",
        "domain": "global",
        "reason": "backendError"
      }
    ]
  }
}
>
====== 1 failed, 86 passed, 51 skipped, 17 warnings in 9208.92s (2:33:28) ======

> Task :sdks:python:test-suites:dataflow:py311:postCommitIT FAILED

FAILURE: Build failed with an exception.

* Where:
Script '<https://ci-beam.apache.org/job/beam_PostCommit_Python311/ws/src/sdks/python/test-suites/dataflow/common.gradle'> line: 139

* What went wrong:
Execution failed for task ':sdks:python:test-suites:dataflow:py311:postCommitIT'.
> Process 'command 'sh'' finished with non-zero exit value 1

* Try:
> Run with --stacktrace option to get the stack trace.
> Run with --info or --debug option to get more log output.
> Get more help at https://help.gradle.org.

Deprecated Gradle features were used in this build, making it incompatible with Gradle 9.0.

You can use '--warning-mode all' to show the individual deprecation warnings and determine if they come from your own scripts or plugins.

For more on this, please refer to https://docs.gradle.org/8.3/userguide/command_line_interface.html#sec:command_line_warnings in the Gradle documentation.

BUILD FAILED in 2h 39m 59s
214 actionable tasks: 150 executed, 60 from cache, 4 up-to-date

Publishing build scan...
https://ge.apache.org/s/qtfo2u7q3ju2c

Build step 'Invoke Gradle script' changed build result to FAILURE
Build step 'Invoke Gradle script' marked build as failure

---------------------------------------------------------------------
To unsubscribe, e-mail: builds-unsubscribe@beam.apache.org
For additional commands, e-mail: builds-help@beam.apache.org


Jenkins build is back to normal : beam_PostCommit_Python311 #802

Posted by Apache Jenkins Server <je...@builds.apache.org>.
See <https://ci-beam.apache.org/job/beam_PostCommit_Python311/802/display/redirect>


---------------------------------------------------------------------
To unsubscribe, e-mail: builds-unsubscribe@beam.apache.org
For additional commands, e-mail: builds-help@beam.apache.org