You are viewing a plain text version of this content. The canonical link for it is here.
Posted to dev@lucene.apache.org by Policeman Jenkins Server <je...@thetaphi.de> on 2019/05/09 06:41:32 UTC

[JENKINS-EA] Lucene-Solr-master-Linux (64bit/jdk-13-ea+shipilev-fastdebug) - Build # 24054 - Unstable!

Build: https://jenkins.thetaphi.de/job/Lucene-Solr-master-Linux/24054/
Java: 64bit/jdk-13-ea+shipilev-fastdebug -XX:+UseCompressedOops -XX:+UseParallelGC

2 tests failed.
FAILED:  org.apache.solr.cloud.MetricsHistoryWithAuthIntegrationTest.testValuesAreCollected

Error Message:
Error from server at http://127.0.0.1:42517/solr: Null consolidation function specified

Stack Trace:
org.apache.solr.client.solrj.impl.HttpSolrClient$RemoteSolrException: Error from server at http://127.0.0.1:42517/solr: Null consolidation function specified
	at __randomizedtesting.SeedInfo.seed([C9DDA6254F404BB5:E120FB429EA4D4F0]:0)
	at org.apache.solr.client.solrj.impl.HttpSolrClient.executeMethod(HttpSolrClient.java:649)
	at org.apache.solr.client.solrj.impl.HttpSolrClient.request(HttpSolrClient.java:255)
	at org.apache.solr.client.solrj.impl.HttpSolrClient.request(HttpSolrClient.java:244)
	at org.apache.solr.client.solrj.impl.LBSolrClient.doRequest(LBSolrClient.java:368)
	at org.apache.solr.client.solrj.impl.LBSolrClient.request(LBSolrClient.java:296)
	at org.apache.solr.client.solrj.impl.BaseCloudSolrClient.sendRequest(BaseCloudSolrClient.java:1068)
	at org.apache.solr.client.solrj.impl.BaseCloudSolrClient.requestWithRetryOnStaleState(BaseCloudSolrClient.java:837)
	at org.apache.solr.client.solrj.impl.BaseCloudSolrClient.request(BaseCloudSolrClient.java:769)
	at org.apache.solr.client.solrj.SolrClient.request(SolrClient.java:1274)
	at org.apache.solr.cloud.MetricsHistoryWithAuthIntegrationTest.testValuesAreCollected(MetricsHistoryWithAuthIntegrationTest.java:81)
	at java.base/jdk.internal.reflect.NativeMethodAccessorImpl.invoke0(Native Method)
	at java.base/jdk.internal.reflect.NativeMethodAccessorImpl.invoke(NativeMethodAccessorImpl.java:62)
	at java.base/jdk.internal.reflect.DelegatingMethodAccessorImpl.invoke(DelegatingMethodAccessorImpl.java:43)
	at java.base/java.lang.reflect.Method.invoke(Method.java:567)
	at com.carrotsearch.randomizedtesting.RandomizedRunner.invoke(RandomizedRunner.java:1750)
	at com.carrotsearch.randomizedtesting.RandomizedRunner$8.evaluate(RandomizedRunner.java:938)
	at com.carrotsearch.randomizedtesting.RandomizedRunner$9.evaluate(RandomizedRunner.java:974)
	at com.carrotsearch.randomizedtesting.RandomizedRunner$10.evaluate(RandomizedRunner.java:988)
	at com.carrotsearch.randomizedtesting.rules.SystemPropertiesRestoreRule$1.evaluate(SystemPropertiesRestoreRule.java:57)
	at org.apache.lucene.util.TestRuleSetupTeardownChained$1.evaluate(TestRuleSetupTeardownChained.java:49)
	at org.apache.lucene.util.AbstractBeforeAfterRule$1.evaluate(AbstractBeforeAfterRule.java:45)
	at org.apache.lucene.util.TestRuleThreadAndTestName$1.evaluate(TestRuleThreadAndTestName.java:48)
	at org.apache.lucene.util.TestRuleIgnoreAfterMaxFailures$1.evaluate(TestRuleIgnoreAfterMaxFailures.java:64)
	at org.apache.lucene.util.TestRuleMarkFailure$1.evaluate(TestRuleMarkFailure.java:47)
	at com.carrotsearch.randomizedtesting.rules.StatementAdapter.evaluate(StatementAdapter.java:36)
	at com.carrotsearch.randomizedtesting.ThreadLeakControl$StatementRunner.run(ThreadLeakControl.java:368)
	at com.carrotsearch.randomizedtesting.ThreadLeakControl.forkTimeoutingTask(ThreadLeakControl.java:817)
	at com.carrotsearch.randomizedtesting.ThreadLeakControl$3.evaluate(ThreadLeakControl.java:468)
	at com.carrotsearch.randomizedtesting.RandomizedRunner.runSingleTest(RandomizedRunner.java:947)
	at com.carrotsearch.randomizedtesting.RandomizedRunner$5.evaluate(RandomizedRunner.java:832)
	at com.carrotsearch.randomizedtesting.RandomizedRunner$6.evaluate(RandomizedRunner.java:883)
	at com.carrotsearch.randomizedtesting.RandomizedRunner$7.evaluate(RandomizedRunner.java:894)
	at com.carrotsearch.randomizedtesting.rules.StatementAdapter.evaluate(StatementAdapter.java:36)
	at com.carrotsearch.randomizedtesting.rules.SystemPropertiesRestoreRule$1.evaluate(SystemPropertiesRestoreRule.java:57)
	at org.apache.lucene.util.AbstractBeforeAfterRule$1.evaluate(AbstractBeforeAfterRule.java:45)
	at com.carrotsearch.randomizedtesting.rules.StatementAdapter.evaluate(StatementAdapter.java:36)
	at org.apache.lucene.util.TestRuleStoreClassName$1.evaluate(TestRuleStoreClassName.java:41)
	at com.carrotsearch.randomizedtesting.rules.NoShadowingOrOverridesOnMethodsRule$1.evaluate(NoShadowingOrOverridesOnMethodsRule.java:40)
	at com.carrotsearch.randomizedtesting.rules.NoShadowingOrOverridesOnMethodsRule$1.evaluate(NoShadowingOrOverridesOnMethodsRule.java:40)
	at com.carrotsearch.randomizedtesting.rules.StatementAdapter.evaluate(StatementAdapter.java:36)
	at com.carrotsearch.randomizedtesting.rules.StatementAdapter.evaluate(StatementAdapter.java:36)
	at org.apache.lucene.util.TestRuleAssertionsRequired$1.evaluate(TestRuleAssertionsRequired.java:53)
	at org.apache.lucene.util.TestRuleMarkFailure$1.evaluate(TestRuleMarkFailure.java:47)
	at org.apache.lucene.util.TestRuleIgnoreAfterMaxFailures$1.evaluate(TestRuleIgnoreAfterMaxFailures.java:64)
	at org.apache.lucene.util.TestRuleIgnoreTestSuites$1.evaluate(TestRuleIgnoreTestSuites.java:54)
	at com.carrotsearch.randomizedtesting.rules.StatementAdapter.evaluate(StatementAdapter.java:36)
	at com.carrotsearch.randomizedtesting.ThreadLeakControl$StatementRunner.run(ThreadLeakControl.java:368)
	at java.base/java.lang.Thread.run(Thread.java:830)


FAILED:  org.apache.solr.security.BasicAuthIntegrationTest.testBasicAuth

Error Message:
must have failed

Stack Trace:
java.lang.AssertionError: must have failed
	at __randomizedtesting.SeedInfo.seed([C9DDA6254F404BB5:75B3D037EB13C8CF]:0)
	at org.junit.Assert.fail(Assert.java:88)
	at org.apache.solr.security.BasicAuthIntegrationTest.testBasicAuth(BasicAuthIntegrationTest.java:204)
	at java.base/jdk.internal.reflect.NativeMethodAccessorImpl.invoke0(Native Method)
	at java.base/jdk.internal.reflect.NativeMethodAccessorImpl.invoke(NativeMethodAccessorImpl.java:62)
	at java.base/jdk.internal.reflect.DelegatingMethodAccessorImpl.invoke(DelegatingMethodAccessorImpl.java:43)
	at java.base/java.lang.reflect.Method.invoke(Method.java:567)
	at com.carrotsearch.randomizedtesting.RandomizedRunner.invoke(RandomizedRunner.java:1750)
	at com.carrotsearch.randomizedtesting.RandomizedRunner$8.evaluate(RandomizedRunner.java:938)
	at com.carrotsearch.randomizedtesting.RandomizedRunner$9.evaluate(RandomizedRunner.java:974)
	at com.carrotsearch.randomizedtesting.RandomizedRunner$10.evaluate(RandomizedRunner.java:988)
	at com.carrotsearch.randomizedtesting.rules.SystemPropertiesRestoreRule$1.evaluate(SystemPropertiesRestoreRule.java:57)
	at org.apache.lucene.util.TestRuleSetupTeardownChained$1.evaluate(TestRuleSetupTeardownChained.java:49)
	at org.apache.lucene.util.AbstractBeforeAfterRule$1.evaluate(AbstractBeforeAfterRule.java:45)
	at org.apache.lucene.util.TestRuleThreadAndTestName$1.evaluate(TestRuleThreadAndTestName.java:48)
	at org.apache.lucene.util.TestRuleIgnoreAfterMaxFailures$1.evaluate(TestRuleIgnoreAfterMaxFailures.java:64)
	at org.apache.lucene.util.TestRuleMarkFailure$1.evaluate(TestRuleMarkFailure.java:47)
	at com.carrotsearch.randomizedtesting.rules.StatementAdapter.evaluate(StatementAdapter.java:36)
	at com.carrotsearch.randomizedtesting.ThreadLeakControl$StatementRunner.run(ThreadLeakControl.java:368)
	at com.carrotsearch.randomizedtesting.ThreadLeakControl.forkTimeoutingTask(ThreadLeakControl.java:817)
	at com.carrotsearch.randomizedtesting.ThreadLeakControl$3.evaluate(ThreadLeakControl.java:468)
	at com.carrotsearch.randomizedtesting.RandomizedRunner.runSingleTest(RandomizedRunner.java:947)
	at com.carrotsearch.randomizedtesting.RandomizedRunner$5.evaluate(RandomizedRunner.java:832)
	at com.carrotsearch.randomizedtesting.RandomizedRunner$6.evaluate(RandomizedRunner.java:883)
	at com.carrotsearch.randomizedtesting.RandomizedRunner$7.evaluate(RandomizedRunner.java:894)
	at com.carrotsearch.randomizedtesting.rules.StatementAdapter.evaluate(StatementAdapter.java:36)
	at com.carrotsearch.randomizedtesting.rules.SystemPropertiesRestoreRule$1.evaluate(SystemPropertiesRestoreRule.java:57)
	at org.apache.lucene.util.AbstractBeforeAfterRule$1.evaluate(AbstractBeforeAfterRule.java:45)
	at com.carrotsearch.randomizedtesting.rules.StatementAdapter.evaluate(StatementAdapter.java:36)
	at org.apache.lucene.util.TestRuleStoreClassName$1.evaluate(TestRuleStoreClassName.java:41)
	at com.carrotsearch.randomizedtesting.rules.NoShadowingOrOverridesOnMethodsRule$1.evaluate(NoShadowingOrOverridesOnMethodsRule.java:40)
	at com.carrotsearch.randomizedtesting.rules.NoShadowingOrOverridesOnMethodsRule$1.evaluate(NoShadowingOrOverridesOnMethodsRule.java:40)
	at com.carrotsearch.randomizedtesting.rules.StatementAdapter.evaluate(StatementAdapter.java:36)
	at com.carrotsearch.randomizedtesting.rules.StatementAdapter.evaluate(StatementAdapter.java:36)
	at org.apache.lucene.util.TestRuleAssertionsRequired$1.evaluate(TestRuleAssertionsRequired.java:53)
	at org.apache.lucene.util.TestRuleMarkFailure$1.evaluate(TestRuleMarkFailure.java:47)
	at org.apache.lucene.util.TestRuleIgnoreAfterMaxFailures$1.evaluate(TestRuleIgnoreAfterMaxFailures.java:64)
	at org.apache.lucene.util.TestRuleIgnoreTestSuites$1.evaluate(TestRuleIgnoreTestSuites.java:54)
	at com.carrotsearch.randomizedtesting.rules.StatementAdapter.evaluate(StatementAdapter.java:36)
	at com.carrotsearch.randomizedtesting.ThreadLeakControl$StatementRunner.run(ThreadLeakControl.java:368)
	at java.base/java.lang.Thread.run(Thread.java:830)




Build Log:
[...truncated 12673 lines...]
   [junit4] Suite: org.apache.solr.cloud.MetricsHistoryWithAuthIntegrationTest
   [junit4]   2> 402504 INFO  (SUITE-MetricsHistoryWithAuthIntegrationTest-seed#[C9DDA6254F404BB5]-worker) [    ] o.a.s.SolrTestCaseJ4 SecureRandom sanity checks: test.solr.allowed.securerandom=null & java.security.egd=file:/dev/./urandom
   [junit4]   2> Creating dataDir: /home/jenkins/workspace/Lucene-Solr-master-Linux/solr/build/solr-core/test/J0/temp/solr.cloud.MetricsHistoryWithAuthIntegrationTest_C9DDA6254F404BB5-001/init-core-data-001
   [junit4]   2> 402505 INFO  (SUITE-MetricsHistoryWithAuthIntegrationTest-seed#[C9DDA6254F404BB5]-worker) [    ] o.a.s.SolrTestCaseJ4 Using PointFields (NUMERIC_POINTS_SYSPROP=true) w/NUMERIC_DOCVALUES_SYSPROP=false
   [junit4]   2> 402506 INFO  (SUITE-MetricsHistoryWithAuthIntegrationTest-seed#[C9DDA6254F404BB5]-worker) [    ] o.a.s.SolrTestCaseJ4 Randomized ssl (false) and clientAuth (true) via: @org.apache.solr.util.RandomizeSSL(reason="", value=0.0/0.0, ssl=0.0/0.0, clientAuth=0.0/0.0)
   [junit4]   2> 402507 INFO  (SUITE-MetricsHistoryWithAuthIntegrationTest-seed#[C9DDA6254F404BB5]-worker) [    ] o.a.s.c.MiniSolrCloudCluster Starting cluster of 1 servers in /home/jenkins/workspace/Lucene-Solr-master-Linux/solr/build/solr-core/test/J0/temp/solr.cloud.MetricsHistoryWithAuthIntegrationTest_C9DDA6254F404BB5-001/tempDir-001
   [junit4]   2> 402507 INFO  (SUITE-MetricsHistoryWithAuthIntegrationTest-seed#[C9DDA6254F404BB5]-worker) [    ] o.a.s.c.ZkTestServer STARTING ZK TEST SERVER
   [junit4]   2> 402508 INFO  (ZkTestServer Run Thread) [    ] o.a.s.c.ZkTestServer client port:0.0.0.0/0.0.0.0:0
   [junit4]   2> 402508 INFO  (ZkTestServer Run Thread) [    ] o.a.s.c.ZkTestServer Starting server
   [junit4]   2> 402608 INFO  (SUITE-MetricsHistoryWithAuthIntegrationTest-seed#[C9DDA6254F404BB5]-worker) [    ] o.a.s.c.ZkTestServer start zk server on port:41663
   [junit4]   2> 402608 INFO  (SUITE-MetricsHistoryWithAuthIntegrationTest-seed#[C9DDA6254F404BB5]-worker) [    ] o.a.s.c.ZkTestServer parse host and port list: 127.0.0.1:41663
   [junit4]   2> 402608 INFO  (SUITE-MetricsHistoryWithAuthIntegrationTest-seed#[C9DDA6254F404BB5]-worker) [    ] o.a.s.c.ZkTestServer connecting to 127.0.0.1 41663
   [junit4]   2> 402615 INFO  (zkConnectionManagerCallback-1157-thread-1) [    ] o.a.s.c.c.ConnectionManager zkClient has connected
   [junit4]   2> 402626 INFO  (zkConnectionManagerCallback-1159-thread-1) [    ] o.a.s.c.c.ConnectionManager zkClient has connected
   [junit4]   2> 402637 INFO  (zkConnectionManagerCallback-1161-thread-1) [    ] o.a.s.c.c.ConnectionManager zkClient has connected
   [junit4]   2> 402649 WARN  (jetty-launcher-1162-thread-1) [    ] o.e.j.s.AbstractConnector Ignoring deprecated socket close linger time
   [junit4]   2> 402650 INFO  (jetty-launcher-1162-thread-1) [    ] o.a.s.c.s.e.JettySolrRunner Start Jetty (original configured port=0)
   [junit4]   2> 402651 INFO  (jetty-launcher-1162-thread-1) [    ] o.a.s.c.s.e.JettySolrRunner Trying to start Jetty on port 0 try number 1 ...
   [junit4]   2> 402651 INFO  (jetty-launcher-1162-thread-1) [    ] o.e.j.s.Server jetty-9.4.14.v20181114; built: 2018-11-14T21:20:31.478Z; git: c4550056e785fb5665914545889f21dc136ad9e6; jvm 13-testing+0-builds.shipilev.net-openjdk-jdk-b845-20190430-jdk-1318
   [junit4]   2> 402690 INFO  (jetty-launcher-1162-thread-1) [    ] o.e.j.s.session DefaultSessionIdManager workerName=node0
   [junit4]   2> 402690 INFO  (jetty-launcher-1162-thread-1) [    ] o.e.j.s.session No SessionScavenger set, using defaults
   [junit4]   2> 402690 INFO  (jetty-launcher-1162-thread-1) [    ] o.e.j.s.session node0 Scavenging every 600000ms
   [junit4]   2> 402693 INFO  (jetty-launcher-1162-thread-1) [    ] o.e.j.s.h.ContextHandler Started o.e.j.s.ServletContextHandler@89ad86a{/solr,null,AVAILABLE}
   [junit4]   2> 402695 INFO  (jetty-launcher-1162-thread-1) [    ] o.e.j.s.AbstractConnector Started ServerConnector@2594261{HTTP/1.1,[http/1.1, h2c]}{127.0.0.1:42517}
   [junit4]   2> 402695 INFO  (jetty-launcher-1162-thread-1) [    ] o.e.j.s.Server Started @402908ms
   [junit4]   2> 402695 INFO  (jetty-launcher-1162-thread-1) [    ] o.a.s.c.s.e.JettySolrRunner Jetty properties: {hostContext=/solr, hostPort=42517}
   [junit4]   2> 402695 ERROR (jetty-launcher-1162-thread-1) [    ] o.a.s.u.StartupLoggingUtils Missing Java Option solr.log.dir. Logging may be missing or incomplete.
   [junit4]   2> 402695 INFO  (jetty-launcher-1162-thread-1) [    ] o.a.s.s.SolrDispatchFilter Using logger factory org.apache.logging.slf4j.Log4jLoggerFactory
   [junit4]   2> 402696 INFO  (jetty-launcher-1162-thread-1) [    ] o.a.s.s.SolrDispatchFilter  ___      _       Welcome to Apache Solr? version 9.0.0
   [junit4]   2> 402696 INFO  (jetty-launcher-1162-thread-1) [    ] o.a.s.s.SolrDispatchFilter / __| ___| |_ _   Starting in cloud mode on port null
   [junit4]   2> 402696 INFO  (jetty-launcher-1162-thread-1) [    ] o.a.s.s.SolrDispatchFilter \__ \/ _ \ | '_|  Install dir: null
   [junit4]   2> 402696 INFO  (jetty-launcher-1162-thread-1) [    ] o.a.s.s.SolrDispatchFilter |___/\___/_|_|    Start time: 2019-05-09T05:28:59.153114Z
   [junit4]   2> 402742 INFO  (zkConnectionManagerCallback-1164-thread-1) [    ] o.a.s.c.c.ConnectionManager zkClient has connected
   [junit4]   2> 402743 INFO  (jetty-launcher-1162-thread-1) [    ] o.a.s.s.SolrDispatchFilter solr.xml found in ZooKeeper. Loading...
   [junit4]   2> 402862 INFO  (jetty-launcher-1162-thread-1) [    ] o.a.s.h.c.HttpShardHandlerFactory Host whitelist initialized: WhitelistHostChecker [whitelistHosts=null, whitelistHostCheckingEnabled=true]
   [junit4]   2> 402869 WARN  (jetty-launcher-1162-thread-1) [    ] o.e.j.u.s.S.config No Client EndPointIdentificationAlgorithm configured for SslContextFactory@55ee1748[provider=null,keyStore=null,trustStore=null]
   [junit4]   2> 402893 WARN  (jetty-launcher-1162-thread-1) [    ] o.e.j.u.s.S.config No Client EndPointIdentificationAlgorithm configured for SslContextFactory@3db5a2ea[provider=null,keyStore=null,trustStore=null]
   [junit4]   2> 402895 INFO  (jetty-launcher-1162-thread-1) [    ] o.a.s.c.ZkContainer Zookeeper client=127.0.0.1:41663/solr
   [junit4]   2> 402904 INFO  (zkConnectionManagerCallback-1171-thread-1) [    ] o.a.s.c.c.ConnectionManager zkClient has connected
   [junit4]   2> 402913 INFO  (zkConnectionManagerCallback-1173-thread-1) [    ] o.a.s.c.c.ConnectionManager zkClient has connected
   [junit4]   2> 403030 INFO  (jetty-launcher-1162-thread-1) [n:127.0.0.1:42517_solr    ] o.a.s.c.OverseerElectionContext I am going to be the leader 127.0.0.1:42517_solr
   [junit4]   2> 403031 INFO  (jetty-launcher-1162-thread-1) [n:127.0.0.1:42517_solr    ] o.a.s.c.Overseer Overseer (id=72219800502992901-127.0.0.1:42517_solr-n_0000000000) starting
   [junit4]   2> 403042 INFO  (zkConnectionManagerCallback-1180-thread-1) [    ] o.a.s.c.c.ConnectionManager zkClient has connected
   [junit4]   2> 403045 INFO  (jetty-launcher-1162-thread-1) [n:127.0.0.1:42517_solr    ] o.a.s.c.s.i.ZkClientClusterStateProvider Cluster at 127.0.0.1:41663/solr ready
   [junit4]   2> 403046 INFO  (OverseerStateUpdate-72219800502992901-127.0.0.1:42517_solr-n_0000000000) [n:127.0.0.1:42517_solr    ] o.a.s.c.Overseer Starting to work on the main queue : 127.0.0.1:42517_solr
   [junit4]   2> 403055 INFO  (jetty-launcher-1162-thread-1) [n:127.0.0.1:42517_solr    ] o.a.s.c.ZkController Register node as live in ZooKeeper:/live_nodes/127.0.0.1:42517_solr
   [junit4]   2> 403057 INFO  (jetty-launcher-1162-thread-1) [n:127.0.0.1:42517_solr    ] o.a.s.c.CoreContainer Initializing authorization plugin: solr.RuleBasedAuthorizationPlugin
   [junit4]   2> 403063 INFO  (zkCallback-1179-thread-1) [    ] o.a.s.c.c.ZkStateReader Updated live nodes from ZooKeeper... (0) -> (1)
   [junit4]   2> 403079 INFO  (zkCallback-1172-thread-1) [    ] o.a.s.c.c.ZkStateReader Updated live nodes from ZooKeeper... (0) -> (1)
   [junit4]   2> 403374 INFO  (jetty-launcher-1162-thread-1) [n:127.0.0.1:42517_solr    ] o.a.s.c.CoreContainer Initializing authentication plugin: solr.BasicAuthPlugin
   [junit4]   2> 403482 INFO  (jetty-launcher-1162-thread-1) [n:127.0.0.1:42517_solr    ] o.a.s.h.a.MetricsHistoryHandler No .system collection, keeping metrics history in memory.
   [junit4]   2> 403554 INFO  (jetty-launcher-1162-thread-1) [n:127.0.0.1:42517_solr    ] o.a.s.m.r.SolrJmxReporter JMX monitoring for 'solr_42517.solr.node' (registry 'solr.node') enabled at server: com.sun.jmx.mbeanserver.JmxMBeanServer@168bb93d
   [junit4]   2> 403579 INFO  (jetty-launcher-1162-thread-1) [n:127.0.0.1:42517_solr    ] o.a.s.m.r.SolrJmxReporter JMX monitoring for 'solr_42517.solr.jvm' (registry 'solr.jvm') enabled at server: com.sun.jmx.mbeanserver.JmxMBeanServer@168bb93d
   [junit4]   2> 403579 INFO  (jetty-launcher-1162-thread-1) [n:127.0.0.1:42517_solr    ] o.a.s.m.r.SolrJmxReporter JMX monitoring for 'solr_42517.solr.jetty' (registry 'solr.jetty') enabled at server: com.sun.jmx.mbeanserver.JmxMBeanServer@168bb93d
   [junit4]   2> 403581 INFO  (jetty-launcher-1162-thread-1) [n:127.0.0.1:42517_solr    ] o.a.s.c.CorePropertiesLocator Found 0 core definitions underneath /home/jenkins/workspace/Lucene-Solr-master-Linux/solr/build/solr-core/test/J0/temp/solr.cloud.MetricsHistoryWithAuthIntegrationTest_C9DDA6254F404BB5-001/tempDir-001/node1/.
   [junit4]   2> 403634 INFO  (zkConnectionManagerCallback-1186-thread-1) [    ] o.a.s.c.c.ConnectionManager zkClient has connected
   [junit4]   2> 403635 INFO  (SUITE-MetricsHistoryWithAuthIntegrationTest-seed#[C9DDA6254F404BB5]-worker) [    ] o.a.s.c.c.ZkStateReader Updated live nodes from ZooKeeper... (0) -> (1)
   [junit4]   2> 403636 INFO  (SUITE-MetricsHistoryWithAuthIntegrationTest-seed#[C9DDA6254F404BB5]-worker) [    ] o.a.s.c.s.i.ZkClientClusterStateProvider Cluster at 127.0.0.1:41663/solr ready
   [junit4]   2> 405481 DEBUG (MetricsHistoryHandler-869-thread-1) [    ] o.a.s.h.a.MetricsHistoryHandler -- collectMetrics
   [junit4]   2> 405620 INFO  (qtp895686032-3191) [n:127.0.0.1:42517_solr    ] o.a.s.s.HttpSolrCall [admin] webapp=null path=/admin/info/key params={omitHeader=true&wt=json} status=0 QTime=0
   [junit4]   2> 405621 INFO  (qtp895686032-3192) [    ] o.a.s.s.PKIAuthenticationPlugin New Key obtained from  node: 127.0.0.1:42517_solr / MIIBIjANBgkqhkiG9w0BAQEFAAOCAQ8AMIIBCgKCAQEAi5drc3uvHknk2FFsiyYWIegwZFehyoWxHZXM8iAmsXcZVd4G1KIWWn1jnBCbaTZtu5tGeJWDUsQLEe0jpo8t2Xr+cUNGQ9lhvdYq/mnC42UHiN3G7tqmHMJKca9QfonDLJQMKPKdRqw6dne0MlLoI4ulkGCncXL3Hki9GzX8iJP9PNraY2DpS28Yy2eqFgyDSPrKHoMvMxtxs9HX4rbk07GnFQVuIluzPBKyWZZTpyLKOqbr+4eA/RQl3M9Ejn3mkIkXlaVBH9O62lAVkzWDg5ZR9rh0jMevXshwQPic/RBJSYr6SC5L9RSSfFEmc6nomGcFWcryHjhDCT11Bu/0HwIDAQAB
   [junit4]   2> 405625 INFO  (qtp895686032-3192) [n:127.0.0.1:42517_solr    ] o.a.s.s.HttpSolrCall [admin] webapp=null path=/admin/metrics params={wt=javabin&version=2&key=solr.jvm:os.processCpuLoad&key=solr.node:CONTAINER.fs.coreRoot.usableSpace&key=solr.jvm:os.systemLoadAverage&key=solr.jvm:memory.heap.used} status=0 QTime=3
   [junit4]   2> 406977 INFO  (TEST-MetricsHistoryWithAuthIntegrationTest.testValuesAreCollected-seed#[C9DDA6254F404BB5]) [    ] o.a.s.SolrTestCaseJ4 ###Starting testValuesAreCollected
   [junit4]   2> 407212 ERROR (qtp895686032-3191) [n:127.0.0.1:42517_solr    ] o.a.s.h.RequestHandlerBase java.lang.IllegalArgumentException: Null consolidation function specified
   [junit4]   2> 	at org.rrd4j.core.ArcDef.<init>(ArcDef.java:43)
   [junit4]   2> 	at org.rrd4j.core.RrdDb.getRrdDef(RrdDb.java:1237)
   [junit4]   2> 	at org.apache.solr.handler.admin.MetricsHistoryHandler.getDbData(MetricsHistoryHandler.java:879)
   [junit4]   2> 	at org.apache.solr.handler.admin.MetricsHistoryHandler.handleRequestBody(MetricsHistoryHandler.java:745)
   [junit4]   2> 	at org.apache.solr.handler.RequestHandlerBase.handleRequest(RequestHandlerBase.java:199)
   [junit4]   2> 	at org.apache.solr.servlet.HttpSolrCall.handleAdmin(HttpSolrCall.java:796)
   [junit4]   2> 	at org.apache.solr.servlet.HttpSolrCall.handleAdminRequest(HttpSolrCall.java:762)
   [junit4]   2> 	at org.apache.solr.servlet.HttpSolrCall.call(HttpSolrCall.java:522)
   [junit4]   2> 	at org.apache.solr.servlet.SolrDispatchFilter.doFilter(SolrDispatchFilter.java:397)
   [junit4]   2> 	at org.apache.solr.servlet.SolrDispatchFilter.doFilter(SolrDispatchFilter.java:343)
   [junit4]   2> 	at org.eclipse.jetty.servlet.ServletHandler$CachedChain.doFilter(ServletHandler.java:1610)
   [junit4]   2> 	at org.apache.solr.client.solrj.embedded.JettySolrRunner$DebugFilter.doFilter(JettySolrRunner.java:165)
   [junit4]   2> 	at org.eclipse.jetty.servlet.ServletHandler$CachedChain.doFilter(ServletHandler.java:1610)
   [junit4]   2> 	at org.eclipse.jetty.servlet.ServletHandler.doHandle(ServletHandler.java:540)
   [junit4]   2> 	at org.eclipse.jetty.server.handler.ScopedHandler.nextHandle(ScopedHandler.java:255)
   [junit4]   2> 	at org.eclipse.jetty.server.session.SessionHandler.doHandle(SessionHandler.java:1588)
   [junit4]   2> 	at org.eclipse.jetty.server.handler.ScopedHandler.nextHandle(ScopedHandler.java:255)
   [junit4]   2> 	at org.eclipse.jetty.server.handler.ContextHandler.doHandle(ContextHandler.java:1345)
   [junit4]   2> 	at org.eclipse.jetty.server.handler.ScopedHandler.nextScope(ScopedHandler.java:203)
   [junit4]   2> 	at org.eclipse.jetty.servlet.ServletHandler.doScope(ServletHandler.java:480)
   [junit4]   2> 	at org.eclipse.jetty.server.session.SessionHandler.doScope(SessionHandler.java:1557)
   [junit4]   2> 	at org.eclipse.jetty.server.handler.ScopedHandler.nextScope(ScopedHandler.java:201)
   [junit4]   2> 	at org.eclipse.jetty.server.handler.ContextHandler.doScope(ContextHandler.java:1247)
   [junit4]   2> 	at org.eclipse.jetty.server.handler.ScopedHandler.handle(ScopedHandler.java:144)
   [junit4]   2> 	at org.eclipse.jetty.server.handler.gzip.GzipHandler.handle(GzipHandler.java:753)
   [junit4]   2> 	at org.eclipse.jetty.server.handler.HandlerWrapper.handle(HandlerWrapper.java:132)
   [junit4]   2> 	at org.eclipse.jetty.server.Server.handle(Server.java:502)
   [junit4]   2> 	at org.eclipse.jetty.server.HttpChannel.handle(HttpChannel.java:364)
   [junit4]   2> 	at org.eclipse.jetty.server.HttpConnection.onFillable(HttpConnection.java:260)
   [junit4]   2> 	at org.eclipse.jetty.io.AbstractConnection$ReadCallback.succeeded(AbstractConnection.java:305)
   [junit4]   2> 	at org.eclipse.jetty.io.FillInterest.fillable(FillInterest.java:103)
   [junit4]   2> 	at org.eclipse.jetty.io.ChannelEndPoint$2.run(ChannelEndPoint.java:118)
   [junit4]   2> 	at org.eclipse.jetty.util.thread.QueuedThreadPool.runJob(QueuedThreadPool.java:765)
   [junit4]   2> 	at org.eclipse.jetty.util.thread.QueuedThreadPool$2.run(QueuedThreadPool.java:683)
   [junit4]   2> 	at java.base/java.lang.Thread.run(Thread.java:830)
   [junit4]   2> 
   [junit4]   2> 407212 INFO  (qtp895686032-3191) [n:127.0.0.1:42517_solr    ] o.a.s.s.HttpSolrCall [admin] webapp=null path=/admin/metrics/history params={name=solr.jvm&action=get&wt=javabin&version=2} status=500 QTime=190
   [junit4]   2> 407212 ERROR (qtp895686032-3191) [n:127.0.0.1:42517_solr    ] o.a.s.s.HttpSolrCall null:java.lang.IllegalArgumentException: Null consolidation function specified
   [junit4]   2> 	at org.rrd4j.core.ArcDef.<init>(ArcDef.java:43)
   [junit4]   2> 	at org.rrd4j.core.RrdDb.getRrdDef(RrdDb.java:1237)
   [junit4]   2> 	at org.apache.solr.handler.admin.MetricsHistoryHandler.getDbData(MetricsHistoryHandler.java:879)
   [junit4]   2> 	at org.apache.solr.handler.admin.MetricsHistoryHandler.handleRequestBody(MetricsHistoryHandler.java:745)
   [junit4]   2> 	at org.apache.solr.handler.RequestHandlerBase.handleRequest(RequestHandlerBase.java:199)
   [junit4]   2> 	at org.apache.solr.servlet.HttpSolrCall.handleAdmin(HttpSolrCall.java:796)
   [junit4]   2> 	at org.apache.solr.servlet.HttpSolrCall.handleAdminRequest(HttpSolrCall.java:762)
   [junit4]   2> 	at org.apache.solr.servlet.HttpSolrCall.call(HttpSolrCall.java:522)
   [junit4]   2> 	at org.apache.solr.servlet.SolrDispatchFilter.doFilter(SolrDispatchFilter.java:397)
   [junit4]   2> 	at org.apache.solr.servlet.SolrDispatchFilter.doFilter(SolrDispatchFilter.java:343)
   [junit4]   2> 	at org.eclipse.jetty.servlet.ServletHandler$CachedChain.doFilter(ServletHandler.java:1610)
   [junit4]   2> 	at org.apache.solr.client.solrj.embedded.JettySolrRunner$DebugFilter.doFilter(JettySolrRunner.java:165)
   [junit4]   2> 	at org.eclipse.jetty.servlet.ServletHandler$CachedChain.doFilter(ServletHandler.java:1610)
   [junit4]   2> 	at org.eclipse.jetty.servlet.ServletHandler.doHandle(ServletHandler.java:540)
   [junit4]   2> 	at org.eclipse.jetty.server.handler.ScopedHandler.nextHandle(ScopedHandler.java:255)
   [junit4]   2> 	at org.eclipse.jetty.server.session.SessionHandler.doHandle(SessionHandler.java:1588)
   [junit4]   2> 	at org.eclipse.jetty.server.handler.ScopedHandler.nextHandle(ScopedHandler.java:255)
   [junit4]   2> 	at org.eclipse.jetty.server.handler.ContextHandler.doHandle(ContextHandler.java:1345)
   [junit4]   2> 	at org.eclipse.jetty.server.handler.ScopedHandler.nextScope(ScopedHandler.java:203)
   [junit4]   2> 	at org.eclipse.jetty.servlet.ServletHandler.doScope(ServletHandler.java:480)
   [junit4]   2> 	at org.eclipse.jetty.server.session.SessionHandler.doScope(SessionHandler.java:1557)
   [junit4]   2> 	at org.eclipse.jetty.server.handler.ScopedHandler.nextScope(ScopedHandler.java:201)
   [junit4]   2> 	at org.eclipse.jetty.server.handler.ContextHandler.doScope(ContextHandler.java:1247)
   [junit4]   2> 	at org.eclipse.jetty.server.handler.ScopedHandler.handle(ScopedHandler.java:144)
   [junit4]   2> 	at org.eclipse.jetty.server.handler.gzip.GzipHandler.handle(GzipHandler.java:753)
   [junit4]   2> 	at org.eclipse.jetty.server.handler.HandlerWrapper.handle(HandlerWrapper.java:132)
   [junit4]   2> 	at org.eclipse.jetty.server.Server.handle(Server.java:502)
   [junit4]   2> 	at org.eclipse.jetty.server.HttpChannel.handle(HttpChannel.java:364)
   [junit4]   2> 	at org.eclipse.jetty.server.HttpConnection.onFillable(HttpConnection.java:260)
   [junit4]   2> 	at org.eclipse.jetty.io.AbstractConnection$ReadCallback.succeeded(AbstractConnection.java:305)
   [junit4]   2> 	at org.eclipse.jetty.io.FillInterest.fillable(FillInterest.java:103)
   [junit4]   2> 	at org.eclipse.jetty.io.ChannelEndPoint$2.run(ChannelEndPoint.java:118)
   [junit4]   2> 	at org.eclipse.jetty.util.thread.QueuedThreadPool.runJob(QueuedThreadPool.java:765)
   [junit4]   2> 	at org.eclipse.jetty.util.thread.QueuedThreadPool$2.run(QueuedThreadPool.java:683)
   [junit4]   2> 	at java.base/java.lang.Thread.run(Thread.java:830)
   [junit4]   2> 
   [junit4]   2> 407228 INFO  (TEST-MetricsHistoryWithAuthIntegrationTest.testValuesAreCollected-seed#[C9DDA6254F404BB5]) [    ] o.a.s.SolrTestCaseJ4 ###Ending testValuesAreCollected
   [junit4]   2> NOTE: reproduce with: ant test  -Dtestcase=MetricsHistoryWithAuthIntegrationTest -Dtests.method=testValuesAreCollected -Dtests.seed=C9DDA6254F404BB5 -Dtests.multiplier=3 -Dtests.slow=true -Dtests.locale=en-DM -Dtests.timezone=Africa/Ouagadougou -Dtests.asserts=true -Dtests.file.encoding=US-ASCII
   [junit4] ERROR   0.61s J0 | MetricsHistoryWithAuthIntegrationTest.testValuesAreCollected <<<
   [junit4]    > Throwable #1: org.apache.solr.client.solrj.impl.HttpSolrClient$RemoteSolrException: Error from server at http://127.0.0.1:42517/solr: Null consolidation function specified
   [junit4]    > 	at __randomizedtesting.SeedInfo.seed([C9DDA6254F404BB5:E120FB429EA4D4F0]:0)
   [junit4]    > 	at org.apache.solr.client.solrj.impl.HttpSolrClient.executeMethod(HttpSolrClient.java:649)
   [junit4]    > 	at org.apache.solr.client.solrj.impl.HttpSolrClient.request(HttpSolrClient.java:255)
   [junit4]    > 	at org.apache.solr.client.solrj.impl.HttpSolrClient.request(HttpSolrClient.java:244)
   [junit4]    > 	at org.apache.solr.client.solrj.impl.LBSolrClient.doRequest(LBSolrClient.java:368)
   [junit4]    > 	at org.apache.solr.client.solrj.impl.LBSolrClient.request(LBSolrClient.java:296)
   [junit4]    > 	at org.apache.solr.client.solrj.impl.BaseCloudSolrClient.sendRequest(BaseCloudSolrClient.java:1068)
   [junit4]    > 	at org.apache.solr.client.solrj.impl.BaseCloudSolrClient.requestWithRetryOnStaleState(BaseCloudSolrClient.java:837)
   [junit4]    > 	at org.apache.solr.client.solrj.impl.BaseCloudSolrClient.request(BaseCloudSolrClient.java:769)
   [junit4]    > 	at org.apache.solr.client.solrj.SolrClient.request(SolrClient.java:1274)
   [junit4]    > 	at org.apache.solr.cloud.MetricsHistoryWithAuthIntegrationTest.testValuesAreCollected(MetricsHistoryWithAuthIntegrationTest.java:81)
   [junit4]    > 	at java.base/jdk.internal.reflect.NativeMethodAccessorImpl.invoke0(Native Method)
   [junit4]    > 	at java.base/jdk.internal.reflect.NativeMethodAccessorImpl.invoke(NativeMethodAccessorImpl.java:62)
   [junit4]    > 	at java.base/jdk.internal.reflect.DelegatingMethodAccessorImpl.invoke(DelegatingMethodAccessorImpl.java:43)
   [junit4]    > 	at java.base/java.lang.reflect.Method.invoke(Method.java:567)
   [junit4]    > 	at java.base/java.lang.Thread.run(Thread.java:830)
   [junit4]   2> 407255 INFO  (jetty-closer-1187-thread-1) [    ] o.a.s.c.CoreContainer Shutting down CoreContainer instance=1497385938
   [junit4]   2> 407255 INFO  (jetty-closer-1187-thread-1) [    ] o.a.s.c.ZkController Remove node as live in ZooKeeper:/live_nodes/127.0.0.1:42517_solr
   [junit4]   2> 407258 INFO  (jetty-closer-1187-thread-1) [    ] o.a.s.c.ZkController Publish this node as DOWN...
   [junit4]   2> 407258 INFO  (jetty-closer-1187-thread-1) [    ] o.a.s.c.ZkController Publish node=127.0.0.1:42517_solr as DOWN
   [junit4]   2> 407264 INFO  (jetty-closer-1187-thread-1) [    ] o.a.s.c.TransientSolrCoreCacheDefault Allocating transient cache for 2147483647 transient cores
   [junit4]   2> 407265 DEBUG (jetty-closer-1187-thread-1) [    ] o.a.s.h.a.MetricsHistoryHandler Closing 1990616017
   [junit4]   2> 407375 INFO  (jetty-closer-1187-thread-1) [    ] o.a.s.m.SolrMetricManager Closing metric reporters for registry=solr.node, tag=null
   [junit4]   2> 407375 INFO  (jetty-closer-1187-thread-1) [    ] o.a.s.m.r.SolrJmxReporter Closing reporter [org.apache.solr.metrics.reporters.SolrJmxReporter@32a67d30: rootName = solr_42517, domain = solr.node, service url = null, agent id = null] for registry solr.node / com.codahale.metrics.MetricRegistry@2ba23cbc
   [junit4]   2> 407386 INFO  (jetty-closer-1187-thread-1) [    ] o.a.s.m.SolrMetricManager Closing metric reporters for registry=solr.jvm, tag=null
   [junit4]   2> 407386 INFO  (jetty-closer-1187-thread-1) [    ] o.a.s.m.r.SolrJmxReporter Closing reporter [org.apache.solr.metrics.reporters.SolrJmxReporter@5c8f1d15: rootName = solr_42517, domain = solr.jvm, service url = null, agent id = null] for registry solr.jvm / com.codahale.metrics.MetricRegistry@9aabb20
   [junit4]   2> 407392 INFO  (jetty-closer-1187-thread-1) [    ] o.a.s.m.SolrMetricManager Closing metric reporters for registry=solr.jetty, tag=null
   [junit4]   2> 407392 INFO  (jetty-closer-1187-thread-1) [    ] o.a.s.m.r.SolrJmxReporter Closing reporter [org.apache.solr.metrics.reporters.SolrJmxReporter@7de69ae6: rootName = solr_42517, domain = solr.jetty, service url = null, agent id = null] for registry solr.jetty / com.codahale.metrics.MetricRegistry@5ba6c32f
   [junit4]   2> 407394 INFO  (jetty-closer-1187-thread-1) [    ] o.a.s.m.SolrMetricManager Closing metric reporters for registry=solr.cluster, tag=null
   [junit4]   2> 407400 INFO  (closeThreadPool-1191-thread-2) [    ] o.a.s.c.Overseer Overseer (id=72219800502992901-127.0.0.1:42517_solr-n_0000000000) closing
   [junit4]   2> 407402 INFO  (OverseerStateUpdate-72219800502992901-127.0.0.1:42517_solr-n_0000000000) [n:127.0.0.1:42517_solr    ] o.a.s.c.Overseer Overseer Loop exiting : 127.0.0.1:42517_solr
   [junit4]   2> 407402 INFO  (OverseerAutoScalingTriggerThread-72219800502992901-127.0.0.1:42517_solr-n_0000000000) [    ] o.a.s.c.a.OverseerTriggerThread OverseerTriggerThread woken up but we are closed, exiting.
   [junit4]   2> 407406 WARN  (NIOServerCxn.Factory:0.0.0.0/0.0.0.0:0) [    ] o.a.z.s.NIOServerCnxn Unable to read additional data from client sessionid 0x1009386a2bb0006, likely client has closed socket
   [junit4]   2> 407406 INFO  (jetty-closer-1187-thread-1) [    ] o.a.s.c.Overseer Overseer (id=72219800502992901-127.0.0.1:42517_solr-n_0000000000) closing
   [junit4]   2> 407406 INFO  (closeThreadPool-1191-thread-1) [    ] o.a.s.c.Overseer Overseer (id=72219800502992901-127.0.0.1:42517_solr-n_0000000000) closing
   [junit4]   2> 407408 INFO  (jetty-closer-1187-thread-1) [    ] o.e.j.s.AbstractConnector Stopped ServerConnector@2594261{HTTP/1.1,[http/1.1, h2c]}{127.0.0.1:0}
   [junit4]   2> 407408 INFO  (jetty-closer-1187-thread-1) [    ] o.e.j.s.h.ContextHandler Stopped o.e.j.s.ServletContextHandler@89ad86a{/solr,null,UNAVAILABLE}
   [junit4]   2> 407408 INFO  (jetty-closer-1187-thread-1) [    ] o.e.j.s.session node0 Stopped scavenging
   [junit4]   2> 407410 INFO  (SUITE-MetricsHistoryWithAuthIntegrationTest-seed#[C9DDA6254F404BB5]-worker) [    ] o.a.s.c.ZkTestServer Shutting down ZkTestServer.
   [junit4]   2> 407412 WARN  (ZkTestServer Run Thread) [    ] o.a.s.c.ZkTestServer Watch limit violations: 
   [junit4]   2> Maximum concurrent create/delete watches above limit:
   [junit4]   2> 
   [junit4]   2> 	3	/solr/aliases.json
   [junit4]   2> 	3	/solr/clusterprops.json
   [junit4]   2> 
   [junit4]   2> Maximum concurrent data watches above limit:
   [junit4]   2> 
   [junit4]   2> 	3	/solr/clusterstate.json
   [junit4]   2> 
   [junit4]   2> Maximum concurrent children watches above limit:
   [junit4]   2> 
   [junit4]   2> 	3	/solr/live_nodes
   [junit4]   2> 	3	/solr/collections
   [junit4]   2> 
   [junit4]   2> 407415 INFO  (SUITE-MetricsHistoryWithAuthIntegrationTest-seed#[C9DDA6254F404BB5]-worker) [    ] o.a.s.c.ZkTestServer parse host and port list: 127.0.0.1:41663
   [junit4]   2> 407415 INFO  (SUITE-MetricsHistoryWithAuthIntegrationTest-seed#[C9DDA6254F404BB5]-worker) [    ] o.a.s.c.ZkTestServer connecting to 127.0.0.1 41663
   [junit4]   2> NOTE: leaving temporary files on disk at: /home/jenkins/workspace/Lucene-Solr-master-Linux/solr/build/solr-core/test/J0/temp/solr.cloud.MetricsHistoryWithAuthIntegrationTest_C9DDA6254F404BB5-001
   [junit4]   2> May 09, 2019 5:29:03 AM com.carrotsearch.randomizedtesting.ThreadLeakControl checkThreadLeaks
   [junit4]   2> WARNING: Will linger awaiting termination of 5 leaked thread(s).
   [junit4]   2> NOTE: test params are: codec=Asserting(Lucene80): {}, docValues:{}, maxPointsInLeafNode=619, maxMBSortInHeap=6.735202503266683, sim=Asserting(org.apache.lucene.search.similarities.AssertingSimilarity@4621646c), locale=en-DM, timezone=Africa/Ouagadougou
   [junit4]   2> NOTE: Linux 4.18.0-17-generic amd64/Aleksey Shipilev 13-testing (64-bit)/cpus=8,threads=1,free=173337136,total=440401920
   [junit4]   2> NOTE: All tests run in this JVM: [TestRequestStatusCollectionAPI, AddReplicaTest, ZkShardTermsTest, TestStressReorder, TestHdfsCloudBackupRestore, TestFileDictionaryLookup, PKIAuthenticationIntegrationTest, TestPayloadScoreQParserPlugin, UUIDFieldTest, SimpleCollectionCreateDeleteTest, TestTolerantUpdateProcessorRandomCloud, GraphQueryTest, TestDelegationWithHadoopAuth, TestExclusionRuleCollectionAccess, ZkControllerTest, NodeMarkersRegistrationTest, UnloadDistributedZkTest, TestLegacyNumericUtils, TestScoreJoinQPNoScore, TestJsonFacetsStatsParsing, SharedFSAutoReplicaFailoverTest, CursorPagingTest, RegexBoostProcessorTest, OverseerCollectionConfigSetProcessorTest, MetricsHistoryWithAuthIntegrationTest]
   [junit4] Completed [73/856 (1!)] on J0 in 6.92s, 1 test, 1 error <<< FAILURES!

[...truncated 707 lines...]
   [junit4] Suite: org.apache.solr.security.BasicAuthIntegrationTest
   [junit4]   2> Creating dataDir: /home/jenkins/workspace/Lucene-Solr-master-Linux/solr/build/solr-core/test/J1/temp/solr.security.BasicAuthIntegrationTest_C9DDA6254F404BB5-001/init-core-data-001
   [junit4]   2> 1165750 INFO  (SUITE-BasicAuthIntegrationTest-seed#[C9DDA6254F404BB5]-worker) [    ] o.a.s.SolrTestCaseJ4 SecureRandom sanity checks: test.solr.allowed.securerandom=null & java.security.egd=file:/dev/./urandom
   [junit4]   2> 1165751 WARN  (SUITE-BasicAuthIntegrationTest-seed#[C9DDA6254F404BB5]-worker) [    ] o.a.s.SolrTestCaseJ4 startTrackingSearchers: numOpens=16 numCloses=16
   [junit4]   2> 1165751 INFO  (SUITE-BasicAuthIntegrationTest-seed#[C9DDA6254F404BB5]-worker) [    ] o.a.s.SolrTestCaseJ4 Using PointFields (NUMERIC_POINTS_SYSPROP=true) w/NUMERIC_DOCVALUES_SYSPROP=false
   [junit4]   2> 1165753 INFO  (SUITE-BasicAuthIntegrationTest-seed#[C9DDA6254F404BB5]-worker) [    ] o.a.s.SolrTestCaseJ4 Randomized ssl (false) and clientAuth (false) via: @org.apache.solr.util.RandomizeSSL(reason="", value=0.0/0.0, ssl=0.0/0.0, clientAuth=0.0/0.0)
   [junit4]   2> 1165756 INFO  (TEST-BasicAuthIntegrationTest.testBasicAuth-seed#[C9DDA6254F404BB5]) [    ] o.a.s.SolrTestCaseJ4 ###Starting testBasicAuth
   [junit4]   2> 1165756 INFO  (TEST-BasicAuthIntegrationTest.testBasicAuth-seed#[C9DDA6254F404BB5]) [    ] o.a.s.c.MiniSolrCloudCluster Starting cluster of 3 servers in /home/jenkins/workspace/Lucene-Solr-master-Linux/solr/build/solr-core/test/J1/temp/solr.security.BasicAuthIntegrationTest_C9DDA6254F404BB5-001/tempDir-001
   [junit4]   2> 1165757 INFO  (TEST-BasicAuthIntegrationTest.testBasicAuth-seed#[C9DDA6254F404BB5]) [    ] o.a.s.c.ZkTestServer STARTING ZK TEST SERVER
   [junit4]   2> 1165771 INFO  (ZkTestServer Run Thread) [    ] o.a.s.c.ZkTestServer client port:0.0.0.0/0.0.0.0:0
   [junit4]   2> 1165771 INFO  (ZkTestServer Run Thread) [    ] o.a.s.c.ZkTestServer Starting server
   [junit4]   2> 1165871 INFO  (TEST-BasicAuthIntegrationTest.testBasicAuth-seed#[C9DDA6254F404BB5]) [    ] o.a.s.c.ZkTestServer start zk server on port:38531
   [junit4]   2> 1165871 INFO  (TEST-BasicAuthIntegrationTest.testBasicAuth-seed#[C9DDA6254F404BB5]) [    ] o.a.s.c.ZkTestServer parse host and port list: 127.0.0.1:38531
   [junit4]   2> 1165871 INFO  (TEST-BasicAuthIntegrationTest.testBasicAuth-seed#[C9DDA6254F404BB5]) [    ] o.a.s.c.ZkTestServer connecting to 127.0.0.1 38531
   [junit4]   2> 1165915 INFO  (zkConnectionManagerCallback-6542-thread-1) [    ] o.a.s.c.c.ConnectionManager zkClient has connected
   [junit4]   2> 1165954 INFO  (zkConnectionManagerCallback-6544-thread-1) [    ] o.a.s.c.c.ConnectionManager zkClient has connected
   [junit4]   2> 1165969 INFO  (zkConnectionManagerCallback-6546-thread-1) [    ] o.a.s.c.c.ConnectionManager zkClient has connected
   [junit4]   2> 1165974 WARN  (jetty-launcher-6547-thread-1) [    ] o.e.j.s.AbstractConnector Ignoring deprecated socket close linger time
   [junit4]   2> 1165974 INFO  (jetty-launcher-6547-thread-1) [    ] o.a.s.c.s.e.JettySolrRunner Start Jetty (original configured port=0)
   [junit4]   2> 1165975 INFO  (jetty-launcher-6547-thread-1) [    ] o.a.s.c.s.e.JettySolrRunner Trying to start Jetty on port 0 try number 1 ...
   [junit4]   2> 1165975 INFO  (jetty-launcher-6547-thread-1) [    ] o.e.j.s.Server jetty-9.4.14.v20181114; built: 2018-11-14T21:20:31.478Z; git: c4550056e785fb5665914545889f21dc136ad9e6; jvm 13-testing+0-builds.shipilev.net-openjdk-jdk-b845-20190430-jdk-1318
   [junit4]   2> 1165975 WARN  (jetty-launcher-6547-thread-2) [    ] o.e.j.s.AbstractConnector Ignoring deprecated socket close linger time
   [junit4]   2> 1165976 INFO  (jetty-launcher-6547-thread-2) [    ] o.a.s.c.s.e.JettySolrRunner Start Jetty (original configured port=0)
   [junit4]   2> 1165976 INFO  (jetty-launcher-6547-thread-2) [    ] o.a.s.c.s.e.JettySolrRunner Trying to start Jetty on port 0 try number 1 ...
   [junit4]   2> 1165976 INFO  (jetty-launcher-6547-thread-2) [    ] o.e.j.s.Server jetty-9.4.14.v20181114; built: 2018-11-14T21:20:31.478Z; git: c4550056e785fb5665914545889f21dc136ad9e6; jvm 13-testing+0-builds.shipilev.net-openjdk-jdk-b845-20190430-jdk-1318
   [junit4]   2> 1165977 WARN  (jetty-launcher-6547-thread-3) [    ] o.e.j.s.AbstractConnector Ignoring deprecated socket close linger time
   [junit4]   2> 1165977 INFO  (jetty-launcher-6547-thread-3) [    ] o.a.s.c.s.e.JettySolrRunner Start Jetty (original configured port=0)
   [junit4]   2> 1165977 INFO  (jetty-launcher-6547-thread-3) [    ] o.a.s.c.s.e.JettySolrRunner Trying to start Jetty on port 0 try number 1 ...
   [junit4]   2> 1165977 INFO  (jetty-launcher-6547-thread-3) [    ] o.e.j.s.Server jetty-9.4.14.v20181114; built: 2018-11-14T21:20:31.478Z; git: c4550056e785fb5665914545889f21dc136ad9e6; jvm 13-testing+0-builds.shipilev.net-openjdk-jdk-b845-20190430-jdk-1318
   [junit4]   2> 1165978 INFO  (jetty-launcher-6547-thread-1) [    ] o.e.j.s.session DefaultSessionIdManager workerName=node0
   [junit4]   2> 1165978 INFO  (jetty-launcher-6547-thread-1) [    ] o.e.j.s.session No SessionScavenger set, using defaults
   [junit4]   2> 1165978 INFO  (jetty-launcher-6547-thread-1) [    ] o.e.j.s.session node0 Scavenging every 660000ms
   [junit4]   2> 1165984 INFO  (jetty-launcher-6547-thread-1) [    ] o.e.j.s.h.ContextHandler Started o.e.j.s.ServletContextHandler@18960a79{/solr,null,AVAILABLE}
   [junit4]   2> 1166035 INFO  (jetty-launcher-6547-thread-1) [    ] o.e.j.s.AbstractConnector Started ServerConnector@3d80b0b2{HTTP/1.1,[http/1.1, h2c]}{127.0.0.1:44507}
   [junit4]   2> 1166035 INFO  (jetty-launcher-6547-thread-1) [    ] o.e.j.s.Server Started @1166267ms
   [junit4]   2> 1166035 INFO  (jetty-launcher-6547-thread-1) [    ] o.a.s.c.s.e.JettySolrRunner Jetty properties: {hostContext=/solr, hostPort=44507}
   [junit4]   2> 1166036 ERROR (jetty-launcher-6547-thread-1) [    ] o.a.s.u.StartupLoggingUtils Missing Java Option solr.log.dir. Logging may be missing or incomplete.
   [junit4]   2> 1166036 INFO  (jetty-launcher-6547-thread-1) [    ] o.a.s.s.SolrDispatchFilter Using logger factory org.apache.logging.slf4j.Log4jLoggerFactory
   [junit4]   2> 1166036 INFO  (jetty-launcher-6547-thread-1) [    ] o.a.s.s.SolrDispatchFilter  ___      _       Welcome to Apache Solr? version 9.0.0
   [junit4]   2> 1166036 INFO  (jetty-launcher-6547-thread-1) [    ] o.a.s.s.SolrDispatchFilter / __| ___| |_ _   Starting in cloud mode on port null
   [junit4]   2> 1166036 INFO  (jetty-launcher-6547-thread-1) [    ] o.a.s.s.SolrDispatchFilter \__ \/ _ \ | '_|  Install dir: null
   [junit4]   2> 1166036 INFO  (jetty-launcher-6547-thread-1) [    ] o.a.s.s.SolrDispatchFilter |___/\___/_|_|    Start time: 2019-05-09T05:41:42.492501Z
   [junit4]   2> 1166054 INFO  (jetty-launcher-6547-thread-3) [    ] o.e.j.s.session DefaultSessionIdManager workerName=node0
   [junit4]   2> 1166054 INFO  (jetty-launcher-6547-thread-3) [    ] o.e.j.s.session No SessionScavenger set, using defaults
   [junit4]   2> 1166054 INFO  (jetty-launcher-6547-thread-3) [    ] o.e.j.s.session node0 Scavenging every 660000ms
   [junit4]   2> 1166056 INFO  (jetty-launcher-6547-thread-3) [    ] o.e.j.s.h.ContextHandler Started o.e.j.s.ServletContextHandler@15302fef{/solr,null,AVAILABLE}
   [junit4]   2> 1166056 INFO  (jetty-launcher-6547-thread-3) [    ] o.e.j.s.AbstractConnector Started ServerConnector@4fff9e02{HTTP/1.1,[http/1.1, h2c]}{127.0.0.1:36283}
   [junit4]   2> 1166056 INFO  (jetty-launcher-6547-thread-3) [    ] o.e.j.s.Server Started @1166288ms
   [junit4]   2> 1166056 INFO  (jetty-launcher-6547-thread-3) [    ] o.a.s.c.s.e.JettySolrRunner Jetty properties: {hostContext=/solr, hostPort=36283}
   [junit4]   2> 1166057 ERROR (jetty-launcher-6547-thread-3) [    ] o.a.s.u.StartupLoggingUtils Missing Java Option solr.log.dir. Logging may be missing or incomplete.
   [junit4]   2> 1166057 INFO  (jetty-launcher-6547-thread-3) [    ] o.a.s.s.SolrDispatchFilter Using logger factory org.apache.logging.slf4j.Log4jLoggerFactory
   [junit4]   2> 1166057 INFO  (jetty-launcher-6547-thread-3) [    ] o.a.s.s.SolrDispatchFilter  ___      _       Welcome to Apache Solr? version 9.0.0
   [junit4]   2> 1166057 INFO  (jetty-launcher-6547-thread-3) [    ] o.a.s.s.SolrDispatchFilter / __| ___| |_ _   Starting in cloud mode on port null
   [junit4]   2> 1166057 INFO  (jetty-launcher-6547-thread-3) [    ] o.a.s.s.SolrDispatchFilter \__ \/ _ \ | '_|  Install dir: null
   [junit4]   2> 1166057 INFO  (jetty-launcher-6547-thread-3) [    ] o.a.s.s.SolrDispatchFilter |___/\___/_|_|    Start time: 2019-05-09T05:41:42.513311Z
   [junit4]   2> 1166111 INFO  (zkConnectionManagerCallback-6549-thread-1) [    ] o.a.s.c.c.ConnectionManager zkClient has connected
   [junit4]   2> 1166112 INFO  (jetty-launcher-6547-thread-1) [    ] o.a.s.s.SolrDispatchFilter solr.xml found in ZooKeeper. Loading...
   [junit4]   2> 1166124 INFO  (zkConnectionManagerCallback-6551-thread-1) [    ] o.a.s.c.c.ConnectionManager zkClient has connected
   [junit4]   2> 1166125 INFO  (jetty-launcher-6547-thread-3) [    ] o.a.s.s.SolrDispatchFilter solr.xml found in ZooKeeper. Loading...
   [junit4]   2> 1166149 INFO  (jetty-launcher-6547-thread-2) [    ] o.e.j.s.session DefaultSessionIdManager workerName=node0
   [junit4]   2> 1166149 INFO  (jetty-launcher-6547-thread-2) [    ] o.e.j.s.session No SessionScavenger set, using defaults
   [junit4]   2> 1166149 INFO  (jetty-launcher-6547-thread-2) [    ] o.e.j.s.session node0 Scavenging every 600000ms
   [junit4]   2> 1166151 INFO  (jetty-launcher-6547-thread-2) [    ] o.e.j.s.h.ContextHandler Started o.e.j.s.ServletContextHandler@73f12aef{/solr,null,AVAILABLE}
   [junit4]   2> 1166151 INFO  (jetty-launcher-6547-thread-2) [    ] o.e.j.s.AbstractConnector Started ServerConnector@63bb6c1f{HTTP/1.1,[http/1.1, h2c]}{127.0.0.1:42889}
   [junit4]   2> 1166151 INFO  (jetty-launcher-6547-thread-2) [    ] o.e.j.s.Server Started @1166383ms
   [junit4]   2> 1166151 INFO  (jetty-launcher-6547-thread-2) [    ] o.a.s.c.s.e.JettySolrRunner Jetty properties: {hostContext=/solr, hostPort=42889}
   [junit4]   2> 1166152 ERROR (jetty-launcher-6547-thread-2) [    ] o.a.s.u.StartupLoggingUtils Missing Java Option solr.log.dir. Logging may be missing or incomplete.
   [junit4]   2> 1166152 INFO  (jetty-launcher-6547-thread-2) [    ] o.a.s.s.SolrDispatchFilter Using logger factory org.apache.logging.slf4j.Log4jLoggerFactory
   [junit4]   2> 1166152 INFO  (jetty-launcher-6547-thread-2) [    ] o.a.s.s.SolrDispatchFilter  ___      _       Welcome to Apache Solr? version 9.0.0
   [junit4]   2> 1166152 INFO  (jetty-launcher-6547-thread-2) [    ] o.a.s.s.SolrDispatchFilter / __| ___| |_ _   Starting in cloud mode on port null
   [junit4]   2> 1166152 INFO  (jetty-launcher-6547-thread-2) [    ] o.a.s.s.SolrDispatchFilter \__ \/ _ \ | '_|  Install dir: null
   [junit4]   2> 1166152 INFO  (jetty-launcher-6547-thread-2) [    ] o.a.s.s.SolrDispatchFilter |___/\___/_|_|    Start time: 2019-05-09T05:41:42.608257Z
   [junit4]   2> 1166198 INFO  (zkConnectionManagerCallback-6554-thread-1) [    ] o.a.s.c.c.ConnectionManager zkClient has connected
   [junit4]   2> 1166199 INFO  (jetty-launcher-6547-thread-2) [    ] o.a.s.s.SolrDispatchFilter solr.xml found in ZooKeeper. Loading...
   [junit4]   2> 1166260 INFO  (jetty-launcher-6547-thread-1) [    ] o.a.s.h.c.HttpShardHandlerFactory Host whitelist initialized: WhitelistHostChecker [whitelistHosts=null, whitelistHostCheckingEnabled=true]
   [junit4]   2> 1166276 WARN  (jetty-launcher-6547-thread-1) [    ] o.e.j.u.s.S.config No Client EndPointIdentificationAlgorithm configured for SslContextFactory@18ae7e9[provider=null,keyStore=null,trustStore=null]
   [junit4]   2> 1166308 WARN  (jetty-launcher-6547-thread-1) [    ] o.e.j.u.s.S.config No Client EndPointIdentificationAlgorithm configured for SslContextFactory@1bef1b95[provider=null,keyStore=null,trustStore=null]
   [junit4]   2> 1166349 INFO  (jetty-launcher-6547-thread-1) [    ] o.a.s.c.ZkContainer Zookeeper client=127.0.0.1:38531/solr
   [junit4]   2> 1166365 INFO  (jetty-launcher-6547-thread-3) [    ] o.a.s.h.c.HttpShardHandlerFactory Host whitelist initialized: WhitelistHostChecker [whitelistHosts=null, whitelistHostCheckingEnabled=true]
   [junit4]   2> 1166383 INFO  (jetty-launcher-6547-thread-2) [    ] o.a.s.h.c.HttpShardHandlerFactory Host whitelist initialized: WhitelistHostChecker [whitelistHosts=null, whitelistHostCheckingEnabled=true]
   [junit4]   2> 1166384 WARN  (jetty-launcher-6547-thread-3) [    ] o.e.j.u.s.S.config No Client EndPointIdentificationAlgorithm configured for SslContextFactory@322ef0f9[provider=null,keyStore=null,trustStore=null]
   [junit4]   2> 1166395 INFO  (zkConnectionManagerCallback-6562-thread-1) [    ] o.a.s.c.c.ConnectionManager zkClient has connected
   [junit4]   2> 1166406 WARN  (jetty-launcher-6547-thread-2) [    ] o.e.j.u.s.S.config No Client EndPointIdentificationAlgorithm configured for SslContextFactory@2ca36ecf[provider=null,keyStore=null,trustStore=null]
   [junit4]   2> 1166426 WARN  (jetty-launcher-6547-thread-3) [    ] o.e.j.u.s.S.config No Client EndPointIdentificationAlgorithm configured for SslContextFactory@6244ef4f[provider=null,keyStore=null,trustStore=null]
   [junit4]   2> 1166426 WARN  (jetty-launcher-6547-thread-2) [    ] o.e.j.u.s.S.config No Client EndPointIdentificationAlgorithm configured for SslContextFactory@62dbeac0[provider=null,keyStore=null,trustStore=null]
   [junit4]   2> 1166427 INFO  (jetty-launcher-6547-thread-2) [    ] o.a.s.c.ZkContainer Zookeeper client=127.0.0.1:38531/solr
   [junit4]   2> 1166427 INFO  (jetty-launcher-6547-thread-3) [    ] o.a.s.c.ZkContainer Zookeeper client=127.0.0.1:38531/solr
   [junit4]   2> 1166430 INFO  (zkConnectionManagerCallback-6568-thread-1) [    ] o.a.s.c.c.ConnectionManager zkClient has connected
   [junit4]   2> 1166443 INFO  (zkConnectionManagerCallback-6574-thread-1) [    ] o.a.s.c.c.ConnectionManager zkClient has connected
   [junit4]   2> 1166448 INFO  (zkConnectionManagerCallback-6576-thread-1) [    ] o.a.s.c.c.ConnectionManager zkClient has connected
   [junit4]   2> 1166511 INFO  (zkConnectionManagerCallback-6580-thread-1) [    ] o.a.s.c.c.ConnectionManager zkClient has connected
   [junit4]   2> 1166522 INFO  (jetty-launcher-6547-thread-2) [n:127.0.0.1:42889_solr    ] o.a.s.c.OverseerElectionContext I am going to be the leader 127.0.0.1:42889_solr
   [junit4]   2> 1166526 INFO  (jetty-launcher-6547-thread-2) [n:127.0.0.1:42889_solr    ] o.a.s.c.Overseer Overseer (id=72219850524590090-127.0.0.1:42889_solr-n_0000000000) starting
   [junit4]   2> 1166534 INFO  (zkConnectionManagerCallback-6589-thread-1) [    ] o.a.s.c.c.ConnectionManager zkClient has connected
   [junit4]   2> 1166539 INFO  (jetty-launcher-6547-thread-2) [n:127.0.0.1:42889_solr    ] o.a.s.c.s.i.ZkClientClusterStateProvider Cluster at 127.0.0.1:38531/solr ready
   [junit4]   2> 1166540 INFO  (zkConnectionManagerCallback-6582-thread-1) [    ] o.a.s.c.c.ConnectionManager zkClient has connected
   [junit4]   2> 1166542 INFO  (OverseerStateUpdate-72219850524590090-127.0.0.1:42889_solr-n_0000000000) [n:127.0.0.1:42889_solr    ] o.a.s.c.Overseer Starting to work on the main queue : 127.0.0.1:42889_solr
   [junit4]   2> 1166556 INFO  (jetty-launcher-6547-thread-3) [n:127.0.0.1:36283_solr    ] o.a.s.c.ZkController Register node as live in ZooKeeper:/live_nodes/127.0.0.1:36283_solr
   [junit4]   2> 1166564 INFO  (jetty-launcher-6547-thread-2) [n:127.0.0.1:42889_solr    ] o.a.s.c.ZkController Publish node=127.0.0.1:42889_solr as DOWN
   [junit4]   2> 1166566 INFO  (jetty-launcher-6547-thread-2) [n:127.0.0.1:42889_solr    ] o.a.s.c.TransientSolrCoreCacheDefault Allocating transient cache for 2147483647 transient cores
   [junit4]   2> 1166566 INFO  (jetty-launcher-6547-thread-2) [n:127.0.0.1:42889_solr    ] o.a.s.c.ZkController Register node as live in ZooKeeper:/live_nodes/127.0.0.1:42889_solr
   [junit4]   2> 1166574 INFO  (zkCallback-6579-thread-1) [    ] o.a.s.c.c.ZkStateReader Updated live nodes from ZooKeeper... (0) -> (2)
   [junit4]   2> 1166579 INFO  (jetty-launcher-6547-thread-1) [n:127.0.0.1:44507_solr    ] o.a.s.c.c.ZkStateReader Updated live nodes from ZooKeeper... (0) -> (2)
   [junit4]   2> 1166582 INFO  (jetty-launcher-6547-thread-1) [n:127.0.0.1:44507_solr    ] o.a.s.c.ZkController Publish node=127.0.0.1:44507_solr as DOWN
   [junit4]   2> 1166583 INFO  (jetty-launcher-6547-thread-1) [n:127.0.0.1:44507_solr    ] o.a.s.c.TransientSolrCoreCacheDefault Allocating transient cache for 2147483647 transient cores
   [junit4]   2> 1166583 INFO  (jetty-launcher-6547-thread-1) [n:127.0.0.1:44507_solr    ] o.a.s.c.ZkController Register node as live in ZooKeeper:/live_nodes/127.0.0.1:44507_solr
   [junit4]   2> 1166587 INFO  (zkCallback-6581-thread-1) [    ] o.a.s.c.c.ZkStateReader Updated live nodes from ZooKeeper... (0) -> (3)
   [junit4]   2> 1166600 INFO  (zkCallback-6588-thread-1) [    ] o.a.s.c.c.ZkStateReader Updated live nodes from ZooKeeper... (0) -> (3)
   [junit4]   2> 1166600 INFO  (zkCallback-6567-thread-1) [    ] o.a.s.c.c.ZkStateReader Updated live nodes from ZooKeeper... (2) -> (3)
   [junit4]   2> 1166604 INFO  (zkCallback-6579-thread-1) [    ] o.a.s.c.c.ZkStateReader Updated live nodes from ZooKeeper... (2) -> (3)
   [junit4]   2> 1166623 INFO  (jetty-launcher-6547-thread-2) [n:127.0.0.1:42889_solr    ] o.a.s.h.a.MetricsHistoryHandler No .system collection, keeping metrics history in memory.
   [junit4]   2> 1166665 INFO  (jetty-launcher-6547-thread-2) [n:127.0.0.1:42889_solr    ] o.a.s.m.r.SolrJmxReporter JMX monitoring for 'solr_42889.solr.node' (registry 'solr.node') enabled at server: com.sun.jmx.mbeanserver.JmxMBeanServer@3735af3e
   [junit4]   2> 1166675 INFO  (zkConnectionManagerCallback-6596-thread-1) [    ] o.a.s.c.c.ConnectionManager zkClient has connected
   [junit4]   2> 1166677 INFO  (jetty-launcher-6547-thread-3) [n:127.0.0.1:36283_solr    ] o.a.s.c.c.ZkStateReader Updated live nodes from ZooKeeper... (0) -> (3)
   [junit4]   2> 1166678 INFO  (jetty-launcher-6547-thread-3) [n:127.0.0.1:36283_solr    ] o.a.s.c.s.i.ZkClientClusterStateProvider Cluster at 127.0.0.1:38531/solr ready
   [junit4]   2> 1166687 INFO  (jetty-launcher-6547-thread-2) [n:127.0.0.1:42889_solr    ] o.a.s.m.r.SolrJmxReporter JMX monitoring for 'solr_42889.solr.jvm' (registry 'solr.jvm') enabled at server: com.sun.jmx.mbeanserver.JmxMBeanServer@3735af3e
   [junit4]   2> 1166688 INFO  (jetty-launcher-6547-thread-2) [n:127.0.0.1:42889_solr    ] o.a.s.m.r.SolrJmxReporter JMX monitoring for 'solr_42889.solr.jetty' (registry 'solr.jetty') enabled at server: com.sun.jmx.mbeanserver.JmxMBeanServer@3735af3e
   [junit4]   2> 1166689 INFO  (jetty-launcher-6547-thread-2) [n:127.0.0.1:42889_solr    ] o.a.s.c.CorePropertiesLocator Found 0 core definitions underneath /home/jenkins/workspace/Lucene-Solr-master-Linux/solr/build/solr-core/test/J1/temp/solr.security.BasicAuthIntegrationTest_C9DDA6254F404BB5-001/tempDir-001/node2/.
   [junit4]   2> 1166691 INFO  (zkConnectionManagerCallback-6601-thread-1) [    ] o.a.s.c.c.ConnectionManager zkClient has connected
   [junit4]   2> 1166693 INFO  (jetty-launcher-6547-thread-1) [n:127.0.0.1:44507_solr    ] o.a.s.c.c.ZkStateReader Updated live nodes from ZooKeeper... (0) -> (3)
   [junit4]   2> 1166694 INFO  (jetty-launcher-6547-thread-1) [n:127.0.0.1:44507_solr    ] o.a.s.c.s.i.ZkClientClusterStateProvider Cluster at 127.0.0.1:38531/solr ready
   [junit4]   2> 1166710 INFO  (jetty-launcher-6547-thread-3) [n:127.0.0.1:36283_solr    ] o.a.s.h.a.MetricsHistoryHandler No .system collection, keeping metrics history in memory.
   [junit4]   2> 1166720 INFO  (jetty-launcher-6547-thread-1) [n:127.0.0.1:44507_solr    ] o.a.s.h.a.MetricsHistoryHandler No .system collection, keeping metrics history in memory.
   [junit4]   2> 1166740 INFO  (jetty-launcher-6547-thread-3) [n:127.0.0.1:36283_solr    ] o.a.s.m.r.SolrJmxReporter JMX monitoring for 'solr_36283.solr.node' (registry 'solr.node') enabled at server: com.sun.jmx.mbeanserver.JmxMBeanServer@3735af3e
   [junit4]   2> 1166753 INFO  (jetty-launcher-6547-thread-1) [n:127.0.0.1:44507_solr    ] o.a.s.m.r.SolrJmxReporter JMX monitoring for 'solr_44507.solr.node' (registry 'solr.node') enabled at server: com.sun.jmx.mbeanserver.JmxMBeanServer@3735af3e
   [junit4]   2> 1166758 INFO  (jetty-launcher-6547-thread-3) [n:127.0.0.1:36283_solr    ] o.a.s.m.r.SolrJmxReporter JMX monitoring for 'solr_36283.solr.jvm' (registry 'solr.jvm') enabled at server: com.sun.jmx.mbeanserver.JmxMBeanServer@3735af3e
   [junit4]   2> 1166759 INFO  (jetty-launcher-6547-thread-3) [n:127.0.0.1:36283_solr    ] o.a.s.m.r.SolrJmxReporter JMX monitoring for 'solr_36283.solr.jetty' (registry 'solr.jetty') enabled at server: com.sun.jmx.mbeanserver.JmxMBeanServer@3735af3e
   [junit4]   2> 1166760 INFO  (jetty-launcher-6547-thread-3) [n:127.0.0.1:36283_solr    ] o.a.s.c.CorePropertiesLocator Found 0 core definitions underneath /home/jenkins/workspace/Lucene-Solr-master-Linux/solr/build/solr-core/test/J1/temp/solr.security.BasicAuthIntegrationTest_C9DDA6254F404BB5-001/tempDir-001/node3/.
   [junit4]   2> 1166780 INFO  (jetty-launcher-6547-thread-1) [n:127.0.0.1:44507_solr    ] o.a.s.m.r.SolrJmxReporter JMX monitoring for 'solr_44507.solr.jvm' (registry 'solr.jvm') enabled at server: com.sun.jmx.mbeanserver.JmxMBeanServer@3735af3e
   [junit4]   2> 1166781 INFO  (jetty-launcher-6547-thread-1) [n:127.0.0.1:44507_solr    ] o.a.s.m.r.SolrJmxReporter JMX monitoring for 'solr_44507.solr.jetty' (registry 'solr.jetty') enabled at server: com.sun.jmx.mbeanserver.JmxMBeanServer@3735af3e
   [junit4]   2> 1166782 INFO  (jetty-launcher-6547-thread-1) [n:127.0.0.1:44507_solr    ] o.a.s.c.CorePropertiesLocator Found 0 core definitions underneath /home/jenkins/workspace/Lucene-Solr-master-Linux/solr/build/solr-core/test/J1/temp/solr.security.BasicAuthIntegrationTest_C9DDA6254F404BB5-001/tempDir-001/node1/.
   [junit4]   2> 1166872 INFO  (zkConnectionManagerCallback-6609-thread-1) [    ] o.a.s.c.c.ConnectionManager zkClient has connected
   [junit4]   2> 1166873 INFO  (TEST-BasicAuthIntegrationTest.testBasicAuth-seed#[C9DDA6254F404BB5]) [    ] o.a.s.c.c.ZkStateReader Updated live nodes from ZooKeeper... (0) -> (3)
   [junit4]   2> 1166874 INFO  (TEST-BasicAuthIntegrationTest.testBasicAuth-seed#[C9DDA6254F404BB5]) [    ] o.a.s.c.s.i.ZkClientClusterStateProvider Cluster at 127.0.0.1:38531/solr ready
   [junit4]   2> 1166878 INFO  (qtp920667078-16416) [n:127.0.0.1:42889_solr    ] o.a.s.h.a.CollectionsHandler Invoked Collection Action :create with params collection.configName=conf&name=authCollection&nrtReplicas=1&action=CREATE&numShards=3&wt=javabin&version=2 and sendToOCPQueue=true
   [junit4]   2> 1166880 INFO  (OverseerThreadFactory-5339-thread-1-processing-n:127.0.0.1:42889_solr) [n:127.0.0.1:42889_solr    ] o.a.s.c.a.c.CreateCollectionCmd Create collection authCollection
   [junit4]   2> 1166986 INFO  (OverseerStateUpdate-72219850524590090-127.0.0.1:42889_solr-n_0000000000) [n:127.0.0.1:42889_solr    ] o.a.s.c.o.SliceMutator createReplica() {
   [junit4]   2>   "operation":"ADDREPLICA",
   [junit4]   2>   "collection":"authCollection",
   [junit4]   2>   "shard":"shard1",
   [junit4]   2>   "core":"authCollection_shard1_replica_n1",
   [junit4]   2>   "state":"down",
   [junit4]   2>   "base_url":"http://127.0.0.1:42889/solr",
   [junit4]   2>   "type":"NRT",
   [junit4]   2>   "waitForFinalState":"false"} 
   [junit4]   2> 1166988 INFO  (OverseerStateUpdate-72219850524590090-127.0.0.1:42889_solr-n_0000000000) [n:127.0.0.1:42889_solr    ] o.a.s.c.o.SliceMutator createReplica() {
   [junit4]   2>   "operation":"ADDREPLICA",
   [junit4]   2>   "collection":"authCollection",
   [junit4]   2>   "shard":"shard2",
   [junit4]   2>   "core":"authCollection_shard2_replica_n3",
   [junit4]   2>   "state":"down",
   [junit4]   2>   "base_url":"http://127.0.0.1:36283/solr",
   [junit4]   2>   "type":"NRT",
   [junit4]   2>   "waitForFinalState":"false"} 
   [junit4]   2> 1166991 INFO  (OverseerStateUpdate-72219850524590090-127.0.0.1:42889_solr-n_0000000000) [n:127.0.0.1:42889_solr    ] o.a.s.c.o.SliceMutator createReplica() {
   [junit4]   2>   "operation":"ADDREPLICA",
   [junit4]   2>   "collection":"authCollection",
   [junit4]   2>   "shard":"shard3",
   [junit4]   2>   "core":"authCollection_shard3_replica_n4",
   [junit4]   2>   "state":"down",
   [junit4]   2>   "base_url":"http://127.0.0.1:44507/solr",
   [junit4]   2>   "type":"NRT",
   [junit4]   2>   "waitForFinalState":"false"} 
   [junit4]   2> 1167195 INFO  (qtp1549337371-16402) [n:127.0.0.1:36283_solr    x:authCollection_shard2_replica_n3] o.a.s.h.a.CoreAdminOperation core create command qt=/admin/cores&coreNodeName=core_node5&collection.configName=conf&newCollection=true&name=authCollection_shard2_replica_n3&action=CREATE&numShards=3&collection=authCollection&shard=shard2&wt=javabin&version=2&replicaType=NRT
   [junit4]   2> 1167195 INFO  (qtp920667078-16415) [n:127.0.0.1:42889_solr    x:authCollection_shard1_replica_n1] o.a.s.h.a.CoreAdminOperation core create command qt=/admin/cores&coreNodeName=core_node2&collection.configName=conf&newCollection=true&name=authCollection_shard1_replica_n1&action=CREATE&numShards=3&collection=authCollection&shard=shard1&wt=javabin&version=2&replicaType=NRT
   [junit4]   2> 1167195 INFO  (qtp1549337371-16402) [n:127.0.0.1:36283_solr    x:authCollection_shard2_replica_n3] o.a.s.c.TransientSolrCoreCacheDefault Allocating transient cache for 2147483647 transient cores
   [junit4]   2> 1167195 INFO  (qtp1737284343-16394) [n:127.0.0.1:44507_solr    x:authCollection_shard3_replica_n4] o.a.s.h.a.CoreAdminOperation core create command qt=/admin/cores&coreNodeName=core_node6&collection.configName=conf&newCollection=true&name=authCollection_shard3_replica_n4&action=CREATE&numShards=3&collection=authCollection&shard=shard3&wt=javabin&version=2&replicaType=NRT
   [junit4]   2> 1168206 INFO  (qtp1549337371-16402) [n:127.0.0.1:36283_solr c:authCollection s:shard2 r:core_node5 x:authCollection_shard2_replica_n3] o.a.s.c.SolrConfig Using Lucene MatchVersion: 9.0.0
   [junit4]   2> 1168207 INFO  (qtp920667078-16415) [n:127.0.0.1:42889_solr c:authCollection s:shard1 r:core_node2 x:authCollection_shard1_replica_n1] o.a.s.c.SolrConfig Using Lucene MatchVersion: 9.0.0
   [junit4]   2> 1168213 INFO  (qtp1737284343-16394) [n:127.0.0.1:44507_solr c:authCollection s:shard3 r:core_node6 x:authCollection_shard3_replica_n4] o.a.s.c.SolrConfig Using Lucene MatchVersion: 9.0.0
   [junit4]   2> 1168307 INFO  (qtp1549337371-16402) [n:127.0.0.1:36283_solr c:authCollection s:shard2 r:core_node5 x:authCollection_shard2_replica_n3] o.a.s.s.IndexSchema [authCollection_shard2_replica_n3] Schema name=minimal
   [junit4]   2> 1168313 INFO  (qtp1737284343-16394) [n:127.0.0.1:44507_solr c:authCollection s:shard3 r:core_node6 x:authCollection_shard3_replica_n4] o.a.s.s.IndexSchema [authCollection_shard3_replica_n4] Schema name=minimal
   [junit4]   2> 1168313 INFO  (qtp920667078-16415) [n:127.0.0.1:42889_solr c:authCollection s:shard1 r:core_node2 x:authCollection_shard1_replica_n1] o.a.s.s.IndexSchema [authCollection_shard1_replica_n1] Schema name=minimal
   [junit4]   2> 1168315 INFO  (qtp1549337371-16402) [n:127.0.0.1:36283_solr c:authCollection s:shard2 r:core_node5 x:authCollection_shard2_replica_n3] o.a.s.s.IndexSchema Loaded schema minimal/1.1 with uniqueid field id
   [junit4]   2> 1168315 INFO  (qtp1549337371-16402) [n:127.0.0.1:36283_solr c:authCollection s:shard2 r:core_node5 x:authCollection_shard2_replica_n3] o.a.s.c.CoreContainer Creating SolrCore 'authCollection_shard2_replica_n3' using configuration from collection authCollection, trusted=true
   [junit4]   2> 1168315 INFO  (qtp1737284343-16394) [n:127.0.0.1:44507_solr c:authCollection s:shard3 r:core_node6 x:authCollection_shard3_replica_n4] o.a.s.s.IndexSchema Loaded schema minimal/1.1 with uniqueid field id
   [junit4]   2> 1168315 INFO  (qtp1737284343-16394) [n:127.0.0.1:44507_solr c:authCollection s:shard3 r:core_node6 x:authCollection_shard3_replica_n4] o.a.s.c.CoreContainer Creating SolrCore 'authCollection_shard3_replica_n4' using configuration from collection authCollection, trusted=true
   [junit4]   2> 1168315 INFO  (qtp920667078-16415) [n:127.0.0.1:42889_solr c:authCollection s:shard1 r:core_node2 x:authCollection_shard1_replica_n1] o.a.s.s.IndexSchema Loaded schema minimal/1.1 with uniqueid field id
   [junit4]   2> 1168315 INFO  (qtp920667078-16415) [n:127.0.0.1:42889_solr c:authCollection s:shard1 r:core_node2 x:authCollection_shard1_replica_n1] o.a.s.c.CoreContainer Creating SolrCore 'authCollection_shard1_replica_n1' using configuration from collection authCollection, trusted=true
   [junit4]   2> 1168316 INFO  (qtp1549337371-16402) [n:127.0.0.1:36283_solr c:authCollection s:shard2 r:core_node5 x:authCollection_shard2_replica_n3] o.a.s.m.r.SolrJmxReporter JMX monitoring for 'solr_36283.solr.core.authCollection.shard2.replica_n3' (registry 'solr.core.authCollection.shard2.replica_n3') enabled at server: com.sun.jmx.mbeanserver.JmxMBeanServer@3735af3e
   [junit4]   2> 1168316 INFO  (qtp1737284343-16394) [n:127.0.0.1:44507_solr c:authCollection s:shard3 r:core_node6 x:authCollection_shard3_replica_n4] o.a.s.m.r.SolrJmxReporter JMX monitoring for 'solr_44507.solr.core.authCollection.shard3.replica_n4' (registry 'solr.core.authCollection.shard3.replica_n4') enabled at server: com.sun.jmx.mbeanserver.JmxMBeanServer@3735af3e
   [junit4]   2> 1168316 INFO  (qtp920667078-16415) [n:127.0.0.1:42889_solr c:authCollection s:shard1 r:core_node2 x:authCollection_shard1_replica_n1] o.a.s.m.r.SolrJmxReporter JMX monitoring for 'solr_42889.solr.core.authCollection.shard1.replica_n1' (registry 'solr.core.authCollection.shard1.replica_n1') enabled at server: com.sun.jmx.mbeanserver.JmxMBeanServer@3735af3e
   [junit4]   2> 1168316 INFO  (qtp1737284343-16394) [n:127.0.0.1:44507_solr c:authCollection s:shard3 r:core_node6 x:authCollection_shard3_replica_n4] o.a.s.c.SolrCore [[authCollection_shard3_replica_n4] ] Opening new SolrCore at [/home/jenkins/workspace/Lucene-Solr-master-Linux/solr/build/solr-core/test/J1/temp/solr.security.BasicAuthIntegrationTest_C9DDA6254F404BB5-001/tempDir-001/node1/authCollection_shard3_replica_n4], dataDir=[/home/jenkins/workspace/Lucene-Solr-master-Linux/solr/build/solr-core/test/J1/temp/solr.security.BasicAuthIntegrationTest_C9DDA6254F404BB5-001/tempDir-001/node1/./authCollection_shard3_replica_n4/data/]
   [junit4]   2> 1168316 INFO  (qtp1549337371-16402) [n:127.0.0.1:36283_solr c:authCollection s:shard2 r:core_node5 x:authCollection_shard2_replica_n3] o.a.s.c.SolrCore [[authCollection_shard2_replica_n3] ] Opening new SolrCore at [/home/jenkins/workspace/Lucene-Solr-master-Linux/solr/build/solr-core/test/J1/temp/solr.security.BasicAuthIntegrationTest_C9DDA6254F404BB5-001/tempDir-001/node3/authCollection_shard2_replica_n3], dataDir=[/home/jenkins/workspace/Lucene-Solr-master-Linux/solr/build/solr-core/test/J1/temp/solr.security.BasicAuthIntegrationTest_C9DDA6254F404BB5-001/tempDir-001/node3/./authCollection_shard2_replica_n3/data/]
   [junit4]   2> 1168316 INFO  (qtp920667078-16415) [n:127.0.0.1:42889_solr c:authCollection s:shard1 r:core_node2 x:authCollection_shard1_replica_n1] o.a.s.c.SolrCore [[authCollection_shard1_replica_n1] ] Opening new SolrCore at [/home/jenkins/workspace/Lucene-Solr-master-Linux/solr/build/solr-core/test/J1/temp/solr.security.BasicAuthIntegrationTest_C9DDA6254F404BB5-001/tempDir-001/node2/authCollection_shard1_replica_n1], dataDir=[/home/jenkins/workspace/Lucene-Solr-master-Linux/solr/build/solr-core/test/J1/temp/solr.security.BasicAuthIntegrationTest_C9DDA6254F404BB5-001/tempDir-001/node2/./authCollection_shard1_replica_n1/data/]
   [junit4]   2> 1168422 INFO  (qtp920667078-16415) [n:127.0.0.1:42889_solr c:authCollection s:shard1 r:core_node2 x:authCollection_shard1_replica_n1] o.a.s.u.UpdateHandler Using UpdateLog implementation: org.apache.solr.update.UpdateLog
   [junit4]   2> 1168422 INFO  (qtp920667078-16415) [n:127.0.0.1:42889_solr c:authCollection s:shard1 r:core_node2 x:authCollection_shard1_replica_n1] o.a.s.u.UpdateLog Initializing UpdateLog: dataDir=null defaultSyncLevel=FLUSH numRecordsToKeep=100 maxNumLogsToKeep=10 numVersionBuckets=65536
   [junit4]   2> 1168425 INFO  (qtp920667078-16415) [n:127.0.0.1:42889_solr c:authCollection s:shard1 r:core_node2 x:authCollection_shard1_replica_n1] o.a.s.u.CommitTracker Hard AutoCommit: disabled
   [junit4]   2> 1168425 INFO  (qtp920667078-16415) [n:127.0.0.1:42889_solr c:authCollection s:shard1 r:core_node2 x:authCollection_shard1_replica_n1] o.a.s.u.CommitTracker Soft AutoCommit: disabled
   [junit4]   2> 1168431 INFO  (qtp920667078-16415) [n:127.0.0.1:42889_solr c:authCollection s:shard1 r:core_node2 x:authCollection_shard1_replica_n1] o.a.s.s.SolrIndexSearcher Opening [Searcher@69c4ec38[authCollection_shard1_replica_n1] main]
   [junit4]   2> 1168433 INFO  (qtp920667078-16415) [n:127.0.0.1:42889_solr c:authCollection s:shard1 r:core_node2 x:authCollection_shard1_replica_n1] o.a.s.r.ManagedResourceStorage Configured ZooKeeperStorageIO with znodeBase: /configs/conf
   [junit4]   2> 1168433 INFO  (qtp920667078-16415) [n:127.0.0.1:42889_solr c:authCollection s:shard1 r:core_node2 x:authCollection_shard1_replica_n1] o.a.s.r.ManagedResourceStorage Loaded null at path _rest_managed.json using ZooKeeperStorageIO:path=/configs/conf
   [junit4]   2> 1168434 INFO  (qtp920667078-16415) [n:127.0.0.1:42889_solr c:authCollection s:shard1 r:core_node2 x:authCollection_shard1_replica_n1] o.a.s.h.ReplicationHandler Commits will be reserved for 10000ms.
   [junit4]   2> 1168434 INFO  (qtp920667078-16415) [n:127.0.0.1:42889_solr c:authCollection s:shard1 r:core_node2 x:authCollection_shard1_replica_n1] o.a.s.u.UpdateLog Could not find max version in index or recent updates, using new clock 1633031820295536640
   [junit4]   2> 1168447 INFO  (qtp920667078-16415) [n:127.0.0.1:42889_solr c:authCollection s:shard1 r:core_node2 x:authCollection_shard1_replica_n1] o.a.s.c.ZkShardTerms Successful update of terms at /collections/authCollection/terms/shard1 to Terms{values={core_node2=0}, version=0}
   [junit4]   2> 1168447 INFO  (qtp920667078-16415) [n:127.0.0.1:42889_solr c:authCollection s:shard1 r:core_node2 x:authCollection_shard1_replica_n1] o.a.s.c.ShardLeaderElectionContextBase make sure parent is created /collections/authCollection/leaders/shard1
   [junit4]   2> 1168448 INFO  (searcherExecutor-5354-thread-1-processing-n:127.0.0.1:42889_solr x:authCollection_shard1_replica_n1 c:authCollection s:shard1 r:core_node2) [n:127.0.0.1:42889_solr c:authCollection s:shard1 r:core_node2 x:authCollection_shard1_replica_n1] o.a.s.c.SolrCore [authCollection_shard1_replica_n1] Registered new searcher Searcher@69c4ec38[authCollection_shard1_replica_n1] main{ExitableDirectoryReader(UninvertingDirectoryReader())}
   [junit4]   2> 1168456 INFO  (qtp920667078-16415) [n:127.0.0.1:42889_solr c:authCollection s:shard1 r:core_node2 x:authCollection_shard1_replica_n1] o.a.s.c.ShardLeaderElectionContext Enough replicas found to continue.
   [junit4]   2> 1168456 INFO  (qtp920667078-16415) [n:127.0.0.1:42889_solr c:authCollection s:shard1 r:core_node2 x:authCollection_shard1_replica_n1] o.a.s.c.ShardLeaderElectionContext I may be the new leader - try and sync
   [junit4]   2> 1168456 INFO  (qtp920667078-16415) [n:127.0.0.1:42889_solr c:authCollection s:shard1 r:core_node2 x:authCollection_shard1_replica_n1] o.a.s.c.SyncStrategy Sync replicas to http://127.0.0.1:42889/solr/authCollection_shard1_replica_n1/
   [junit4]   2> 1168456 INFO  (qtp920667078-16415) [n:127.0.0.1:42889_solr c:authCollection s:shard1 r:core_node2 x:authCollection_shard1_replica_n1] o.a.s.c.SyncStrategy Sync Success - now sync replicas to me
   [junit4]   2> 1168456 INFO  (qtp920667078-16415) [n:127.0.0.1:42889_solr c:authCollection s:shard1 r:core_node2 x:authCollection_shard1_replica_n1] o.a.s.c.SyncStrategy http://127.0.0.1:42889/solr/authCollection_shard1_replica_n1/ has no replicas
   [junit4]   2> 1168456 INFO  (qtp920667078-16415) [n:127.0.0.1:42889_solr c:authCollection s:shard1 r:core_node2 x:authCollection_shard1_replica_n1] o.a.s.c.ShardLeaderElectionContextBase Creating leader registration node /collections/authCollection/leaders/shard1/leader after winning as /collections/authCollection/leader_elect/shard1/election/72219850524590090-core_node2-n_0000000000
   [junit4]   2> 1168458 INFO  (qtp920667078-16415) [n:127.0.0.1:42889_solr c:authCollection s:shard1 r:core_node2 x:authCollection_shard1_replica_n1] o.a.s.c.ShardLeaderElectionContext I am the new leader: http://127.0.0.1:42889/solr/authCollection_shard1_replica_n1/ shard1
   [junit4]   2> 1168470 INFO  (qtp1737284343-16394) [n:127.0.0.1:44507_solr c:authCollection s:shard3 r:core_node6 x:authCollection_shard3_replica_n4] o.a.s.u.UpdateHandler Using UpdateLog implementation: org.apache.solr.update.UpdateLog
   [junit4]   2> 1168470 INFO  (qtp1737284343-16394) [n:127.0.0.1:44507_solr c:authCollection s:shard3 r:core_node6 x:authCollection_shard3_replica_n4] o.a.s.u.UpdateLog Initializing UpdateLog: dataDir=null defaultSyncLevel=FLUSH numRecordsToKeep=100 maxNumLogsToKeep=10 numVersionBuckets=65536
   [junit4]   2> 1168473 INFO  (qtp1737284343-16394) [n:127.0.0.1:44507_solr c:authCollection s:shard3 r:core_node6 x:authCollection_shard3_replica_n4] o.a.s.u.CommitTracker Hard AutoCommit: disabled
   [junit4]   2> 1168473 INFO  (qtp1737284343-16394) [n:127.0.0.1:44507_solr c:authCollection s:shard3 r:core_node6 x:authCollection_shard3_replica_n4] o.a.s.u.CommitTracker Soft AutoCommit: disabled
   [junit4]   2> 1168475 INFO  (qtp1549337371-16402) [n:127.0.0.1:36283_solr c:authCollection s:shard2 r:core_node5 x:authCollection_shard2_replica_n3] o.a.s.u.UpdateHandler Using UpdateLog implementation: org.apache.solr.update.UpdateLog
   [junit4]   2> 1168475 INFO  (qtp1549337371-16402) [n:127.0.0.1:36283_solr c:authCollection s:shard2 r:core_node5 x:authCollection_shard2_replica_n3] o.a.s.u.UpdateLog Initializing UpdateLog: dataDir=null defaultSyncLevel=FLUSH numRecordsToKeep=100 maxNumLogsToKeep=10 numVersionBuckets=65536
   [junit4]   2> 1168476 INFO  (qtp1737284343-16394) [n:127.0.0.1:44507_solr c:authCollection s:shard3 r:core_node6 x:authCollection_shard3_replica_n4] o.a.s.s.SolrIndexSearcher Opening [Searcher@7173ce37[authCollection_shard3_replica_n4] main]
   [junit4]   2> 1168478 INFO  (qtp1549337371-16402) [n:127.0.0.1:36283_solr c:authCollection s:shard2 r:core_node5 x:authCollection_shard2_replica_n3] o.a.s.u.CommitTracker Hard AutoCommit: disabled
   [junit4]   2> 1168478 INFO  (qtp1549337371-16402) [n:127.0.0.1:36283_solr c:authCollection s:shard2 r:core_node5 x:authCollection_shard2_replica_n3] o.a.s.u.CommitTracker Soft AutoCommit: disabled
   [junit4]   2> 1168480 INFO  (qtp1737284343-16394) [n:127.0.0.1:44507_solr c:authCollection s:shard3 r:core_node6 x:authCollection_shard3_replica_n4] o.a.s.r.ManagedResourceStorage Configured ZooKeeperStorageIO with znodeBase: /configs/conf
   [junit4]   2> 1168480 INFO  (qtp1549337371-16402) [n:127.0.0.1:36283_solr c:authCollection s:shard2 r:core_node5 x:authCollection_shard2_replica_n3] o.a.s.s.SolrIndexSearcher Opening [Searcher@105d15a2[authCollection_shard2_replica_n3] main]
   [junit4]   2> 1168481 INFO  (qtp1737284343-16394) [n:127.0.0.1:44507_solr c:authCollection s:shard3 r:core_node6 x:authCollection_shard3_replica_n4] o.a.s.r.ManagedResourceStorage Loaded null at path _rest_managed.json using ZooKeeperStorageIO:path=/configs/conf
   [junit4]   2> 1168482 INFO  (qtp1737284343-16394) [n:127.0.0.1:44507_solr c:authCollection s:shard3 r:core_node6 x:authCollection_shard3_replica_n4] o.a.s.h.ReplicationHandler Commits will be reserved for 10000ms.
   [junit4]   2> 1168482 INFO  (qtp1737284343-16394) [n:127.0.0.1:44507_solr c:authCollection s:shard3 r:core_node6 x:authCollection_shard3_replica_n4] o.a.s.u.UpdateLog Could not find max version in index or recent updates, using new clock 1633031820345868288
   [junit4]   2> 1168484 INFO  (qtp1549337371-16402) [n:127.0.0.1:36283_solr c:authCollection s:shard2 r:core_node5 x:authCollection_shard2_replica_n3] o.a.s.r.ManagedResourceStorage Configured ZooKeeperStorageIO with znodeBase: /configs/conf
   [junit4]   2> 1168484 INFO  (qtp1549337371-16402) [n:127.0.0.1:36283_solr c:authCollection s:shard2 r:core_node5 x:authCollection_shard2_replica_n3] o.a.s.r.ManagedResourceStorage Loaded null at path _rest_managed.json using ZooKeeperStorageIO:path=/configs/conf
   [junit4]   2> 1168485 INFO  (qtp1549337371-16402) [n:127.0.0.1:36283_solr c:authCollection s:shard2 r:core_node5 x:authCollection_shard2_replica_n3] o.a.s.h.ReplicationHandler Commits will be reserved for 10000ms.
   [junit4]   2> 1168485 INFO  (qtp1549337371-16402) [n:127.0.0.1:36283_solr c:authCollection s:shard2 r:core_node5 x:authCollection_shard2_replica_n3] o.a.s.u.UpdateLog Could not find max version in index or recent updates, using new clock 1633031820349014016
   [junit4]   2> 1168489 INFO  (searcherExecutor-5353-thread-1-processing-n:127.0.0.1:44507_solr x:authCollection_shard3_replica_n4 c:authCollection s:shard3 r:core_node6) [n:127.0.0.1:44507_solr c:authCollection s:shard3 r:core_node6 x:authCollection_shard3_replica_n4] o.a.s.c.SolrCore [authCollection_shard3_replica_n4] Registered new searcher Searcher@7173ce37[authCollection_shard3_replica_n4] main{ExitableDirectoryReader(UninvertingDirectoryReader())}
   [junit4]   2> 1168491 INFO  (searcherExecutor-5352-thread-1-processing-n:127.0.0.1:36283_solr x:authCollection_shard2_replica_n3 c:authCollection s:shard2 r:core_node5) [n:127.0.0.1:36283_solr c:authCollection s:shard2 r:core_node5 x:authCollection_shard2_replica_n3] o.a.s.c.SolrCore [authCollection_shard2_replica_n3] Registered new searcher Searcher@105d15a2[authCollection_shard2_replica_n3] main{ExitableDirectoryReader(UninvertingDirectoryReader())}
   [junit4]   2> 1168495 INFO  (qtp1737284343-16394) [n:127.0.0.1:44507_solr c:authCollection s:shard3 r:core_node6 x:authCollection_shard3_replica_n4] o.a.s.c.ZkShardTerms Successful update of terms at /collections/authCollection/terms/shard3 to Terms{values={core_node6=0}, version=0}
   [junit4]   2> 1168495 INFO  (qtp1737284343-16394) [n:127.0.0.1:44507_solr c:authCollection s:shard3 r:core_node6 x:authCollection_shard3_replica_n4] o.a.s.c.ShardLeaderElectionContextBase make sure parent is created /collections/authCollection/leaders/shard3
   [junit4]   2> 1168495 INFO  (qtp1549337371-16402) [n:127.0.0.1:36283_solr c:authCollection s:shard2 r:core_node5 x:authCollection_shard2_replica_n3] o.a.s.c.ZkShardTerms Successful update of terms at /collections/authCollection/terms/shard2 to Terms{values={core_node5=0}, version=0}
   [junit4]   2> 1168495 INFO  (qtp1549337371-16402) [n:127.0.0.1:36283_solr c:authCollection s:shard2 r:core_node5 x:authCollection_shard2_replica_n3] o.a.s.c.ShardLeaderElectionContextBase make sure parent is created /collections/authCollection/leaders/shard2
   [junit4]   2> 1168498 INFO  (qtp1737284343-16394) [n:127.0.0.1:44507_solr c:authCollection s:shard3 r:core_node6 x:authCollection_shard3_replica_n4] o.a.s.c.ShardLeaderElectionContext Enough replicas found to continue.
   [junit4]   2> 1168498 INFO  (qtp1737284343-16394) [n:127.0.0.1:44507_solr c:authCollection s:shard3 r:core_node6 x:authCollection_shard3_replica_n4] o.a.s.c.ShardLeaderElectionContext I may be the new leader - try and sync
   [junit4]   2> 1168498 INFO  (qtp1737284343-16394) [n:127.0.0.1:44507_solr c:authCollection s:shard3 r:core_node6 x:authCollection_shard3_replica_n4] o.a.s.c.SyncStrategy Sync replicas to http://127.0.0.1:44507/solr/authCollection_shard3_replica_n4/
   [junit4]   2> 1168499 INFO  (qtp1737284343-16394) [n:127.0.0.1:44507_solr c:authCollection s:shard3 r:core_node6 x:authCollection_shard3_replica_n4] o.a.s.c.SyncStrategy Sync Success - now sync replicas to me
   [junit4]   2> 1168499 INFO  (qtp1737284343-16394) [n:127.0.0.1:44507_solr c:authCollection s:shard3 r:core_node6 x:authCollection_shard3_replica_n4] o.a.s.c.SyncStrategy http://127.0.0.1:44507/solr/authCollection_shard3_replica_n4/ has no replicas
   [junit4]   2> 1168499 INFO  (qtp1737284343-16394) [n:127.0.0.1:44507_solr c:authCollection s:shard3 r:core_node6 x:authCollection_shard3_replica_n4] o.a.s.c.ShardLeaderElectionContextBase Creating leader registration node /collections/authCollection/leaders/shard3/leader after winning as /collections/authCollection/leader_elect/shard3/election/72219850524590087-core_node6-n_0000000000
   [junit4]   2> 1168500 INFO  (qtp1737284343-16394) [n:127.0.0.1:44507_solr c:authCollection s:shard3 r:core_node6 x:authCollection_shard3_replica_n4] o.a.s.c.ShardLeaderElectionContext I am the new leader: http://127.0.0.1:44507/solr/authCollection_shard3_replica_n4/ shard3
   [junit4]   2> 1168505 INFO  (qtp1549337371-16402) [n:127.0.0.1:36283_solr c:authCollection s:shard2 r:core_node5 x:authCollection_shard2_replica_n3] o.a.s.c.ShardLeaderElectionContext Enough replicas found to continue.
   [junit4]   2> 1168505 INFO  (qtp1549337371-16402) [n:127.0.0.1:36283_solr c:authCollection s:shard2 r:core_node5 x:authCollection_shard2_replica_n3] o.a.s.c.ShardLeaderElectionContext I may be the new leader - try and sync
   [junit4]   2> 1168505 INFO  (qtp1549337371-16402) [n:127.0.0.1:36283_solr c:authCollection s:shard2 r:core_node5 x:authCollection_shard2_replica_n3] o.a.s.c.SyncStrategy Sync replicas to http://127.0.0.1:36283/solr/authCollection_shard2_replica_n3/
   [junit4]   2> 1168505 INFO  (qtp1549337371-16402) [n:127.0.0.1:36283_solr c:authCollection s:shard2 r:core_node5 x:authCollection_shard2_replica_n3] o.a.s.c.SyncStrategy Sync Success - now sync replicas to me
   [junit4]   2> 1168505 INFO  (qtp1549337371-16402) [n:127.0.0.1:36283_solr c:authCollection s:shard2 r:core_node5 x:authCollection_shard2_replica_n3] o.a.s.c.SyncStrategy http://127.0.0.1:36283/solr/authCollection_shard2_replica_n3/ has no replicas
   [junit4]   2> 1168505 INFO  (qtp1549337371-16402) [n:127.0.0.1:36283_solr c:authCollection s:shard2 r:core_node5 x:authCollection_shard2_replica_n3] o.a.s.c.ShardLeaderElectionContextBase Creating leader registration node /collections/authCollection/leaders/shard2/leader after winning as /collections/authCollection/leader_elect/shard2/election/72219850524590091-core_node5-n_0000000000
   [junit4]   2> 1168508 INFO  (qtp1549337371-16402) [n:127.0.0.1:36283_solr c:authCollection s:shard2 r:core_node5 x:authCollection_shard2_replica_n3] o.a.s.c.ShardLeaderElectionContext I am the new leader: http://127.0.0.1:36283/solr/authCollection_shard2_replica_n3/ shard2
   [junit4]   2> 1168610 INFO  (zkCallback-6567-thread-1) [    ] o.a.s.c.c.ZkStateReader A cluster state change: [WatchedEvent state:SyncConnected type:NodeDataChanged path:/collections/authCollection/state.json] for collection [authCollection] has occurred - updating... (live nodes size: [3])
   [junit4]   2> 1168610 INFO  (zkCallback-6581-thread-1) [    ] o.a.s.c.c.ZkStateReader A cluster state change: [WatchedEvent state:SyncConnected type:NodeDataChanged path:/collections/authCollection/state.json] for collection [authCollection] has occurred - updating... (live nodes size: [3])
   [junit4]   2> 1168610 INFO  (zkCallback-6579-thread-1) [    ] o.a.s.c.c.ZkStateReader A cluster state change: [WatchedEvent state:SyncConnected type:NodeDataChanged path:/collections/authCollection/state.json] for collection [authCollection] has occurred - updating... (live nodes size: [3])
   [junit4]   2> 1168610 INFO  (zkCallback-6579-thread-2) [    ] o.a.s.c.c.ZkStateReader A cluster state change: [WatchedEvent state:SyncConnected type:NodeDataChanged path:/collections/authCollection/state.json] for collection [authCollection] has occurred - updating... (live nodes size: [3])
   [junit4]   2> 1168612 INFO  (qtp1737284343-16394) [n:127.0.0.1:44507_solr c:authCollection s:shard3 r:core_node6 x:authCollection_shard3_replica_n4] o.a.s.c.ZkController I am the leader, no recovery necessary
   [junit4]   2> 1168612 INFO  (qtp920667078-16415) [n:127.0.0.1:42889_solr c:authCollection s:shard1 r:core_node2 x:authCollection_shard1_replica_n1] o.a.s.c.ZkController I am the leader, no recovery necessary
   [junit4]   2> 1168617 INFO  (zkCallback-6567-thread-2) [    ] o.a.s.c.c.ZkStateReader A cluster state change: [WatchedEvent state:SyncConnected type:NodeDataChanged path:/collections/authCollection/state.json] for collection [authCollection] has occurred - updating... (live nodes size: [3])
   [junit4]   2> 1168620 INFO  (qtp1549337371-16402) [n:127.0.0.1:36283_solr c:authCollection s:shard2 r:core_node5 x:authCollection_shard2_replica_n3] o.a.s.c.ZkController I am the leader, no recovery necessary
   [junit4]   2> 1168650 INFO  (qtp1737284343-16394) [n:127.0.0.1:44507_solr c:authCollection s:shard3 r:core_node6 x:authCollection_shard3_replica_n4] o.a.s.s.HttpSolrCall [admin] webapp=null path=/admin/cores params={qt=/admin/cores&coreNodeName=core_node6&collection.configName=conf&newCollection=true&name=authCollection_shard3_replica_n4&action=CREATE&numShards=3&collection=authCollection&shard=shard3&wt=javabin&version=2&replicaType=NRT} status=0 QTime=1455
   [junit4]   2> 1168658 INFO  (qtp1549337371-16402) [n:127.0.0.1:36283_solr c:authCollection s:shard2 r:core_node5 x:authCollection_shard2_replica_n3] o.a.s.s.HttpSolrCall [admin] webapp=null path=/admin/cores params={qt=/admin/cores&coreNodeName=core_node5&collection.configName=conf&newCollection=true&name=authCollection_shard2_replica_n3&action=CREATE&numShards=3&collection=authCollection&shard=shard2&wt=javabin&version=2&replicaType=NRT} status=0 QTime=1464
   [junit4]   2> 1168658 INFO  (qtp920667078-16415) [n:127.0.0.1:42889_solr c:authCollection s:shard1 r:core_node2 x:authCollection_shard1_replica_n1] o.a.s.s.HttpSolrCall [admin] webapp=null path=/admin/cores params={qt=/admin/cores&coreNodeName=core_node2&collection.configName=conf&newCollection=true&name=authCollection_shard1_replica_n1&action=CREATE&numShards=3&collection=authCollection&shard=shard1&wt=javabin&version=2&replicaType=NRT} status=0 QTime=1464
   [junit4]   2> 1168663 INFO  (qtp920667078-16416) [n:127.0.0.1:42889_solr    ] o.a.s.h.a.CollectionsHandler Wait for new collection to be active for at most 45 seconds. Check all shard replicas
   [junit4]   2> 1168723 INFO  (zkCallback-6567-thread-2) [    ] o.a.s.c.c.ZkStateReader A cluster state change: [WatchedEvent state:SyncConnected type:NodeDataChanged path:/collections/authCollection/state.json] for collection [authCollection] has occurred - updating... (live nodes size: [3])
   [junit4]   2> 1168723 INFO  (zkCallback-6579-thread-2) [    ] o.a.s.c.c.ZkStateReader A cluster state change: [WatchedEvent state:SyncConnected type:NodeDataChanged path:/collections/authCollection/state.json] for collection [authCollection] has occurred - updating... (live nodes size: [3])
   [junit4]   2> 1168723 INFO  (zkCallback-6567-thread-1) [    ] o.a.s.c.c.ZkStateReader A cluster state change: [WatchedEvent state:SyncConnected type:NodeDataChanged path:/collections/authCollection/state.json] for collection [authCollection] has occurred - updating... (live nodes size: [3])
   [junit4]   2> 1168723 INFO  (zkCallback-6581-thread-1) [    ] o.a.s.c.c.ZkStateReader A cluster state change: [WatchedEvent state:SyncConnected type:NodeDataChanged path:/collections/authCollection/state.json] for collection [authCollection] has occurred - updating... (live nodes size: [3])
   [junit4]   2> 1168723 INFO  (zkCallback-6579-thread-1) [    ] o.a.s.c.c.ZkStateReader A cluster state change: [WatchedEvent state:SyncConnected type:NodeDataChanged path:/collections/authCollection/state.json] for collection [authCollection] has occurred - updating... (live nodes size: [3])
   [junit4]   2> 1168723 INFO  (zkCallback-6581-thread-2) [    ] o.a.s.c.c.ZkStateReader A cluster state change: [WatchedEvent state:SyncConnected type:NodeDataChanged path:/collections/authCollection/state.json] for collection [authCollection] has occurred - updating... (live nodes size: [3])
   [junit4]   2> 1168724 INFO  (qtp920667078-16416) [n:127.0.0.1:42889_solr    ] o.a.s.s.HttpSolrCall [admin] webapp=null path=/admin/collecti

[...truncated too long message...]

le.metrics.MetricRegistry@20cfe4c5
   [junit4]   2> 1174504 INFO  (jetty-closer-6640-thread-1) [    ] o.a.s.c.Overseer Overseer (id=72219850524590090-127.0.0.1:42889_solr-n_0000000000) closing
   [junit4]   2> 1174504 INFO  (closeThreadPool-6650-thread-1) [    ] o.a.s.c.Overseer Overseer (id=72219850524590090-127.0.0.1:42889_solr-n_0000000000) closing
   [junit4]   2> 1174508 INFO  (jetty-closer-6640-thread-1) [    ] o.e.j.s.AbstractConnector Stopped ServerConnector@63bb6c1f{HTTP/1.1,[http/1.1, h2c]}{127.0.0.1:0}
   [junit4]   2> 1174508 INFO  (jetty-closer-6640-thread-3) [    ] o.a.s.m.SolrMetricManager Closing metric reporters for registry=solr.jetty, tag=null
   [junit4]   2> 1174508 INFO  (jetty-closer-6640-thread-3) [    ] o.a.s.m.r.SolrJmxReporter Closing reporter [org.apache.solr.metrics.reporters.SolrJmxReporter@34bfaf3: rootName = solr_44507, domain = solr.jetty, service url = null, agent id = null] for registry solr.jetty / com.codahale.metrics.MetricRegistry@36e70d19
   [junit4]   2> 1174508 INFO  (jetty-closer-6640-thread-3) [    ] o.a.s.m.SolrMetricManager Closing metric reporters for registry=solr.cluster, tag=null
   [junit4]   2> 1174508 INFO  (jetty-closer-6640-thread-1) [    ] o.e.j.s.h.ContextHandler Stopped o.e.j.s.ServletContextHandler@73f12aef{/solr,null,UNAVAILABLE}
   [junit4]   2> 1174508 INFO  (jetty-closer-6640-thread-1) [    ] o.e.j.s.session node0 Stopped scavenging
   [junit4]   2> 1174514 INFO  (jetty-closer-6640-thread-3) [    ] o.e.j.s.AbstractConnector Stopped ServerConnector@3b33aca2{HTTP/1.1,[http/1.1, h2c]}{127.0.0.1:44507}
   [junit4]   2> 1174514 INFO  (jetty-closer-6640-thread-3) [    ] o.e.j.s.h.ContextHandler Stopped o.e.j.s.ServletContextHandler@5c30d745{/solr,null,UNAVAILABLE}
   [junit4]   2> 1174514 INFO  (jetty-closer-6640-thread-3) [    ] o.e.j.s.session node0 Stopped scavenging
   [junit4]   2> 1174515 INFO  (TEST-BasicAuthIntegrationTest.testBasicAuth-seed#[C9DDA6254F404BB5]) [    ] o.a.s.c.ZkTestServer Shutting down ZkTestServer.
   [junit4]   2> 1174516 WARN  (NIOServerCxn.Factory:0.0.0.0/0.0.0.0:0) [    ] o.a.z.s.NIOServerCnxnFactory Ignoring unexpected runtime exception
   [junit4]   2>           => java.nio.channels.CancelledKeyException
   [junit4]   2> 	at java.base/sun.nio.ch.SelectionKeyImpl.ensureValid(SelectionKeyImpl.java:71)
   [junit4]   2> java.nio.channels.CancelledKeyException: null
   [junit4]   2> 	at sun.nio.ch.SelectionKeyImpl.ensureValid(SelectionKeyImpl.java:71) ~[?:?]
   [junit4]   2> 	at sun.nio.ch.SelectionKeyImpl.readyOps(SelectionKeyImpl.java:130) ~[?:?]
   [junit4]   2> 	at org.apache.zookeeper.server.NIOServerCnxnFactory.run(NIOServerCnxnFactory.java:212) ~[zookeeper-3.4.14.jar:3.4.14-4c25d480e66aadd371de8bd2fd8da255ac140bcf]
   [junit4]   2> 	at java.lang.Thread.run(Thread.java:830) [?:?]
   [junit4]   2> 1174516 WARN  (ZkTestServer Run Thread) [    ] o.a.s.c.ZkTestServer Watch limit violations: 
   [junit4]   2> Maximum concurrent create/delete watches above limit:
   [junit4]   2> 
   [junit4]   2> 	9	/solr/aliases.json
   [junit4]   2> 	9	/solr/clusterprops.json
   [junit4]   2> 	4	/solr/security.json
   [junit4]   2> 	4	/solr/configs/conf
   [junit4]   2> 	3	/solr/collections/authCollection/terms/shard3
   [junit4]   2> 	2	/solr/collections/authCollection/terms/shard2
   [junit4]   2> 	2	/solr/collections/authCollection/terms/shard1
   [junit4]   2> 
   [junit4]   2> Maximum concurrent data watches above limit:
   [junit4]   2> 
   [junit4]   2> 	41	/solr/collections/authCollection/state.json
   [junit4]   2> 	9	/solr/clusterstate.json
   [junit4]   2> 	2	/solr/overseer_elect/election/72219850524590091-127.0.0.1:36283_solr-n_0000000001
   [junit4]   2> 
   [junit4]   2> Maximum concurrent children watches above limit:
   [junit4]   2> 
   [junit4]   2> 	9	/solr/collections
   [junit4]   2> 	7	/solr/live_nodes
   [junit4]   2> 
   [junit4]   2> 1174519 INFO  (TEST-BasicAuthIntegrationTest.testBasicAuth-seed#[C9DDA6254F404BB5]) [    ] o.a.s.c.ZkTestServer parse host and port list: 127.0.0.1:38531
   [junit4]   2> 1174519 INFO  (TEST-BasicAuthIntegrationTest.testBasicAuth-seed#[C9DDA6254F404BB5]) [    ] o.a.s.c.ZkTestServer connecting to 127.0.0.1 38531
   [junit4]   2> 1174520 INFO  (TEST-BasicAuthIntegrationTest.testBasicAuth-seed#[C9DDA6254F404BB5]) [    ] o.a.s.SolrTestCaseJ4 ###Ending testBasicAuth
   [junit4]   2> NOTE: reproduce with: ant test  -Dtestcase=BasicAuthIntegrationTest -Dtests.method=testBasicAuth -Dtests.seed=C9DDA6254F404BB5 -Dtests.multiplier=3 -Dtests.slow=true -Dtests.locale=nn-NO -Dtests.timezone=CNT -Dtests.asserts=true -Dtests.file.encoding=US-ASCII
   [junit4] FAILURE 8.80s J1 | BasicAuthIntegrationTest.testBasicAuth <<<
   [junit4]    > Throwable #1: java.lang.AssertionError: must have failed
   [junit4]    > 	at __randomizedtesting.SeedInfo.seed([C9DDA6254F404BB5:75B3D037EB13C8CF]:0)
   [junit4]    > 	at org.apache.solr.security.BasicAuthIntegrationTest.testBasicAuth(BasicAuthIntegrationTest.java:204)
   [junit4]    > 	at java.base/jdk.internal.reflect.NativeMethodAccessorImpl.invoke0(Native Method)
   [junit4]    > 	at java.base/jdk.internal.reflect.NativeMethodAccessorImpl.invoke(NativeMethodAccessorImpl.java:62)
   [junit4]    > 	at java.base/jdk.internal.reflect.DelegatingMethodAccessorImpl.invoke(DelegatingMethodAccessorImpl.java:43)
   [junit4]    > 	at java.base/java.lang.reflect.Method.invoke(Method.java:567)
   [junit4]    > 	at java.base/java.lang.Thread.run(Thread.java:830)
   [junit4]   2> NOTE: leaving temporary files on disk at: /home/jenkins/workspace/Lucene-Solr-master-Linux/solr/build/solr-core/test/J1/temp/solr.security.BasicAuthIntegrationTest_C9DDA6254F404BB5-001
   [junit4]   2> May 09, 2019 5:41:51 AM com.carrotsearch.randomizedtesting.ThreadLeakControl checkThreadLeaks
   [junit4]   2> WARNING: Will linger awaiting termination of 9 leaked thread(s).
   [junit4]   2> NOTE: test params are: codec=Lucene80, sim=Asserting(org.apache.lucene.search.similarities.AssertingSimilarity@67684e66), locale=nn-NO, timezone=CNT
   [junit4]   2> NOTE: Linux 4.18.0-17-generic amd64/Aleksey Shipilev 13-testing (64-bit)/cpus=8,threads=1,free=285694944,total=474480640
   [junit4]   2> NOTE: All tests run in this JVM: [TestSimDistributedQueue, TestCustomSort, TestJsonFacetsWithNestedObjects, HdfsRecoveryZkTest, TestRestoreCore, BlobRepositoryCloudTest, TermsComponentTest, TestShardHandlerFactory, TestManagedSchemaThreadSafety, TestDistributedSearch, TestCloudPivotFacet, CdcrVersionReplicationTest, QueryEqualityTest, RuleEngineTest, ComputePlanActionTest, TestBinaryField, SolrCoreCheckLockOnStartupTest, ClassificationUpdateProcessorTest, DeleteNodeTest, TestSolrDeletionPolicy1, DistributedQueryComponentCustomSortTest, CategoryRoutedAliasUpdateProcessorTest, TestNumericRangeQuery64, MinimalSchemaTest, TestMacros, TestIntervalFaceting, ConjunctionSolrSpellCheckerTest, TestTrieFacet, TestInfoStreamLogging, DistribJoinFromCollectionTest, SolrXmlInZkTest, CollectionsAPIDistributedZkTest, MBeansHandlerTest, TestConfigOverlay, AuthToolTest, CacheHeaderTest, ConfigSetsAPITest, TestStressCloudBlindAtomicUpdates, TestChildDocTransformer, TestUtilizeNode, TlogReplayBufferedWhileIndexingTest, SolrMetricManagerTest, XsltUpdateRequestHandlerTest, BlockJoinFacetRandomTest, TestStressUserVersions, TestSolrConfigHandlerCloud, CustomHighlightComponentTest, TestUseDocValuesAsStored, SimpleMLTQParserTest, TestCloudNestedDocsSort, TestRawTransformer, RecoveryAfterSoftCommitTest, TestSolrCloudSnapshots, SolrGraphiteReporterTest, UtilsToolTest, CurrencyFieldTypeTest, RequestHandlersTest, LeaderElectionIntegrationTest, AddBlockUpdateTest, IndexSchemaTest, OverseerModifyCollectionTest, SpatialHeatmapFacetsTest, ParsingFieldUpdateProcessorsTest, TestCopyFieldCollectionResource, SubstringBytesRefFilterTest, OverseerTaskQueueTest, LegacyCloudClusterPropTest, TestSearchPerf, TestUniqueKeyFieldResource, TestApiFramework, IndexBasedSpellCheckerTest, TestNonDefinedSimilarityFactory, PropertiesRequestHandlerTest, ExplicitHLLTest, ReturnFieldsTest, TestRuleBasedAuthorizationPlugin, TestHighlightDedupGrouping, TestExportWriter, TestXmlQParserPlugin, BasicAuthIntegrationTest]
   [junit4] Completed [269/856 (2!)] on J1 in 10.49s, 1 test, 1 failure <<< FAILURES!

[...truncated 45258 lines...]
[repro] Jenkins log URL: https://jenkins.thetaphi.de/job/Lucene-Solr-master-Linux/24054/consoleText

[repro] Revision: cde00b9a84f3d57252d34daaa77f2b56cf9802cb

[repro] Ant options: "-Dargs=-XX:+UseCompressedOops -XX:+UseParallelGC"
[repro] Repro line:  ant test  -Dtestcase=MetricsHistoryWithAuthIntegrationTest -Dtests.method=testValuesAreCollected -Dtests.seed=C9DDA6254F404BB5 -Dtests.multiplier=3 -Dtests.slow=true -Dtests.locale=en-DM -Dtests.timezone=Africa/Ouagadougou -Dtests.asserts=true -Dtests.file.encoding=US-ASCII

[repro] Repro line:  ant test  -Dtestcase=BasicAuthIntegrationTest -Dtests.method=testBasicAuth -Dtests.seed=C9DDA6254F404BB5 -Dtests.multiplier=3 -Dtests.slow=true -Dtests.locale=nn-NO -Dtests.timezone=CNT -Dtests.asserts=true -Dtests.file.encoding=US-ASCII

[repro] ant clean

[...truncated 6 lines...]
[repro] Test suites by module:
[repro]    solr/core
[repro]       BasicAuthIntegrationTest
[repro]       MetricsHistoryWithAuthIntegrationTest
[repro] ant compile-test

[...truncated 3309 lines...]
[repro] ant test-nocompile -Dtests.dups=5 -Dtests.maxfailures=10 -Dtests.class="*.BasicAuthIntegrationTest|*.MetricsHistoryWithAuthIntegrationTest" -Dtests.showOutput=onerror "-Dargs=-XX:+UseCompressedOops -XX:+UseParallelGC" -Dtests.seed=C9DDA6254F404BB5 -Dtests.multiplier=3 -Dtests.slow=true -Dtests.locale=nn-NO -Dtests.timezone=CNT -Dtests.asserts=true -Dtests.file.encoding=US-ASCII

[...truncated 95 lines...]
[repro] Failures:
[repro]   0/5 failed: org.apache.solr.cloud.MetricsHistoryWithAuthIntegrationTest
[repro]   0/5 failed: org.apache.solr.security.BasicAuthIntegrationTest
[repro] Exiting with code 0

[...truncated 43 lines...]

[JENKINS] Lucene-Solr-master-Linux (64bit/jdk-11.0.2) - Build # 24056 - Failure!

Posted by Policeman Jenkins Server <je...@thetaphi.de>.
Build: https://jenkins.thetaphi.de/job/Lucene-Solr-master-Linux/24056/
Java: 64bit/jdk-11.0.2 -XX:-UseCompressedOops -XX:+UseParallelGC

All tests passed

Build Log:
[...truncated 62648 lines...]
-ecj-javadoc-lint-tests:
    [mkdir] Created dir: /tmp/ecj533909846
 [ecj-lint] Compiling 48 source files to /tmp/ecj533909846
 [ecj-lint] invalid Class-Path header in manifest of jar file: /home/jenkins/.ivy2/cache/org.restlet.jee/org.restlet/jars/org.restlet-2.3.0.jar
 [ecj-lint] invalid Class-Path header in manifest of jar file: /home/jenkins/.ivy2/cache/org.restlet.jee/org.restlet.ext.servlet/jars/org.restlet.ext.servlet-2.3.0.jar
 [ecj-lint] ----------
 [ecj-lint] 1. ERROR in /home/jenkins/workspace/Lucene-Solr-master-Linux/solr/contrib/dataimporthandler/src/test/org/apache/solr/handler/dataimport/MockInitialContextFactory.java (at line 23)
 [ecj-lint] 	import javax.naming.NamingException;
 [ecj-lint] 	       ^^^^^^^^^^^^^^^^^^^^^^^^^^^^
 [ecj-lint] The type javax.naming.NamingException is not accessible
 [ecj-lint] ----------
 [ecj-lint] 2. ERROR in /home/jenkins/workspace/Lucene-Solr-master-Linux/solr/contrib/dataimporthandler/src/test/org/apache/solr/handler/dataimport/MockInitialContextFactory.java (at line 28)
 [ecj-lint] 	public class MockInitialContextFactory implements InitialContextFactory {
 [ecj-lint] 	             ^^^^^^^^^^^^^^^^^^^^^^^^^
 [ecj-lint] The type MockInitialContextFactory must implement the inherited abstract method InitialContextFactory.getInitialContext(Hashtable<?,?>)
 [ecj-lint] ----------
 [ecj-lint] 3. ERROR in /home/jenkins/workspace/Lucene-Solr-master-Linux/solr/contrib/dataimporthandler/src/test/org/apache/solr/handler/dataimport/MockInitialContextFactory.java (at line 30)
 [ecj-lint] 	private final javax.naming.Context context;
 [ecj-lint] 	              ^^^^^^^^^^^^^^^^^^^^
 [ecj-lint] The type javax.naming.Context is not accessible
 [ecj-lint] ----------
 [ecj-lint] 4. ERROR in /home/jenkins/workspace/Lucene-Solr-master-Linux/solr/contrib/dataimporthandler/src/test/org/apache/solr/handler/dataimport/MockInitialContextFactory.java (at line 33)
 [ecj-lint] 	context = mock(javax.naming.Context.class);
 [ecj-lint] 	^^^^^^^
 [ecj-lint] context cannot be resolved to a variable
 [ecj-lint] ----------
 [ecj-lint] 5. ERROR in /home/jenkins/workspace/Lucene-Solr-master-Linux/solr/contrib/dataimporthandler/src/test/org/apache/solr/handler/dataimport/MockInitialContextFactory.java (at line 33)
 [ecj-lint] 	context = mock(javax.naming.Context.class);
 [ecj-lint] 	               ^^^^^^^^^^^^^^^^^^^^
 [ecj-lint] The type javax.naming.Context is not accessible
 [ecj-lint] ----------
 [ecj-lint] 6. ERROR in /home/jenkins/workspace/Lucene-Solr-master-Linux/solr/contrib/dataimporthandler/src/test/org/apache/solr/handler/dataimport/MockInitialContextFactory.java (at line 36)
 [ecj-lint] 	when(context.lookup(anyString())).thenAnswer(invocation -> objects.get(invocation.getArgument(0)));
 [ecj-lint] 	     ^^^^^^^
 [ecj-lint] context cannot be resolved
 [ecj-lint] ----------
 [ecj-lint] 7. ERROR in /home/jenkins/workspace/Lucene-Solr-master-Linux/solr/contrib/dataimporthandler/src/test/org/apache/solr/handler/dataimport/MockInitialContextFactory.java (at line 38)
 [ecj-lint] 	} catch (NamingException e) {
 [ecj-lint] 	         ^^^^^^^^^^^^^^^
 [ecj-lint] NamingException cannot be resolved to a type
 [ecj-lint] ----------
 [ecj-lint] 8. ERROR in /home/jenkins/workspace/Lucene-Solr-master-Linux/solr/contrib/dataimporthandler/src/test/org/apache/solr/handler/dataimport/MockInitialContextFactory.java (at line 45)
 [ecj-lint] 	public javax.naming.Context getInitialContext(Hashtable env) {
 [ecj-lint] 	       ^^^^^^^^^^^^^^^^^^^^
 [ecj-lint] The type javax.naming.Context is not accessible
 [ecj-lint] ----------
 [ecj-lint] 9. ERROR in /home/jenkins/workspace/Lucene-Solr-master-Linux/solr/contrib/dataimporthandler/src/test/org/apache/solr/handler/dataimport/MockInitialContextFactory.java (at line 46)
 [ecj-lint] 	return context;
 [ecj-lint] 	       ^^^^^^^
 [ecj-lint] context cannot be resolved to a variable
 [ecj-lint] ----------
 [ecj-lint] 9 problems (9 errors)

BUILD FAILED
/home/jenkins/workspace/Lucene-Solr-master-Linux/build.xml:634: The following error occurred while executing this line:
/home/jenkins/workspace/Lucene-Solr-master-Linux/build.xml:101: The following error occurred while executing this line:
/home/jenkins/workspace/Lucene-Solr-master-Linux/solr/build.xml:687: The following error occurred while executing this line:
/home/jenkins/workspace/Lucene-Solr-master-Linux/solr/common-build.xml:479: The following error occurred while executing this line:
/home/jenkins/workspace/Lucene-Solr-master-Linux/lucene/common-build.xml:2016: The following error occurred while executing this line:
/home/jenkins/workspace/Lucene-Solr-master-Linux/lucene/common-build.xml:2049: Compile failed; see the compiler error output for details.

Total time: 82 minutes 0 seconds
Build step 'Invoke Ant' marked build as failure
Archiving artifacts
Setting ANT_1_8_2_HOME=/home/jenkins/tools/hudson.tasks.Ant_AntInstallation/ANT_1.8.2
[WARNINGS] Skipping publisher since build result is FAILURE
Recording test results
Setting ANT_1_8_2_HOME=/home/jenkins/tools/hudson.tasks.Ant_AntInstallation/ANT_1.8.2
Email was triggered for: Failure - Any
Sending email for trigger: Failure - Any
Setting ANT_1_8_2_HOME=/home/jenkins/tools/hudson.tasks.Ant_AntInstallation/ANT_1.8.2
Setting ANT_1_8_2_HOME=/home/jenkins/tools/hudson.tasks.Ant_AntInstallation/ANT_1.8.2
Setting ANT_1_8_2_HOME=/home/jenkins/tools/hudson.tasks.Ant_AntInstallation/ANT_1.8.2
Setting ANT_1_8_2_HOME=/home/jenkins/tools/hudson.tasks.Ant_AntInstallation/ANT_1.8.2
Setting ANT_1_8_2_HOME=/home/jenkins/tools/hudson.tasks.Ant_AntInstallation/ANT_1.8.2
Setting ANT_1_8_2_HOME=/home/jenkins/tools/hudson.tasks.Ant_AntInstallation/ANT_1.8.2

[JENKINS] Lucene-Solr-master-Linux (64bit/jdk-11) - Build # 24055 - Still Unstable!

Posted by Policeman Jenkins Server <je...@thetaphi.de>.
Build: https://jenkins.thetaphi.de/job/Lucene-Solr-master-Linux/24055/
Java: 64bit/jdk-11 -XX:-UseCompressedOops -XX:+UseConcMarkSweepGC

1 tests failed.
FAILED:  org.apache.solr.cloud.TestCloudSearcherWarming.testRepFactor1LeaderStartup

Error Message:
No live SolrServers available to handle this request

Stack Trace:
org.apache.solr.client.solrj.SolrServerException: No live SolrServers available to handle this request
	at org.apache.solr.client.solrj.impl.LBSolrClient.request(LBSolrClient.java:343)
	at org.apache.solr.client.solrj.impl.BaseCloudSolrClient.sendRequest(BaseCloudSolrClient.java:1068)
	at org.apache.solr.client.solrj.impl.BaseCloudSolrClient.requestWithRetryOnStaleState(BaseCloudSolrClient.java:837)
	at org.apache.solr.client.solrj.impl.BaseCloudSolrClient.request(BaseCloudSolrClient.java:769)
	at org.apache.solr.client.solrj.SolrRequest.process(SolrRequest.java:207)
	at org.apache.solr.client.solrj.SolrRequest.process(SolrRequest.java:224)
	at org.apache.solr.cloud.MiniSolrCloudCluster.deleteAllCollections(MiniSolrCloudCluster.java:547)
	at org.apache.solr.cloud.TestCloudSearcherWarming.tearDown(TestCloudSearcherWarming.java:78)
	at java.base/jdk.internal.reflect.NativeMethodAccessorImpl.invoke0(Native Method)
	at java.base/jdk.internal.reflect.NativeMethodAccessorImpl.invoke(NativeMethodAccessorImpl.java:62)
	at java.base/jdk.internal.reflect.DelegatingMethodAccessorImpl.invoke(DelegatingMethodAccessorImpl.java:43)
	at java.base/java.lang.reflect.Method.invoke(Method.java:566)
	at com.carrotsearch.randomizedtesting.RandomizedRunner.invoke(RandomizedRunner.java:1750)
	at com.carrotsearch.randomizedtesting.RandomizedRunner$10.evaluate(RandomizedRunner.java:996)
	at com.carrotsearch.randomizedtesting.rules.SystemPropertiesRestoreRule$1.evaluate(SystemPropertiesRestoreRule.java:57)
	at org.apache.lucene.util.TestRuleSetupTeardownChained$1.evaluate(TestRuleSetupTeardownChained.java:49)
	at org.apache.lucene.util.AbstractBeforeAfterRule$1.evaluate(AbstractBeforeAfterRule.java:45)
	at org.apache.lucene.util.TestRuleThreadAndTestName$1.evaluate(TestRuleThreadAndTestName.java:48)
	at org.apache.lucene.util.TestRuleIgnoreAfterMaxFailures$1.evaluate(TestRuleIgnoreAfterMaxFailures.java:64)
	at org.apache.lucene.util.TestRuleMarkFailure$1.evaluate(TestRuleMarkFailure.java:47)
	at com.carrotsearch.randomizedtesting.rules.StatementAdapter.evaluate(StatementAdapter.java:36)
	at com.carrotsearch.randomizedtesting.ThreadLeakControl$StatementRunner.run(ThreadLeakControl.java:368)
	at com.carrotsearch.randomizedtesting.ThreadLeakControl.forkTimeoutingTask(ThreadLeakControl.java:817)
	at com.carrotsearch.randomizedtesting.ThreadLeakControl$3.evaluate(ThreadLeakControl.java:468)
	at com.carrotsearch.randomizedtesting.RandomizedRunner.runSingleTest(RandomizedRunner.java:947)
	at com.carrotsearch.randomizedtesting.RandomizedRunner$5.evaluate(RandomizedRunner.java:832)
	at com.carrotsearch.randomizedtesting.RandomizedRunner$6.evaluate(RandomizedRunner.java:883)
	at com.carrotsearch.randomizedtesting.RandomizedRunner$7.evaluate(RandomizedRunner.java:894)
	at com.carrotsearch.randomizedtesting.rules.StatementAdapter.evaluate(StatementAdapter.java:36)
	at com.carrotsearch.randomizedtesting.rules.SystemPropertiesRestoreRule$1.evaluate(SystemPropertiesRestoreRule.java:57)
	at org.apache.lucene.util.AbstractBeforeAfterRule$1.evaluate(AbstractBeforeAfterRule.java:45)
	at com.carrotsearch.randomizedtesting.rules.StatementAdapter.evaluate(StatementAdapter.java:36)
	at org.apache.lucene.util.TestRuleStoreClassName$1.evaluate(TestRuleStoreClassName.java:41)
	at com.carrotsearch.randomizedtesting.rules.NoShadowingOrOverridesOnMethodsRule$1.evaluate(NoShadowingOrOverridesOnMethodsRule.java:40)
	at com.carrotsearch.randomizedtesting.rules.NoShadowingOrOverridesOnMethodsRule$1.evaluate(NoShadowingOrOverridesOnMethodsRule.java:40)
	at com.carrotsearch.randomizedtesting.rules.StatementAdapter.evaluate(StatementAdapter.java:36)
	at com.carrotsearch.randomizedtesting.rules.StatementAdapter.evaluate(StatementAdapter.java:36)
	at org.apache.lucene.util.TestRuleAssertionsRequired$1.evaluate(TestRuleAssertionsRequired.java:53)
	at org.apache.lucene.util.TestRuleMarkFailure$1.evaluate(TestRuleMarkFailure.java:47)
	at org.apache.lucene.util.TestRuleIgnoreAfterMaxFailures$1.evaluate(TestRuleIgnoreAfterMaxFailures.java:64)
	at org.apache.lucene.util.TestRuleIgnoreTestSuites$1.evaluate(TestRuleIgnoreTestSuites.java:54)
	at com.carrotsearch.randomizedtesting.rules.StatementAdapter.evaluate(StatementAdapter.java:36)
	at com.carrotsearch.randomizedtesting.ThreadLeakControl$StatementRunner.run(ThreadLeakControl.java:368)
	at java.base/java.lang.Thread.run(Thread.java:834)




Build Log:
[...truncated 2010 lines...]
   [junit4] JVM J2: stderr was not empty, see: /home/jenkins/workspace/Lucene-Solr-master-Linux/lucene/build/core/test/temp/junit4-J2-20190509_093131_8163761543322859122658.syserr
   [junit4] >>> JVM J2 emitted unexpected output (verbatim) ----
   [junit4] OpenJDK 64-Bit Server VM warning: Option UseConcMarkSweepGC was deprecated in version 9.0 and will likely be removed in a future release.
   [junit4] <<< JVM J2: EOF ----

   [junit4] JVM J1: stderr was not empty, see: /home/jenkins/workspace/Lucene-Solr-master-Linux/lucene/build/core/test/temp/junit4-J1-20190509_093131_81610651048451273820692.syserr
   [junit4] >>> JVM J1 emitted unexpected output (verbatim) ----
   [junit4] OpenJDK 64-Bit Server VM warning: Option UseConcMarkSweepGC was deprecated in version 9.0 and will likely be removed in a future release.
   [junit4] <<< JVM J1: EOF ----

[...truncated 5 lines...]
   [junit4] JVM J0: stderr was not empty, see: /home/jenkins/workspace/Lucene-Solr-master-Linux/lucene/build/core/test/temp/junit4-J0-20190509_093131_8165565182854192791264.syserr
   [junit4] >>> JVM J0 emitted unexpected output (verbatim) ----
   [junit4] OpenJDK 64-Bit Server VM warning: Option UseConcMarkSweepGC was deprecated in version 9.0 and will likely be removed in a future release.
   [junit4] <<< JVM J0: EOF ----

[...truncated 301 lines...]
   [junit4] JVM J0: stderr was not empty, see: /home/jenkins/workspace/Lucene-Solr-master-Linux/lucene/build/test-framework/test/temp/junit4-J0-20190509_094405_5137059703535129935153.syserr
   [junit4] >>> JVM J0 emitted unexpected output (verbatim) ----
   [junit4] OpenJDK 64-Bit Server VM warning: Option UseConcMarkSweepGC was deprecated in version 9.0 and will likely be removed in a future release.
   [junit4] <<< JVM J0: EOF ----

[...truncated 3 lines...]
   [junit4] JVM J1: stderr was not empty, see: /home/jenkins/workspace/Lucene-Solr-master-Linux/lucene/build/test-framework/test/temp/junit4-J1-20190509_094405_5192300700356209122226.syserr
   [junit4] >>> JVM J1 emitted unexpected output (verbatim) ----
   [junit4] OpenJDK 64-Bit Server VM warning: Option UseConcMarkSweepGC was deprecated in version 9.0 and will likely be removed in a future release.
   [junit4] <<< JVM J1: EOF ----

[...truncated 3 lines...]
   [junit4] JVM J2: stderr was not empty, see: /home/jenkins/workspace/Lucene-Solr-master-Linux/lucene/build/test-framework/test/temp/junit4-J2-20190509_094405_51917214014609652524502.syserr
   [junit4] >>> JVM J2 emitted unexpected output (verbatim) ----
   [junit4] OpenJDK 64-Bit Server VM warning: Option UseConcMarkSweepGC was deprecated in version 9.0 and will likely be removed in a future release.
   [junit4] <<< JVM J2: EOF ----

[...truncated 1075 lines...]
   [junit4] JVM J2: stderr was not empty, see: /home/jenkins/workspace/Lucene-Solr-master-Linux/lucene/build/analysis/common/test/temp/junit4-J2-20190509_094616_2116347013524395660896.syserr
   [junit4] >>> JVM J2 emitted unexpected output (verbatim) ----
   [junit4] OpenJDK 64-Bit Server VM warning: Option UseConcMarkSweepGC was deprecated in version 9.0 and will likely be removed in a future release.
   [junit4] <<< JVM J2: EOF ----

[...truncated 3 lines...]
   [junit4] JVM J1: stderr was not empty, see: /home/jenkins/workspace/Lucene-Solr-master-Linux/lucene/build/analysis/common/test/temp/junit4-J1-20190509_094616_2113544469994326754004.syserr
   [junit4] >>> JVM J1 emitted unexpected output (verbatim) ----
   [junit4] OpenJDK 64-Bit Server VM warning: Option UseConcMarkSweepGC was deprecated in version 9.0 and will likely be removed in a future release.
   [junit4] <<< JVM J1: EOF ----

[...truncated 3 lines...]
   [junit4] JVM J0: stderr was not empty, see: /home/jenkins/workspace/Lucene-Solr-master-Linux/lucene/build/analysis/common/test/temp/junit4-J0-20190509_094616_21115253516492928722497.syserr
   [junit4] >>> JVM J0 emitted unexpected output (verbatim) ----
   [junit4] OpenJDK 64-Bit Server VM warning: Option UseConcMarkSweepGC was deprecated in version 9.0 and will likely be removed in a future release.
   [junit4] <<< JVM J0: EOF ----

[...truncated 241 lines...]
   [junit4] JVM J2: stderr was not empty, see: /home/jenkins/workspace/Lucene-Solr-master-Linux/lucene/build/analysis/icu/test/temp/junit4-J2-20190509_094925_0863196315573039332431.syserr
   [junit4] >>> JVM J2 emitted unexpected output (verbatim) ----
   [junit4] OpenJDK 64-Bit Server VM warning: Option UseConcMarkSweepGC was deprecated in version 9.0 and will likely be removed in a future release.
   [junit4] <<< JVM J2: EOF ----

[...truncated 6 lines...]
   [junit4] JVM J1: stderr was not empty, see: /home/jenkins/workspace/Lucene-Solr-master-Linux/lucene/build/analysis/icu/test/temp/junit4-J1-20190509_094925_0866087194119789003112.syserr
   [junit4] >>> JVM J1 emitted unexpected output (verbatim) ----
   [junit4] OpenJDK 64-Bit Server VM warning: Option UseConcMarkSweepGC was deprecated in version 9.0 and will likely be removed in a future release.
   [junit4] <<< JVM J1: EOF ----

   [junit4] JVM J0: stderr was not empty, see: /home/jenkins/workspace/Lucene-Solr-master-Linux/lucene/build/analysis/icu/test/temp/junit4-J0-20190509_094925_0865411012342053047389.syserr
   [junit4] >>> JVM J0 emitted unexpected output (verbatim) ----
   [junit4] OpenJDK 64-Bit Server VM warning: Option UseConcMarkSweepGC was deprecated in version 9.0 and will likely be removed in a future release.
   [junit4] <<< JVM J0: EOF ----

[...truncated 252 lines...]
   [junit4] JVM J2: stderr was not empty, see: /home/jenkins/workspace/Lucene-Solr-master-Linux/lucene/build/analysis/kuromoji/test/temp/junit4-J2-20190509_094942_6528936824636210339863.syserr
   [junit4] >>> JVM J2 emitted unexpected output (verbatim) ----
   [junit4] OpenJDK 64-Bit Server VM warning: Option UseConcMarkSweepGC was deprecated in version 9.0 and will likely be removed in a future release.
   [junit4] <<< JVM J2: EOF ----

[...truncated 3 lines...]
   [junit4] JVM J1: stderr was not empty, see: /home/jenkins/workspace/Lucene-Solr-master-Linux/lucene/build/analysis/kuromoji/test/temp/junit4-J1-20190509_094942_6449427902786909422839.syserr
   [junit4] >>> JVM J1 emitted unexpected output (verbatim) ----
   [junit4] OpenJDK 64-Bit Server VM warning: Option UseConcMarkSweepGC was deprecated in version 9.0 and will likely be removed in a future release.
   [junit4] <<< JVM J1: EOF ----

   [junit4] JVM J0: stderr was not empty, see: /home/jenkins/workspace/Lucene-Solr-master-Linux/lucene/build/analysis/kuromoji/test/temp/junit4-J0-20190509_094942_6446298451834239421333.syserr
   [junit4] >>> JVM J0 emitted unexpected output (verbatim) ----
   [junit4] OpenJDK 64-Bit Server VM warning: Option UseConcMarkSweepGC was deprecated in version 9.0 and will likely be removed in a future release.
   [junit4] <<< JVM J0: EOF ----

[...truncated 154 lines...]
   [junit4] JVM J1: stderr was not empty, see: /home/jenkins/workspace/Lucene-Solr-master-Linux/lucene/build/analysis/morfologik/test/temp/junit4-J1-20190509_095022_03815664527480653100340.syserr
   [junit4] >>> JVM J1 emitted unexpected output (verbatim) ----
   [junit4] OpenJDK 64-Bit Server VM warning: Option UseConcMarkSweepGC was deprecated in version 9.0 and will likely be removed in a future release.
   [junit4] <<< JVM J1: EOF ----

[...truncated 3 lines...]
   [junit4] JVM J0: stderr was not empty, see: /home/jenkins/workspace/Lucene-Solr-master-Linux/lucene/build/analysis/morfologik/test/temp/junit4-J0-20190509_095022_0389641100256076896884.syserr
   [junit4] >>> JVM J0 emitted unexpected output (verbatim) ----
   [junit4] OpenJDK 64-Bit Server VM warning: Option UseConcMarkSweepGC was deprecated in version 9.0 and will likely be removed in a future release.
   [junit4] <<< JVM J0: EOF ----

[...truncated 3 lines...]
   [junit4] JVM J2: stderr was not empty, see: /home/jenkins/workspace/Lucene-Solr-master-Linux/lucene/build/analysis/morfologik/test/temp/junit4-J2-20190509_095022_03818042243531402887984.syserr
   [junit4] >>> JVM J2 emitted unexpected output (verbatim) ----
   [junit4] OpenJDK 64-Bit Server VM warning: Option UseConcMarkSweepGC was deprecated in version 9.0 and will likely be removed in a future release.
   [junit4] <<< JVM J2: EOF ----

[...truncated 206 lines...]
   [junit4] JVM J0: stderr was not empty, see: /home/jenkins/workspace/Lucene-Solr-master-Linux/lucene/build/analysis/nori/test/temp/junit4-J0-20190509_095027_87417757037524252705982.syserr
   [junit4] >>> JVM J0 emitted unexpected output (verbatim) ----
   [junit4] OpenJDK 64-Bit Server VM warning: Option UseConcMarkSweepGC was deprecated in version 9.0 and will likely be removed in a future release.
   [junit4] <<< JVM J0: EOF ----

   [junit4] JVM J2: stderr was not empty, see: /home/jenkins/workspace/Lucene-Solr-master-Linux/lucene/build/analysis/nori/test/temp/junit4-J2-20190509_095027_87416216851999804411755.syserr
   [junit4] >>> JVM J2 emitted unexpected output (verbatim) ----
   [junit4] OpenJDK 64-Bit Server VM warning: Option UseConcMarkSweepGC was deprecated in version 9.0 and will likely be removed in a future release.
   [junit4] <<< JVM J2: EOF ----

[...truncated 3 lines...]
   [junit4] JVM J1: stderr was not empty, see: /home/jenkins/workspace/Lucene-Solr-master-Linux/lucene/build/analysis/nori/test/temp/junit4-J1-20190509_095027_87410577393404823204193.syserr
   [junit4] >>> JVM J1 emitted unexpected output (verbatim) ----
   [junit4] OpenJDK 64-Bit Server VM warning: Option UseConcMarkSweepGC was deprecated in version 9.0 and will likely be removed in a future release.
   [junit4] <<< JVM J1: EOF ----

[...truncated 160 lines...]
   [junit4] JVM J2: stderr was not empty, see: /home/jenkins/workspace/Lucene-Solr-master-Linux/lucene/build/analysis/opennlp/test/temp/junit4-J2-20190509_095044_8944625167499795184339.syserr
   [junit4] >>> JVM J2 emitted unexpected output (verbatim) ----
   [junit4] OpenJDK 64-Bit Server VM warning: Option UseConcMarkSweepGC was deprecated in version 9.0 and will likely be removed in a future release.
   [junit4] <<< JVM J2: EOF ----

[...truncated 6 lines...]
   [junit4] JVM J0: stderr was not empty, see: /home/jenkins/workspace/Lucene-Solr-master-Linux/lucene/build/analysis/opennlp/test/temp/junit4-J0-20190509_095044_8943598416494564713461.syserr
   [junit4] >>> JVM J0 emitted unexpected output (verbatim) ----
   [junit4] OpenJDK 64-Bit Server VM warning: Option UseConcMarkSweepGC was deprecated in version 9.0 and will likely be removed in a future release.
   [junit4] <<< JVM J0: EOF ----

   [junit4] JVM J1: stderr was not empty, see: /home/jenkins/workspace/Lucene-Solr-master-Linux/lucene/build/analysis/opennlp/test/temp/junit4-J1-20190509_095044_89416379207721692643475.syserr
   [junit4] >>> JVM J1 emitted unexpected output (verbatim) ----
   [junit4] OpenJDK 64-Bit Server VM warning: Option UseConcMarkSweepGC was deprecated in version 9.0 and will likely be removed in a future release.
   [junit4] <<< JVM J1: EOF ----

[...truncated 171 lines...]
   [junit4] JVM J0: stderr was not empty, see: /home/jenkins/workspace/Lucene-Solr-master-Linux/lucene/build/analysis/phonetic/test/temp/junit4-J0-20190509_095048_57613900554407333140417.syserr
   [junit4] >>> JVM J0 emitted unexpected output (verbatim) ----
   [junit4] OpenJDK 64-Bit Server VM warning: Option UseConcMarkSweepGC was deprecated in version 9.0 and will likely be removed in a future release.
   [junit4] <<< JVM J0: EOF ----

   [junit4] JVM J1: stderr was not empty, see: /home/jenkins/workspace/Lucene-Solr-master-Linux/lucene/build/analysis/phonetic/test/temp/junit4-J1-20190509_095048_5763092629724574057257.syserr
   [junit4] >>> JVM J1 emitted unexpected output (verbatim) ----
   [junit4] OpenJDK 64-Bit Server VM warning: Option UseConcMarkSweepGC was deprecated in version 9.0 and will likely be removed in a future release.
   [junit4] <<< JVM J1: EOF ----

[...truncated 3 lines...]
   [junit4] JVM J2: stderr was not empty, see: /home/jenkins/workspace/Lucene-Solr-master-Linux/lucene/build/analysis/phonetic/test/temp/junit4-J2-20190509_095048_57616393310906991550124.syserr
   [junit4] >>> JVM J2 emitted unexpected output (verbatim) ----
   [junit4] OpenJDK 64-Bit Server VM warning: Option UseConcMarkSweepGC was deprecated in version 9.0 and will likely be removed in a future release.
   [junit4] <<< JVM J2: EOF ----

[...truncated 153 lines...]
   [junit4] JVM J0: stderr was not empty, see: /home/jenkins/workspace/Lucene-Solr-master-Linux/lucene/build/analysis/smartcn/test/temp/junit4-J0-20190509_095102_7872171252836560425795.syserr
   [junit4] >>> JVM J0 emitted unexpected output (verbatim) ----
   [junit4] OpenJDK 64-Bit Server VM warning: Option UseConcMarkSweepGC was deprecated in version 9.0 and will likely be removed in a future release.
   [junit4] <<< JVM J0: EOF ----

[...truncated 3 lines...]
   [junit4] JVM J1: stderr was not empty, see: /home/jenkins/workspace/Lucene-Solr-master-Linux/lucene/build/analysis/smartcn/test/temp/junit4-J1-20190509_095102_7873871260672965813560.syserr
   [junit4] >>> JVM J1 emitted unexpected output (verbatim) ----
   [junit4] OpenJDK 64-Bit Server VM warning: Option UseConcMarkSweepGC was deprecated in version 9.0 and will likely be removed in a future release.
   [junit4] <<< JVM J1: EOF ----

[...truncated 157 lines...]
   [junit4] JVM J0: stderr was not empty, see: /home/jenkins/workspace/Lucene-Solr-master-Linux/lucene/build/analysis/stempel/test/temp/junit4-J0-20190509_095121_17310510672125915909267.syserr
   [junit4] >>> JVM J0 emitted unexpected output (verbatim) ----
   [junit4] OpenJDK 64-Bit Server VM warning: Option UseConcMarkSweepGC was deprecated in version 9.0 and will likely be removed in a future release.
   [junit4] <<< JVM J0: EOF ----

   [junit4] JVM J1: stderr was not empty, see: /home/jenkins/workspace/Lucene-Solr-master-Linux/lucene/build/analysis/stempel/test/temp/junit4-J1-20190509_095121_1738826230744946393934.syserr
   [junit4] >>> JVM J1 emitted unexpected output (verbatim) ----
   [junit4] OpenJDK 64-Bit Server VM warning: Option UseConcMarkSweepGC was deprecated in version 9.0 and will likely be removed in a future release.
   [junit4] <<< JVM J1: EOF ----

[...truncated 3 lines...]
   [junit4] JVM J2: stderr was not empty, see: /home/jenkins/workspace/Lucene-Solr-master-Linux/lucene/build/analysis/stempel/test/temp/junit4-J2-20190509_095121_173101641934199820962.syserr
   [junit4] >>> JVM J2 emitted unexpected output (verbatim) ----
   [junit4] OpenJDK 64-Bit Server VM warning: Option UseConcMarkSweepGC was deprecated in version 9.0 and will likely be removed in a future release.
   [junit4] <<< JVM J2: EOF ----

[...truncated 178 lines...]
   [junit4] JVM J0: stderr was not empty, see: /home/jenkins/workspace/Lucene-Solr-master-Linux/lucene/build/backward-codecs/test/temp/junit4-J0-20190509_095125_6973614751277470367258.syserr
   [junit4] >>> JVM J0 emitted unexpected output (verbatim) ----
   [junit4] OpenJDK 64-Bit Server VM warning: Option UseConcMarkSweepGC was deprecated in version 9.0 and will likely be removed in a future release.
   [junit4] <<< JVM J0: EOF ----

[...truncated 9 lines...]
   [junit4] JVM J2: stderr was not empty, see: /home/jenkins/workspace/Lucene-Solr-master-Linux/lucene/build/backward-codecs/test/temp/junit4-J2-20190509_095125_7031264956422492766125.syserr
   [junit4] >>> JVM J2 emitted unexpected output (verbatim) ----
   [junit4] OpenJDK 64-Bit Server VM warning: Option UseConcMarkSweepGC was deprecated in version 9.0 and will likely be removed in a future release.
   [junit4] <<< JVM J2: EOF ----

[...truncated 9 lines...]
   [junit4] JVM J1: stderr was not empty, see: /home/jenkins/workspace/Lucene-Solr-master-Linux/lucene/build/backward-codecs/test/temp/junit4-J1-20190509_095125_69710750813392111959518.syserr
   [junit4] >>> JVM J1 emitted unexpected output (verbatim) ----
   [junit4] OpenJDK 64-Bit Server VM warning: Option UseConcMarkSweepGC was deprecated in version 9.0 and will likely be removed in a future release.
   [junit4] <<< JVM J1: EOF ----

[...truncated 1440 lines...]
   [junit4] JVM J2: stderr was not empty, see: /home/jenkins/workspace/Lucene-Solr-master-Linux/lucene/build/benchmark/test/temp/junit4-J2-20190509_095406_03816583367620730641124.syserr
   [junit4] >>> JVM J2 emitted unexpected output (verbatim) ----
   [junit4] OpenJDK 64-Bit Server VM warning: Option UseConcMarkSweepGC was deprecated in version 9.0 and will likely be removed in a future release.
   [junit4] <<< JVM J2: EOF ----

[...truncated 3 lines...]
   [junit4] JVM J1: stderr was not empty, see: /home/jenkins/workspace/Lucene-Solr-master-Linux/lucene/build/benchmark/test/temp/junit4-J1-20190509_095406_0388475207050483893843.syserr
   [junit4] >>> JVM J1 emitted unexpected output (verbatim) ----
   [junit4] OpenJDK 64-Bit Server VM warning: Option UseConcMarkSweepGC was deprecated in version 9.0 and will likely be removed in a future release.
   [junit4] <<< JVM J1: EOF ----

   [junit4] JVM J0: stderr was not empty, see: /home/jenkins/workspace/Lucene-Solr-master-Linux/lucene/build/benchmark/test/temp/junit4-J0-20190509_095406_03813606482832622341133.syserr
   [junit4] >>> JVM J0 emitted unexpected output (verbatim) ----
   [junit4] OpenJDK 64-Bit Server VM warning: Option UseConcMarkSweepGC was deprecated in version 9.0 and will likely be removed in a future release.
   [junit4] <<< JVM J0: EOF ----

[...truncated 238 lines...]
   [junit4] JVM J2: stderr was not empty, see: /home/jenkins/workspace/Lucene-Solr-master-Linux/lucene/build/classification/test/temp/junit4-J2-20190509_095416_4339755392894443413025.syserr
   [junit4] >>> JVM J2 emitted unexpected output (verbatim) ----
   [junit4] OpenJDK 64-Bit Server VM warning: Option UseConcMarkSweepGC was deprecated in version 9.0 and will likely be removed in a future release.
   [junit4] <<< JVM J2: EOF ----

   [junit4] JVM J0: stderr was not empty, see: /home/jenkins/workspace/Lucene-Solr-master-Linux/lucene/build/classification/test/temp/junit4-J0-20190509_095416_43316341011336865246564.syserr
   [junit4] >>> JVM J0 emitted unexpected output (verbatim) ----
   [junit4] OpenJDK 64-Bit Server VM warning: Option UseConcMarkSweepGC was deprecated in version 9.0 and will likely be removed in a future release.
   [junit4] <<< JVM J0: EOF ----

[...truncated 3 lines...]
   [junit4] JVM J1: stderr was not empty, see: /home/jenkins/workspace/Lucene-Solr-master-Linux/lucene/build/classification/test/temp/junit4-J1-20190509_095416_43311943579877346090537.syserr
   [junit4] >>> JVM J1 emitted unexpected output (verbatim) ----
   [junit4] OpenJDK 64-Bit Server VM warning: Option UseConcMarkSweepGC was deprecated in version 9.0 and will likely be removed in a future release.
   [junit4] <<< JVM J1: EOF ----

[...truncated 256 lines...]
   [junit4] JVM J1: stderr was not empty, see: /home/jenkins/workspace/Lucene-Solr-master-Linux/lucene/build/codecs/test/temp/junit4-J1-20190509_095434_1196236655260623919935.syserr
   [junit4] >>> JVM J1 emitted unexpected output (verbatim) ----
   [junit4] OpenJDK 64-Bit Server VM warning: Option UseConcMarkSweepGC was deprecated in version 9.0 and will likely be removed in a future release.
   [junit4] <<< JVM J1: EOF ----

[...truncated 5 lines...]
   [junit4] JVM J0: stderr was not empty, see: /home/jenkins/workspace/Lucene-Solr-master-Linux/lucene/build/codecs/test/temp/junit4-J0-20190509_095434_1196289632343158201237.syserr
   [junit4] >>> JVM J0 emitted unexpected output (verbatim) ----
   [junit4] OpenJDK 64-Bit Server VM warning: Option UseConcMarkSweepGC was deprecated in version 9.0 and will likely be removed in a future release.
   [junit4] <<< JVM J0: EOF ----

[...truncated 4 lines...]
   [junit4] JVM J2: stderr was not empty, see: /home/jenkins/workspace/Lucene-Solr-master-Linux/lucene/build/codecs/test/temp/junit4-J2-20190509_095434_1204218122030551816959.syserr
   [junit4] >>> JVM J2 emitted unexpected output (verbatim) ----
   [junit4] OpenJDK 64-Bit Server VM warning: Option UseConcMarkSweepGC was deprecated in version 9.0 and will likely be removed in a future release.
   [junit4] <<< JVM J2: EOF ----

[...truncated 206 lines...]
   [junit4] JVM J0: stderr was not empty, see: /home/jenkins/workspace/Lucene-Solr-master-Linux/lucene/build/demo/test/temp/junit4-J0-20190509_095846_9129644522223203566301.syserr
   [junit4] >>> JVM J0 emitted unexpected output (verbatim) ----
   [junit4] OpenJDK 64-Bit Server VM warning: Option UseConcMarkSweepGC was deprecated in version 9.0 and will likely be removed in a future release.
   [junit4] <<< JVM J0: EOF ----

[...truncated 6 lines...]
   [junit4] JVM J1: stderr was not empty, see: /home/jenkins/workspace/Lucene-Solr-master-Linux/lucene/build/demo/test/temp/junit4-J1-20190509_095846_9187755475325619278327.syserr
   [junit4] >>> JVM J1 emitted unexpected output (verbatim) ----
   [junit4] OpenJDK 64-Bit Server VM warning: Option UseConcMarkSweepGC was deprecated in version 9.0 and will likely be removed in a future release.
   [junit4] <<< JVM J1: EOF ----

   [junit4] JVM J2: stderr was not empty, see: /home/jenkins/workspace/Lucene-Solr-master-Linux/lucene/build/demo/test/temp/junit4-J2-20190509_095846_919393696753884280632.syserr
   [junit4] >>> JVM J2 emitted unexpected output (verbatim) ----
   [junit4] OpenJDK 64-Bit Server VM warning: Option UseConcMarkSweepGC was deprecated in version 9.0 and will likely be removed in a future release.
   [junit4] <<< JVM J2: EOF ----

[...truncated 170 lines...]
   [junit4] JVM J2: stderr was not empty, see: /home/jenkins/workspace/Lucene-Solr-master-Linux/lucene/build/expressions/test/temp/junit4-J2-20190509_095851_0794498657252404334645.syserr
   [junit4] >>> JVM J2 emitted unexpected output (verbatim) ----
   [junit4] OpenJDK 64-Bit Server VM warning: Option UseConcMarkSweepGC was deprecated in version 9.0 and will likely be removed in a future release.
   [junit4] <<< JVM J2: EOF ----

   [junit4] JVM J1: stderr was not empty, see: /home/jenkins/workspace/Lucene-Solr-master-Linux/lucene/build/expressions/test/temp/junit4-J1-20190509_095851_0795557887732465123676.syserr
   [junit4] >>> JVM J1 emitted unexpected output (verbatim) ----
   [junit4] OpenJDK 64-Bit Server VM warning: Option UseConcMarkSweepGC was deprecated in version 9.0 and will likely be removed in a future release.
   [junit4] <<< JVM J1: EOF ----

[...truncated 6 lines...]
   [junit4] JVM J0: stderr was not empty, see: /home/jenkins/workspace/Lucene-Solr-master-Linux/lucene/build/expressions/test/temp/junit4-J0-20190509_095851_0799972112144926757596.syserr
   [junit4] >>> JVM J0 emitted unexpected output (verbatim) ----
   [junit4] OpenJDK 64-Bit Server VM warning: Option UseConcMarkSweepGC was deprecated in version 9.0 and will likely be removed in a future release.
   [junit4] <<< JVM J0: EOF ----

[...truncated 214 lines...]
   [junit4] JVM J1: stderr was not empty, see: /home/jenkins/workspace/Lucene-Solr-master-Linux/lucene/build/facet/test/temp/junit4-J1-20190509_095901_3913871513129522260672.syserr
   [junit4] >>> JVM J1 emitted unexpected output (verbatim) ----
   [junit4] OpenJDK 64-Bit Server VM warning: Option UseConcMarkSweepGC was deprecated in version 9.0 and will likely be removed in a future release.
   [junit4] <<< JVM J1: EOF ----

[...truncated 6 lines...]
   [junit4] JVM J2: stderr was not empty, see: /home/jenkins/workspace/Lucene-Solr-master-Linux/lucene/build/facet/test/temp/junit4-J2-20190509_095901_39112378231262124795952.syserr
   [junit4] >>> JVM J2 emitted unexpected output (verbatim) ----
   [junit4] OpenJDK 64-Bit Server VM warning: Option UseConcMarkSweepGC was deprecated in version 9.0 and will likely be removed in a future release.
   [junit4] <<< JVM J2: EOF ----

[...truncated 12 lines...]
   [junit4] JVM J0: stderr was not empty, see: /home/jenkins/workspace/Lucene-Solr-master-Linux/lucene/build/facet/test/temp/junit4-J0-20190509_095901_3918351265252829519887.syserr
   [junit4] >>> JVM J0 emitted unexpected output (verbatim) ----
   [junit4] OpenJDK 64-Bit Server VM warning: Option UseConcMarkSweepGC was deprecated in version 9.0 and will likely be removed in a future release.
   [junit4] <<< JVM J0: EOF ----

[...truncated 179 lines...]
   [junit4] JVM J1: stderr was not empty, see: /home/jenkins/workspace/Lucene-Solr-master-Linux/lucene/build/grouping/test/temp/junit4-J1-20190509_095954_0085303985444437889427.syserr
   [junit4] >>> JVM J1 emitted unexpected output (verbatim) ----
   [junit4] OpenJDK 64-Bit Server VM warning: Option UseConcMarkSweepGC was deprecated in version 9.0 and will likely be removed in a future release.
   [junit4] <<< JVM J1: EOF ----

[...truncated 3 lines...]
   [junit4] JVM J0: stderr was not empty, see: /home/jenkins/workspace/Lucene-Solr-master-Linux/lucene/build/grouping/test/temp/junit4-J0-20190509_095954_008368591545173815941.syserr
   [junit4] >>> JVM J0 emitted unexpected output (verbatim) ----
   [junit4] OpenJDK 64-Bit Server VM warning: Option UseConcMarkSweepGC was deprecated in version 9.0 and will likely be removed in a future release.
   [junit4] <<< JVM J0: EOF ----

[...truncated 3 lines...]
   [junit4] JVM J2: stderr was not empty, see: /home/jenkins/workspace/Lucene-Solr-master-Linux/lucene/build/grouping/test/temp/junit4-J2-20190509_095954_01217353222693413338693.syserr
   [junit4] >>> JVM J2 emitted unexpected output (verbatim) ----
   [junit4] OpenJDK 64-Bit Server VM warning: Option UseConcMarkSweepGC was deprecated in version 9.0 and will likely be removed in a future release.
   [junit4] <<< JVM J2: EOF ----

[...truncated 243 lines...]
   [junit4] JVM J1: stderr was not empty, see: /home/jenkins/workspace/Lucene-Solr-master-Linux/lucene/build/highlighter/test/temp/junit4-J1-20190509_100010_00917893224649978836369.syserr
   [junit4] >>> JVM J1 emitted unexpected output (verbatim) ----
   [junit4] OpenJDK 64-Bit Server VM warning: Option UseConcMarkSweepGC was deprecated in version 9.0 and will likely be removed in a future release.
   [junit4] <<< JVM J1: EOF ----

[...truncated 3 lines...]
   [junit4] JVM J0: stderr was not empty, see: /home/jenkins/workspace/Lucene-Solr-master-Linux/lucene/build/highlighter/test/temp/junit4-J0-20190509_100010_00811414420299968099068.syserr
   [junit4] >>> JVM J0 emitted unexpected output (verbatim) ----
   [junit4] OpenJDK 64-Bit Server VM warning: Option UseConcMarkSweepGC was deprecated in version 9.0 and will likely be removed in a future release.
   [junit4] <<< JVM J0: EOF ----

[...truncated 3 lines...]
   [junit4] JVM J2: stderr was not empty, see: /home/jenkins/workspace/Lucene-Solr-master-Linux/lucene/build/highlighter/test/temp/junit4-J2-20190509_100010_00911980422129011356791.syserr
   [junit4] >>> JVM J2 emitted unexpected output (verbatim) ----
   [junit4] OpenJDK 64-Bit Server VM warning: Option UseConcMarkSweepGC was deprecated in version 9.0 and will likely be removed in a future release.
   [junit4] <<< JVM J2: EOF ----

[...truncated 166 lines...]
   [junit4] JVM J1: stderr was not empty, see: /home/jenkins/workspace/Lucene-Solr-master-Linux/lucene/build/join/test/temp/junit4-J1-20190509_100043_8569643857085861036266.syserr
   [junit4] >>> JVM J1 emitted unexpected output (verbatim) ----
   [junit4] OpenJDK 64-Bit Server VM warning: Option UseConcMarkSweepGC was deprecated in version 9.0 and will likely be removed in a future release.
   [junit4] <<< JVM J1: EOF ----

[...truncated 3 lines...]
   [junit4] JVM J0: stderr was not empty, see: /home/jenkins/workspace/Lucene-Solr-master-Linux/lucene/build/join/test/temp/junit4-J0-20190509_100043_85610679879649254301794.syserr
   [junit4] >>> JVM J0 emitted unexpected output (verbatim) ----
   [junit4] OpenJDK 64-Bit Server VM warning: Option UseConcMarkSweepGC was deprecated in version 9.0 and will likely be removed in a future release.
   [junit4] <<< JVM J0: EOF ----

[...truncated 3 lines...]
   [junit4] JVM J2: stderr was not empty, see: /home/jenkins/workspace/Lucene-Solr-master-Linux/lucene/build/join/test/temp/junit4-J2-20190509_100043_8566187826509865673414.syserr
   [junit4] >>> JVM J2 emitted unexpected output (verbatim) ----
   [junit4] OpenJDK 64-Bit Server VM warning: Option UseConcMarkSweepGC was deprecated in version 9.0 and will likely be removed in a future release.
   [junit4] <<< JVM J2: EOF ----

[...truncated 274 lines...]
   [junit4] JVM J0: stderr was not empty, see: /home/jenkins/workspace/Lucene-Solr-master-Linux/lucene/build/luke/test/temp/junit4-J0-20190509_100109_57313038048325900463130.syserr
   [junit4] >>> JVM J0 emitted unexpected output (verbatim) ----
   [junit4] OpenJDK 64-Bit Server VM warning: Option UseConcMarkSweepGC was deprecated in version 9.0 and will likely be removed in a future release.
   [junit4] <<< JVM J0: EOF ----

   [junit4] JVM J2: stderr was not empty, see: /home/jenkins/workspace/Lucene-Solr-master-Linux/lucene/build/luke/test/temp/junit4-J2-20190509_100109_5731024424290134523082.syserr
   [junit4] >>> JVM J2 emitted unexpected output (verbatim) ----
   [junit4] OpenJDK 64-Bit Server VM warning: Option UseConcMarkSweepGC was deprecated in version 9.0 and will likely be removed in a future release.
   [junit4] <<< JVM J2: EOF ----

   [junit4] JVM J1: stderr was not empty, see: /home/jenkins/workspace/Lucene-Solr-master-Linux/lucene/build/luke/test/temp/junit4-J1-20190509_100109_5731526166087888768652.syserr
   [junit4] >>> JVM J1 emitted unexpected output (verbatim) ----
   [junit4] OpenJDK 64-Bit Server VM warning: Option UseConcMarkSweepGC was deprecated in version 9.0 and will likely be removed in a future release.
   [junit4] <<< JVM J1: EOF ----

[...truncated 149 lines...]
   [junit4] JVM J0: stderr was not empty, see: /home/jenkins/workspace/Lucene-Solr-master-Linux/lucene/build/memory/test/temp/junit4-J0-20190509_100117_1052496234993754844805.syserr
   [junit4] >>> JVM J0 emitted unexpected output (verbatim) ----
   [junit4] OpenJDK 64-Bit Server VM warning: Option UseConcMarkSweepGC was deprecated in version 9.0 and will likely be removed in a future release.
   [junit4] <<< JVM J0: EOF ----

[...truncated 3 lines...]
   [junit4] JVM J1: stderr was not empty, see: /home/jenkins/workspace/Lucene-Solr-master-Linux/lucene/build/memory/test/temp/junit4-J1-20190509_100117_10516113640474816301917.syserr
   [junit4] >>> JVM J1 emitted unexpected output (verbatim) ----
   [junit4] OpenJDK 64-Bit Server VM warning: Option UseConcMarkSweepGC was deprecated in version 9.0 and will likely be removed in a future release.
   [junit4] <<< JVM J1: EOF ----

[...truncated 182 lines...]
   [junit4] JVM J0: stderr was not empty, see: /home/jenkins/workspace/Lucene-Solr-master-Linux/lucene/build/misc/test/temp/junit4-J0-20190509_100140_047119718101902507949.syserr
   [junit4] >>> JVM J0 emitted unexpected output (verbatim) ----
   [junit4] OpenJDK 64-Bit Server VM warning: Option UseConcMarkSweepGC was deprecated in version 9.0 and will likely be removed in a future release.
   [junit4] <<< JVM J0: EOF ----

[...truncated 3 lines...]
   [junit4] JVM J2: stderr was not empty, see: /home/jenkins/workspace/Lucene-Solr-master-Linux/lucene/build/misc/test/temp/junit4-J2-20190509_100140_047380554075026509697.syserr
   [junit4] >>> JVM J2 emitted unexpected output (verbatim) ----
   [junit4] OpenJDK 64-Bit Server VM warning: Option UseConcMarkSweepGC was deprecated in version 9.0 and will likely be removed in a future release.
   [junit4] <<< JVM J2: EOF ----

[...truncated 3 lines...]
   [junit4] JVM J1: stderr was not empty, see: /home/jenkins/workspace/Lucene-Solr-master-Linux/lucene/build/misc/test/temp/junit4-J1-20190509_100140_0479841550501368304927.syserr
   [junit4] >>> JVM J1 emitted unexpected output (verbatim) ----
   [junit4] OpenJDK 64-Bit Server VM warning: Option UseConcMarkSweepGC was deprecated in version 9.0 and will likely be removed in a future release.
   [junit4] <<< JVM J1: EOF ----

[...truncated 298 lines...]
   [junit4] JVM J2: stderr was not empty, see: /home/jenkins/workspace/Lucene-Solr-master-Linux/lucene/build/queries/test/temp/junit4-J2-20190509_100215_34215358343745607978738.syserr
   [junit4] >>> JVM J2 emitted unexpected output (verbatim) ----
   [junit4] OpenJDK 64-Bit Server VM warning: Option UseConcMarkSweepGC was deprecated in version 9.0 and will likely be removed in a future release.
   [junit4] <<< JVM J2: EOF ----

[...truncated 6 lines...]
   [junit4] JVM J1: stderr was not empty, see: /home/jenkins/workspace/Lucene-Solr-master-Linux/lucene/build/queries/test/temp/junit4-J1-20190509_100215_3423277021922390707505.syserr
   [junit4] >>> JVM J1 emitted unexpected output (verbatim) ----
   [junit4] OpenJDK 64-Bit Server VM warning: Option UseConcMarkSweepGC was deprecated in version 9.0 and will likely be removed in a future release.
   [junit4] <<< JVM J1: EOF ----

   [junit4] JVM J0: stderr was not empty, see: /home/jenkins/workspace/Lucene-Solr-master-Linux/lucene/build/queries/test/temp/junit4-J0-20190509_100215_34214521202419035227570.syserr
   [junit4] >>> JVM J0 emitted unexpected output (verbatim) ----
   [junit4] OpenJDK 64-Bit Server VM warning: Option UseConcMarkSweepGC was deprecated in version 9.0 and will likely be removed in a future release.
   [junit4] <<< JVM J0: EOF ----

[...truncated 223 lines...]
   [junit4] JVM J0: stderr was not empty, see: /home/jenkins/workspace/Lucene-Solr-master-Linux/lucene/build/queryparser/test/temp/junit4-J0-20190509_100227_4014312277463691054709.syserr
   [junit4] >>> JVM J0 emitted unexpected output (verbatim) ----
   [junit4] OpenJDK 64-Bit Server VM warning: Option UseConcMarkSweepGC was deprecated in version 9.0 and will likely be removed in a future release.
   [junit4] <<< JVM J0: EOF ----

[...truncated 6 lines...]
   [junit4] JVM J1: stderr was not empty, see: /home/jenkins/workspace/Lucene-Solr-master-Linux/lucene/build/queryparser/test/temp/junit4-J1-20190509_100227_4011661982460647769878.syserr
   [junit4] >>> JVM J1 emitted unexpected output (verbatim) ----
   [junit4] OpenJDK 64-Bit Server VM warning: Option UseConcMarkSweepGC was deprecated in version 9.0 and will likely be removed in a future release.
   [junit4] <<< JVM J1: EOF ----

   [junit4] JVM J2: stderr was not empty, see: /home/jenkins/workspace/Lucene-Solr-master-Linux/lucene/build/queryparser/test/temp/junit4-J2-20190509_100227_40117332930090599444209.syserr
   [junit4] >>> JVM J2 emitted unexpected output (verbatim) ----
   [junit4] OpenJDK 64-Bit Server VM warning: Option UseConcMarkSweepGC was deprecated in version 9.0 and will likely be removed in a future release.
   [junit4] <<< JVM J2: EOF ----

[...truncated 207 lines...]
   [junit4] JVM J2: stderr was not empty, see: /home/jenkins/workspace/Lucene-Solr-master-Linux/lucene/build/replicator/test/temp/junit4-J2-20190509_100239_6397967842908138231256.syserr
   [junit4] >>> JVM J2 emitted unexpected output (verbatim) ----
   [junit4] OpenJDK 64-Bit Server VM warning: Option UseConcMarkSweepGC was deprecated in version 9.0 and will likely be removed in a future release.
   [junit4] <<< JVM J2: EOF ----

   [junit4] JVM J1: stderr was not empty, see: /home/jenkins/workspace/Lucene-Solr-master-Linux/lucene/build/replicator/test/temp/junit4-J1-20190509_100239_63917553847656891938820.syserr
   [junit4] >>> JVM J1 emitted unexpected output (verbatim) ----
   [junit4] OpenJDK 64-Bit Server VM warning: Option UseConcMarkSweepGC was deprecated in version 9.0 and will likely be removed in a future release.
   [junit4] <<< JVM J1: EOF ----

[...truncated 6 lines...]
   [junit4] JVM J0: stderr was not empty, see: /home/jenkins/workspace/Lucene-Solr-master-Linux/lucene/build/replicator/test/temp/junit4-J0-20190509_100239_6392746204160029504570.syserr
   [junit4] >>> JVM J0 emitted unexpected output (verbatim) ----
   [junit4] OpenJDK 64-Bit Server VM warning: Option UseConcMarkSweepGC was deprecated in version 9.0 and will likely be removed in a future release.
   [junit4] <<< JVM J0: EOF ----

[...truncated 245 lines...]
   [junit4] JVM J0: stderr was not empty, see: /home/jenkins/workspace/Lucene-Solr-master-Linux/lucene/build/sandbox/test/temp/junit4-J0-20190509_100252_51615661270980606559736.syserr
   [junit4] >>> JVM J0 emitted unexpected output (verbatim) ----
   [junit4] OpenJDK 64-Bit Server VM warning: Option UseConcMarkSweepGC was deprecated in version 9.0 and will likely be removed in a future release.
   [junit4] <<< JVM J0: EOF ----

[...truncated 5 lines...]
   [junit4] JVM J1: stderr was not empty, see: /home/jenkins/workspace/Lucene-Solr-master-Linux/lucene/build/sandbox/test/temp/junit4-J1-20190509_100252_5161002973621965411328.syserr
   [junit4] >>> JVM J1 emitted unexpected output (verbatim) ----
   [junit4] OpenJDK 64-Bit Server VM warning: Option UseConcMarkSweepGC was deprecated in version 9.0 and will likely be removed in a future release.
   [junit4] <<< JVM J1: EOF ----

[...truncated 3 lines...]
   [junit4] JVM J2: stderr was not empty, see: /home/jenkins/workspace/Lucene-Solr-master-Linux/lucene/build/sandbox/test/temp/junit4-J2-20190509_100252_51617933985334656434274.syserr
   [junit4] >>> JVM J2 emitted unexpected output (verbatim) ----
   [junit4] OpenJDK 64-Bit Server VM warning: Option UseConcMarkSweepGC was deprecated in version 9.0 and will likely be removed in a future release.
   [junit4] <<< JVM J2: EOF ----

[...truncated 288 lines...]
   [junit4] JVM J1: stderr was not empty, see: /home/jenkins/workspace/Lucene-Solr-master-Linux/lucene/build/spatial-extras/test/temp/junit4-J1-20190509_100407_03313609278193417423528.syserr
   [junit4] >>> JVM J1 emitted unexpected output (verbatim) ----
   [junit4] OpenJDK 64-Bit Server VM warning: Option UseConcMarkSweepGC was deprecated in version 9.0 and will likely be removed in a future release.
   [junit4] <<< JVM J1: EOF ----

[...truncated 12 lines...]
   [junit4] JVM J2: stderr was not empty, see: /home/jenkins/workspace/Lucene-Solr-master-Linux/lucene/build/spatial-extras/test/temp/junit4-J2-20190509_100407_03310982360038921213241.syserr
   [junit4] >>> JVM J2 emitted unexpected output (verbatim) ----
   [junit4] OpenJDK 64-Bit Server VM warning: Option UseConcMarkSweepGC was deprecated in version 9.0 and will likely be removed in a future release.
   [junit4] <<< JVM J2: EOF ----

[...truncated 3 lines...]
   [junit4] JVM J0: stderr was not empty, see: /home/jenkins/workspace/Lucene-Solr-master-Linux/lucene/build/spatial-extras/test/temp/junit4-J0-20190509_100407_03312164161894514890434.syserr
   [junit4] >>> JVM J0 emitted unexpected output (verbatim) ----
   [junit4] OpenJDK 64-Bit Server VM warning: Option UseConcMarkSweepGC was deprecated in version 9.0 and will likely be removed in a future release.
   [junit4] <<< JVM J0: EOF ----

[...truncated 148 lines...]
   [junit4] JVM J0: stderr was not empty, see: /home/jenkins/workspace/Lucene-Solr-master-Linux/lucene/build/spatial/test/temp/junit4-J0-20190509_100438_07812674824921230831140.syserr
   [junit4] >>> JVM J0 emitted unexpected output (verbatim) ----
   [junit4] OpenJDK 64-Bit Server VM warning: Option UseConcMarkSweepGC was deprecated in version 9.0 and will likely be removed in a future release.
   [junit4] <<< JVM J0: EOF ----

[...truncated 181 lines...]
   [junit4] JVM J2: stderr was not empty, see: /home/jenkins/workspace/Lucene-Solr-master-Linux/lucene/build/spatial3d/test/temp/junit4-J2-20190509_100440_4119003372283035947572.syserr
   [junit4] >>> JVM J2 emitted unexpected output (verbatim) ----
   [junit4] OpenJDK 64-Bit Server VM warning: Option UseConcMarkSweepGC was deprecated in version 9.0 and will likely be removed in a future release.
   [junit4] <<< JVM J2: EOF ----

[...truncated 3 lines...]
   [junit4] JVM J0: stderr was not empty, see: /home/jenkins/workspace/Lucene-Solr-master-Linux/lucene/build/spatial3d/test/temp/junit4-J0-20190509_100440_41118013152654508491403.syserr
   [junit4] >>> JVM J0 emitted unexpected output (verbatim) ----
   [junit4] OpenJDK 64-Bit Server VM warning: Option UseConcMarkSweepGC was deprecated in version 9.0 and will likely be removed in a future release.
   [junit4] <<< JVM J0: EOF ----

[...truncated 6 lines...]
   [junit4] JVM J1: stderr was not empty, see: /home/jenkins/workspace/Lucene-Solr-master-Linux/lucene/build/spatial3d/test/temp/junit4-J1-20190509_100440_41110695219337583347165.syserr
   [junit4] >>> JVM J1 emitted unexpected output (verbatim) ----
   [junit4] OpenJDK 64-Bit Server VM warning: Option UseConcMarkSweepGC was deprecated in version 9.0 and will likely be removed in a future release.
   [junit4] <<< JVM J1: EOF ----

[...truncated 251 lines...]
   [junit4] JVM J2: stderr was not empty, see: /home/jenkins/workspace/Lucene-Solr-master-Linux/lucene/build/suggest/test/temp/junit4-J2-20190509_100611_4257704695975859469955.syserr
   [junit4] >>> JVM J2 emitted unexpected output (verbatim) ----
   [junit4] OpenJDK 64-Bit Server VM warning: Option UseConcMarkSweepGC was deprecated in version 9.0 and will likely be removed in a future release.
   [junit4] <<< JVM J2: EOF ----

[...truncated 3 lines...]
   [junit4] JVM J1: stderr was not empty, see: /home/jenkins/workspace/Lucene-Solr-master-Linux/lucene/build/suggest/test/temp/junit4-J1-20190509_100611_4245959575741550581573.syserr
   [junit4] >>> JVM J1 emitted unexpected output (verbatim) ----
   [junit4] OpenJDK 64-Bit Server VM warning: Option UseConcMarkSweepGC was deprecated in version 9.0 and will likely be removed in a future release.
   [junit4] <<< JVM J1: EOF ----

[...truncated 3 lines...]
   [junit4] JVM J0: stderr was not empty, see: /home/jenkins/workspace/Lucene-Solr-master-Linux/lucene/build/suggest/test/temp/junit4-J0-20190509_100611_42414833516543390781538.syserr
   [junit4] >>> JVM J0 emitted unexpected output (verbatim) ----
   [junit4] OpenJDK 64-Bit Server VM warning: Option UseConcMarkSweepGC was deprecated in version 9.0 and will likely be removed in a future release.
   [junit4] <<< JVM J0: EOF ----

[...truncated 3350 lines...]
   [junit4] Suite: org.apache.solr.cloud.TestCloudSearcherWarming
   [junit4]   2> Creating dataDir: /home/jenkins/workspace/Lucene-Solr-master-Linux/solr/build/solr-core/test/J1/temp/solr.cloud.TestCloudSearcherWarming_418E3D0241D041AB-001/init-core-data-001
   [junit4]   2> 1220050 WARN  (SUITE-TestCloudSearcherWarming-seed#[418E3D0241D041AB]-worker) [    ] o.a.s.SolrTestCaseJ4 startTrackingSearchers: numOpens=17 numCloses=17
   [junit4]   2> 1220051 INFO  (SUITE-TestCloudSearcherWarming-seed#[418E3D0241D041AB]-worker) [    ] o.a.s.SolrTestCaseJ4 Using PointFields (NUMERIC_POINTS_SYSPROP=true) w/NUMERIC_DOCVALUES_SYSPROP=false
   [junit4]   2> 1220051 INFO  (SUITE-TestCloudSearcherWarming-seed#[418E3D0241D041AB]-worker) [    ] o.a.s.SolrTestCaseJ4 Randomized ssl (false) and clientAuth (true) via: @org.apache.solr.util.RandomizeSSL(reason="", value=0.0/0.0, ssl=0.0/0.0, clientAuth=0.0/0.0)
   [junit4]   2> 1220051 INFO  (SUITE-TestCloudSearcherWarming-seed#[418E3D0241D041AB]-worker) [    ] o.a.s.SolrTestCaseJ4 SecureRandom sanity checks: test.solr.allowed.securerandom=null & java.security.egd=file:/dev/./urandom
   [junit4]   2> 1220053 INFO  (TEST-TestCloudSearcherWarming.testPeersyncFailureReplicationSuccess-seed#[418E3D0241D041AB]) [    ] o.a.s.SolrTestCaseJ4 ###Starting testPeersyncFailureReplicationSuccess
   [junit4]   2> 1220053 INFO  (TEST-TestCloudSearcherWarming.testPeersyncFailureReplicationSuccess-seed#[418E3D0241D041AB]) [    ] o.a.s.c.MiniSolrCloudCluster Starting cluster of 1 servers in /home/jenkins/workspace/Lucene-Solr-master-Linux/solr/build/solr-core/test/J1/temp/solr.cloud.TestCloudSearcherWarming_418E3D0241D041AB-001/tempDir-001
   [junit4]   2> 1220053 INFO  (TEST-TestCloudSearcherWarming.testPeersyncFailureReplicationSuccess-seed#[418E3D0241D041AB]) [    ] o.a.s.c.ZkTestServer STARTING ZK TEST SERVER
   [junit4]   2> 1220053 INFO  (ZkTestServer Run Thread) [    ] o.a.s.c.ZkTestServer client port:0.0.0.0/0.0.0.0:0
   [junit4]   2> 1220053 INFO  (ZkTestServer Run Thread) [    ] o.a.s.c.ZkTestServer Starting server
   [junit4]   2> 1220153 INFO  (TEST-TestCloudSearcherWarming.testPeersyncFailureReplicationSuccess-seed#[418E3D0241D041AB]) [    ] o.a.s.c.ZkTestServer start zk server on port:36401
   [junit4]   2> 1220153 INFO  (TEST-TestCloudSearcherWarming.testPeersyncFailureReplicationSuccess-seed#[418E3D0241D041AB]) [    ] o.a.s.c.ZkTestServer parse host and port list: 127.0.0.1:36401
   [junit4]   2> 1220154 INFO  (TEST-TestCloudSearcherWarming.testPeersyncFailureReplicationSuccess-seed#[418E3D0241D041AB]) [    ] o.a.s.c.ZkTestServer connecting to 127.0.0.1 36401
   [junit4]   2> 1220169 INFO  (zkConnectionManagerCallback-10069-thread-1) [    ] o.a.s.c.c.ConnectionManager zkClient has connected
   [junit4]   2> 1220170 INFO  (zkConnectionManagerCallback-10071-thread-1) [    ] o.a.s.c.c.ConnectionManager zkClient has connected
   [junit4]   2> 1220176 INFO  (zkConnectionManagerCallback-10073-thread-1) [    ] o.a.s.c.c.ConnectionManager zkClient has connected
   [junit4]   2> 1220184 WARN  (jetty-launcher-10074-thread-1) [    ] o.e.j.s.AbstractConnector Ignoring deprecated socket close linger time
   [junit4]   2> 1220184 INFO  (jetty-launcher-10074-thread-1) [    ] o.a.s.c.s.e.JettySolrRunner Start Jetty (original configured port=0)
   [junit4]   2> 1220184 INFO  (jetty-launcher-10074-thread-1) [    ] o.a.s.c.s.e.JettySolrRunner Trying to start Jetty on port 0 try number 1 ...
   [junit4]   2> 1220184 INFO  (jetty-launcher-10074-thread-1) [    ] o.e.j.s.Server jetty-9.4.14.v20181114; built: 2018-11-14T21:20:31.478Z; git: c4550056e785fb5665914545889f21dc136ad9e6; jvm 11+28
   [junit4]   2> 1220191 INFO  (jetty-launcher-10074-thread-1) [    ] o.e.j.s.session DefaultSessionIdManager workerName=node0
   [junit4]   2> 1220191 INFO  (jetty-launcher-10074-thread-1) [    ] o.e.j.s.session No SessionScavenger set, using defaults
   [junit4]   2> 1220191 INFO  (jetty-launcher-10074-thread-1) [    ] o.e.j.s.session node0 Scavenging every 600000ms
   [junit4]   2> 1220191 INFO  (jetty-launcher-10074-thread-1) [    ] o.e.j.s.h.ContextHandler Started o.e.j.s.ServletContextHandler@3a9781a{/solr,null,AVAILABLE}
   [junit4]   2> 1220200 INFO  (jetty-launcher-10074-thread-1) [    ] o.e.j.s.AbstractConnector Started ServerConnector@70d53015{HTTP/1.1,[http/1.1, h2c]}{127.0.0.1:46297}
   [junit4]   2> 1220200 INFO  (jetty-launcher-10074-thread-1) [    ] o.e.j.s.Server Started @1220239ms
   [junit4]   2> 1220200 INFO  (jetty-launcher-10074-thread-1) [    ] o.a.s.c.s.e.JettySolrRunner Jetty properties: {hostContext=/solr, hostPort=46297}
   [junit4]   2> 1220201 ERROR (jetty-launcher-10074-thread-1) [    ] o.a.s.u.StartupLoggingUtils Missing Java Option solr.log.dir. Logging may be missing or incomplete.
   [junit4]   2> 1220201 INFO  (jetty-launcher-10074-thread-1) [    ] o.a.s.s.SolrDispatchFilter Using logger factory org.apache.logging.slf4j.Log4jLoggerFactory
   [junit4]   2> 1220201 INFO  (jetty-launcher-10074-thread-1) [    ] o.a.s.s.SolrDispatchFilter  ___      _       Welcome to Apache Solr? version 9.0.0
   [junit4]   2> 1220201 INFO  (jetty-launcher-10074-thread-1) [    ] o.a.s.s.SolrDispatchFilter / __| ___| |_ _   Starting in cloud mode on port null
   [junit4]   2> 1220201 INFO  (jetty-launcher-10074-thread-1) [    ] o.a.s.s.SolrDispatchFilter \__ \/ _ \ | '_|  Install dir: null
   [junit4]   2> 1220201 INFO  (jetty-launcher-10074-thread-1) [    ] o.a.s.s.SolrDispatchFilter |___/\___/_|_|    Start time: 2019-05-09T10:28:03.045239Z
   [junit4]   2> 1220212 INFO  (zkConnectionManagerCallback-10076-thread-1) [    ] o.a.s.c.c.ConnectionManager zkClient has connected
   [junit4]   2> 1220213 INFO  (jetty-launcher-10074-thread-1) [    ] o.a.s.s.SolrDispatchFilter solr.xml found in ZooKeeper. Loading...
   [junit4]   2> 1220252 INFO  (jetty-launcher-10074-thread-1) [    ] o.a.s.h.c.HttpShardHandlerFactory Host whitelist initialized: WhitelistHostChecker [whitelistHosts=null, whitelistHostCheckingEnabled=true]
   [junit4]   2> 1220253 WARN  (jetty-launcher-10074-thread-1) [    ] o.e.j.u.s.S.config No Client EndPointIdentificationAlgorithm configured for SslContextFactory@4155827e[provider=null,keyStore=null,trustStore=null]
   [junit4]   2> 1220255 WARN  (jetty-launcher-10074-thread-1) [    ] o.e.j.u.s.S.config No Client EndPointIdentificationAlgorithm configured for SslContextFactory@16f83386[provider=null,keyStore=null,trustStore=null]
   [junit4]   2> 1220255 INFO  (jetty-launcher-10074-thread-1) [    ] o.a.s.c.ZkContainer Zookeeper client=127.0.0.1:36401/solr
   [junit4]   2> 1220256 INFO  (zkConnectionManagerCallback-10083-thread-1) [    ] o.a.s.c.c.ConnectionManager zkClient has connected
   [junit4]   2> 1220257 INFO  (zkConnectionManagerCallback-10085-thread-1) [    ] o.a.s.c.c.ConnectionManager zkClient has connected
   [junit4]   2> 1220285 INFO  (jetty-launcher-10074-thread-1) [n:127.0.0.1:46297_solr    ] o.a.s.c.OverseerElectionContext I am going to be the leader 127.0.0.1:46297_solr
   [junit4]   2> 1220285 INFO  (jetty-launcher-10074-thread-1) [n:127.0.0.1:46297_solr    ] o.a.s.c.Overseer Overseer (id=72220976476520453-127.0.0.1:46297_solr-n_0000000000) starting
   [junit4]   2> 1220288 INFO  (zkConnectionManagerCallback-10092-thread-1) [    ] o.a.s.c.c.ConnectionManager zkClient has connected
   [junit4]   2> 1220289 INFO  (jetty-launcher-10074-thread-1) [n:127.0.0.1:46297_solr    ] o.a.s.c.s.i.ZkClientClusterStateProvider Cluster at 127.0.0.1:36401/solr ready
   [junit4]   2> 1220289 INFO  (OverseerStateUpdate-72220976476520453-127.0.0.1:46297_solr-n_0000000000) [n:127.0.0.1:46297_solr    ] o.a.s.c.Overseer Starting to work on the main queue : 127.0.0.1:46297_solr
   [junit4]   2> 1220289 INFO  (jetty-launcher-10074-thread-1) [n:127.0.0.1:46297_solr    ] o.a.s.c.ZkController Register node as live in ZooKeeper:/live_nodes/127.0.0.1:46297_solr
   [junit4]   2> 1220290 INFO  (zkCallback-10084-thread-1) [    ] o.a.s.c.c.ZkStateReader Updated live nodes from ZooKeeper... (0) -> (1)
   [junit4]   2> 1220290 INFO  (zkCallback-10091-thread-1) [    ] o.a.s.c.c.ZkStateReader Updated live nodes from ZooKeeper... (0) -> (1)
   [junit4]   2> 1220300 INFO  (jetty-launcher-10074-thread-1) [n:127.0.0.1:46297_solr    ] o.a.s.h.a.MetricsHistoryHandler No .system collection, keeping metrics history in memory.
   [junit4]   2> 1220311 INFO  (jetty-launcher-10074-thread-1) [n:127.0.0.1:46297_solr    ] o.a.s.m.r.SolrJmxReporter JMX monitoring for 'solr_46297.solr.node' (registry 'solr.node') enabled at server: com.sun.jmx.mbeanserver.JmxMBeanServer@57a36b0c
   [junit4]   2> 1220317 INFO  (jetty-launcher-10074-thread-1) [n:127.0.0.1:46297_solr    ] o.a.s.m.r.SolrJmxReporter JMX monitoring for 'solr_46297.solr.jvm' (registry 'solr.jvm') enabled at server: com.sun.jmx.mbeanserver.JmxMBeanServer@57a36b0c
   [junit4]   2> 1220317 INFO  (jetty-launcher-10074-thread-1) [n:127.0.0.1:46297_solr    ] o.a.s.m.r.SolrJmxReporter JMX monitoring for 'solr_46297.solr.jetty' (registry 'solr.jetty') enabled at server: com.sun.jmx.mbeanserver.JmxMBeanServer@57a36b0c
   [junit4]   2> 1220317 INFO  (jetty-launcher-10074-thread-1) [n:127.0.0.1:46297_solr    ] o.a.s.c.CorePropertiesLocator Found 0 core definitions underneath /home/jenkins/workspace/Lucene-Solr-master-Linux/solr/build/solr-core/test/J1/temp/solr.cloud.TestCloudSearcherWarming_418E3D0241D041AB-001/tempDir-001/node1/.
   [junit4]   2> 1220327 INFO  (zkConnectionManagerCallback-10098-thread-1) [    ] o.a.s.c.c.ConnectionManager zkClient has connected
   [junit4]   2> 1220327 INFO  (TEST-TestCloudSearcherWarming.testPeersyncFailureReplicationSuccess-seed#[418E3D0241D041AB]) [    ] o.a.s.c.c.ZkStateReader Updated live nodes from ZooKeeper... (0) -> (1)
   [junit4]   2> 1220328 INFO  (TEST-TestCloudSearcherWarming.testPeersyncFailureReplicationSuccess-seed#[418E3D0241D041AB]) [    ] o.a.s.c.s.i.ZkClientClusterStateProvider Cluster at 127.0.0.1:36401/solr ready
   [junit4]   2> 1220330 INFO  (qtp1311002158-25389) [n:127.0.0.1:46297_solr    ] o.a.s.h.a.CollectionsHandler Invoked Collection Action :create with params pullReplicas=0&maxShardsPerNode=2&name=testPeersyncFailureReplicationSuccess&nrtReplicas=1&action=CREATE&numShards=1&tlogReplicas=0&createNodeSet=127.0.0.1:46297_solr&wt=javabin&version=2 and sendToOCPQueue=true
   [junit4]   2> 1220331 INFO  (OverseerThreadFactory-7625-thread-1-processing-n:127.0.0.1:46297_solr) [n:127.0.0.1:46297_solr    ] o.a.s.c.a.c.CreateCollectionCmd Create collection testPeersyncFailureReplicationSuccess
   [junit4]   2> 1220331 INFO  (OverseerThreadFactory-7625-thread-1-processing-n:127.0.0.1:46297_solr) [n:127.0.0.1:46297_solr    ] o.a.s.c.c.ZkConfigManager Copying zk node /configs/_default/protwords.txt to /configs/testPeersyncFailureReplicationSuccess.AUTOCREATED/protwords.txt
   [junit4]   2> 1220332 INFO  (OverseerThreadFactory-7625-thread-1-processing-n:127.0.0.1:46297_solr) [n:127.0.0.1:46297_solr    ] o.a.s.c.c.ZkConfigManager Copying zk node /configs/_default/managed-schema to /configs/testPeersyncFailureReplicationSuccess.AUTOCREATED/managed-schema
   [junit4]   2> 1220332 INFO  (OverseerThreadFactory-7625-thread-1-processing-n:127.0.0.1:46297_solr) [n:127.0.0.1:46297_solr    ] o.a.s.c.c.ZkConfigManager Copying zk node /configs/_default/solrconfig.xml to /configs/testPeersyncFailureReplicationSuccess.AUTOCREATED/solrconfig.xml
   [junit4]   2> 1220333 INFO  (OverseerThreadFactory-7625-thread-1-processing-n:127.0.0.1:46297_solr) [n:127.0.0.1:46297_solr    ] o.a.s.c.c.ZkConfigManager Copying zk node /configs/_default/synonyms.txt to /configs/testPeersyncFailureReplicationSuccess.AUTOCREATED/synonyms.txt
   [junit4]   2> 1220333 INFO  (OverseerThreadFactory-7625-thread-1-processing-n:127.0.0.1:46297_solr) [n:127.0.0.1:46297_solr    ] o.a.s.c.c.ZkConfigManager Copying zk node /configs/_default/stopwords.txt to /configs/testPeersyncFailureReplicationSuccess.AUTOCREATED/stopwords.txt
   [junit4]   2> 1220334 INFO  (OverseerThreadFactory-7625-thread-1-processing-n:127.0.0.1:46297_solr) [n:127.0.0.1:46297_solr    ] o.a.s.c.c.ZkConfigManager Copying zk node /configs/_default/lang/contractions_it.txt to /configs/testPeersyncFailureReplicationSuccess.AUTOCREATED/lang/contractions_it.txt
   [junit4]   2> 1220335 INFO  (OverseerThreadFactory-7625-thread-1-processing-n:127.0.0.1:46297_solr) [n:127.0.0.1:46297_solr    ] o.a.s.c.c.ZkConfigManager Copying zk node /configs/_default/lang/stemdict_nl.txt to /configs/testPeersyncFailureReplicationSuccess.AUTOCREATED/lang/stemdict_nl.txt
   [junit4]   2> 1220335 INFO  (OverseerThreadFactory-7625-thread-1-processing-n:127.0.0.1:46297_solr) [n:127.0.0.1:46297_solr    ] o.a.s.c.c.ZkConfigManager Copying zk node /configs/_default/lang/stopwords_hy.txt to /configs/testPeersyncFailureReplicationSuccess.AUTOCREATED/lang/stopwords_hy.txt
   [junit4]   2> 1220336 INFO  (OverseerThreadFactory-7625-thread-1-processing-n:127.0.0.1:46297_solr) [n:127.0.0.1:46297_solr    ] o.a.s.c.c.ZkConfigManager Copying zk node /configs/_default/lang/stopwords_no.txt to /configs/testPeersyncFailureReplicationSuccess.AUTOCREATED/lang/stopwords_no.txt
   [junit4]   2> 1220336 INFO  (OverseerThreadFactory-7625-thread-1-processing-n:127.0.0.1:46297_solr) [n:127.0.0.1:46297_solr    ] o.a.s.c.c.ZkConfigManager Copying zk node /configs/_default/lang/contractions_ca.txt to /configs/testPeersyncFailureReplicationSuccess.AUTOCREATED/lang/contractions_ca.txt
   [junit4]   2> 1220337 INFO  (OverseerThreadFactory-7625-thread-1-processing-n:127.0.0.1:46297_solr) [n:127.0.0.1:46297_solr    ] o.a.s.c.c.ZkConfigManager Copying zk node /configs/_default/lang/stopwords_id.txt to /configs/testPeersyncFailureReplicationSuccess.AUTOCREATED/lang/stopwords_id.txt
   [junit4]   2> 1220338 INFO  (OverseerThreadFactory-7625-thread-1-processing-n:127.0.0.1:46297_solr) [n:127.0.0.1:46297_solr    ] o.a.s.c.c.ZkConfigManager Copying zk node /configs/_default/lang/stopwords_ga.txt to /configs/testPeersyncFailureReplicationSuccess.AUTOCREATED/lang/stopwords_ga.txt
   [junit4]   2> 1220338 INFO  (OverseerThreadFactory-7625-thread-1-processing-n:127.0.0.1:46297_solr) [n:127.0.0.1:46297_solr    ] o.a.s.c.c.ZkConfigManager Copying zk node /configs/_default/lang/stopwords_hi.txt to /configs/testPeersyncFailureReplicationSuccess.AUTOCREATED/lang/stopwords_hi.txt
   [junit4]   2> 1220339 INFO  (OverseerThreadFactory-7625-thread-1-processing-n:127.0.0.1:46297_solr) [n:127.0.0.1:46297_solr    ] o.a.s.c.c.ZkConfigManager Copying zk node /configs/_default/lang/stopwords_da.txt to /configs/testPeersyncFailureReplicationSuccess.AUTOCREATED/lang/stopwords_da.txt
   [junit4]   2> 1220339 INFO  (OverseerThreadFactory-7625-thread-1-processing-n:127.0.0.1:46297_solr) [n:127.0.0.1:46297_solr    ] o.a.s.c.c.ZkConfigManager Copying zk node /configs/_default/lang/stopwords_ja.txt to /configs/testPeersyncFailureReplicationSuccess.AUTOCREATED/lang/stopwords_ja.txt
   [junit4]   2> 1220339 INFO  (OverseerThreadFactory-7625-thread-1-processing-n:127.0.0.1:46297_solr) [n:127.0.0.1:46297_solr    ] o.a.s.c.c.ZkConfigManager Copying zk node /configs/_default/lang/stopwords_pt.txt to /configs/testPeersyncFailureReplicationSuccess.AUTOCREATED/lang/stopwords_pt.txt
   [junit4]   2> 1220340 INFO  (OverseerThreadFactory-7625-thread-1-processing-n:127.0.0.1:46297_solr) [n:127.0.0.1:46297_solr    ] o.a.s.c.c.ZkConfigManager Copying zk node /configs/_default/lang/stopwords_hu.txt to /configs/testPeersyncFailureReplicationSuccess.AUTOCREATED/lang/stopwords_hu.txt
   [junit4]   2> 1220340 INFO  (OverseerThreadFactory-7625-thread-1-processing-n:127.0.0.1:46297_solr) [n:127.0.0.1:46297_solr    ] o.a.s.c.c.ZkConfigManager Copying zk node /configs/_default/lang/stopwords_el.txt to /configs/testPeersyncFailureReplicationSuccess.AUTOCREATED/lang/stopwords_el.txt
   [junit4]   2> 1220341 INFO  (OverseerThreadFactory-7625-thread-1-processing-n:127.0.0.1:46297_solr) [n:127.0.0.1:46297_solr    ] o.a.s.c.c.ZkConfigManager Copying zk node /configs/_default/lang/stopwords_ru.txt to /configs/testPeersyncFailureReplicationSuccess.AUTOCREATED/lang/stopwords_ru.txt
   [junit4]   2> 1220341 INFO  (OverseerThreadFactory-7625-thread-1-processing-n:127.0.0.1:46297_solr) [n:127.0.0.1:46297_solr    ] o.a.s.c.c.ZkConfigManager Copying zk node /configs/_default/lang/stopwords_tr.txt to /configs/testPeersyncFailureReplicationSuccess.AUTOCREATED/lang/stopwords_tr.txt
   [junit4]   2> 1220342 INFO  (OverseerThreadFactory-7625-thread-1-processing-n:127.0.0.1:46297_solr) [n:127.0.0.1:46297_solr    ] o.a.s.c.c.ZkConfigManager Copying zk node /configs/_default/lang/stopwords_ar.txt to /configs/testPeersyncFailureReplicationSuccess.AUTOCREATED/lang/stopwords_ar.txt
   [junit4]   2> 1220342 INFO  (OverseerThreadFactory-7625-thread-1-processing-n:127.0.0.1:46297_solr) [n:127.0.0.1:46297_solr    ] o.a.s.c.c.ZkConfigManager Copying zk node /configs/_default/lang/userdict_ja.txt to /configs/testPeersyncFailureReplicationSuccess.AUTOCREATED/lang/userdict_ja.txt
   [junit4]   2> 1220343 INFO  (OverseerThreadFactory-7625-thread-1-processing-n:127.0.0.1:46297_solr) [n:127.0.0.1:46297_solr    ] o.a.s.c.c.ZkConfigManager Copying zk node /configs/_default/lang/stopwords_eu.txt to /configs/testPeersyncFailureReplicationSuccess.AUTOCREATED/lang/stopwords_eu.txt
   [junit4]   2> 1220343 INFO  (OverseerThreadFactory-7625-thread-1-processing-n:127.0.0.1:46297_solr) [n:127.0.0.1:46297_solr    ] o.a.s.c.c.ZkConfigManager Copying zk node /configs/_default/lang/stopwords_it.txt to /configs/testPeersyncFailureReplicationSuccess.AUTOCREATED/lang/stopwords_it.txt
   [junit4]   2> 1220344 INFO  (OverseerThreadFactory-7625-thread-1-processing-n:127.0.0.1:46297_solr) [n:127.0.0.1:46297_solr    ] o.a.s.c.c.ZkConfigManager Copying zk node /configs/_default/lang/stopwords_cz.txt to /configs/testPeersyncFailureReplicationSuccess.AUTOCREATED/lang/stopwords_cz.txt
   [junit4]   2> 1220344 INFO  (OverseerThreadFactory-7625-thread-1-processing-n:127.0.0.1:46297_solr) [n:127.0.0.1:46297_solr    ] o.a.s.c.c.ZkConfigManager Copying zk node /configs/_default/lang/stoptags_ja.txt to /configs/testPeersyncFailureReplicationSuccess.AUTOCREATED/lang/stoptags_ja.txt
   [junit4]   2> 1220345 INFO  (OverseerThreadFactory-7625-thread-1-processing-n:127.0.0.1:46297_solr) [n:127.0.0.1:46297_solr    ] o.a.s.c.c.ZkConfigManager Copying zk node /configs/_default/lang/contractions_fr.txt to /configs/testPeersyncFailureReplicationSuccess.AUTOCREATED/lang/contractions_fr.txt
   [junit4]   2> 1220345 INFO  (OverseerThreadFactory-7625-thread-1-processing-n:127.0.0.1:46297_solr) [n:127.0.0.1:46297_solr    ] o.a.s.c.c.ZkConfigManager Copying zk node /configs/_default/lang/stopwords_de.txt to /configs/testPeersyncFailureReplicationSuccess.AUTOCREATED/lang/stopwords_de.txt
   [junit4]   2> 1220345 INFO  (OverseerThreadFactory-7625-thread-1-processing-n:127.0.0.1:46297_solr) [n:127.0.0.1:46297_solr    ] o.a.s.c.c.ZkConfigManager Copying zk node /configs/_default/lang/stopwords_fa.txt to /configs/testPeersyncFailureReplicationSuccess.AUTOCREATED/lang/stopwords_fa.txt
   [junit4]   2> 1220346 INFO  (OverseerThreadFactory-7625-thread-1-processing-n:127.0.0.1:46297_solr) [n:127.0.0.1:46297_solr    ] o.a.s.c.c.ZkConfigManager Copying zk node /configs/_default/lang/contractions_ga.txt to /configs/testPeersyncFailureReplicationSuccess.AUTOCREATED/lang/contractions_ga.txt
   [junit4]   2> 1220346 INFO  (OverseerThreadFactory-7625-thread-1-processing-n:127.0.0.1:46297_solr) [n:127.0.0.1:46297_solr    ] o.a.s.c.c.ZkConfigManager Copying zk node /configs/_default/lang/stopwords_ca.txt to /configs/testPeersyncFailureReplicationSuccess.AUTOCREATED/lang/stopwords_ca.txt
   [junit4]   2> 1220347 INFO  (OverseerThreadFactory-7625-thread-1-processing-n:127.0.0.1:46297_solr) [n:127.0.0.1:46297_solr    ] o.a.s.c.c.ZkConfigManager Copying zk node /configs/_default/lang/stopwords_nl.txt to /configs/testPeersyncFailureReplicationSuccess.AUTOCREATED/lang/stopwords_nl.txt
   [junit4]   2> 1220347 INFO  (OverseerThreadFactory-7625-thread-1-processing-n:127.0.0.1:46297_solr) [n:127.0.0.1:46297_solr    ] o.a.s.c.c.ZkConfigManager Copying zk node /configs/_default/lang/stopwords_bg.txt to /configs/testPeersyncFailureReplicationSuccess.AUTOCREATED/lang/stopwords_bg.txt
   [junit4]   2> 1220348 INFO  (OverseerThreadFactory-7625-thread-1-processing-n:127.0.0.1:46297_solr) [n:127.0.0.1:46297_solr    ] o.a.s.c.c.ZkConfigManager Copying zk node /configs/_default/lang/stopwords_lv.txt to /configs/testPeersyncFailureReplicationSuccess.AUTOCREATED/lang/stopwords_lv.txt
   [junit4]   2> 1220348 INFO  (OverseerThreadFactory-7625-thread-1-processing-n:127.0.0.1:46297_solr) [n:127.0.0.1:46297_solr    ] o.a.s.c.c.ZkConfigManager Copying zk node /configs/_default/lang/stopwords_en.txt to /configs/testPeersyncFailureReplicationSuccess.AUTOCREATED/lang/stopwords_en.txt
   [junit4]   2> 1220348 INFO  (OverseerThreadFactory-7625-thread-1-processing-n:127.0.0.1:46297_solr) [n:127.0.0.1:46297_solr    ] o.a.s.c.c.ZkConfigManager Copying zk node /configs/_default/lang/stopwords_es.txt to /configs/testPeersyncFailureReplicationSuccess.AUTOCREATED/lang/stopwords_es.txt
   [junit4]   2> 1220349 INFO  (OverseerThreadFactory-7625-thread-1-processing-n:127.0.0.1:46297_solr) [n:127.0.0.1:46297_solr    ] o.a.s.c.c.ZkConfigManager Copying zk node /configs/_default/lang/stopwords_th.txt to /configs/testPeersyncFailureReplicationSuccess.AUTOCREATED/lang/stopwords_th.txt
   [junit4]   2> 1220349 INFO  (OverseerThreadFactory-7625-thread-1-processing-n:127.0.0.1:46297_solr) [n:127.0.0.1:46297_solr    ] o.a.s.c.c.ZkConfigManager Copying zk node /configs/_default/lang/stopwords_ro.txt to /configs/testPeersyncFailureReplicationSuccess.AUTOCREATED/lang/stopwords_ro.txt
   [junit4]   2> 1220350 INFO  (OverseerThreadFactory-7625-thread-1-processing-n:127.0.0.1:46297_solr) [n:127.0.0.1:46297_solr    ] o.a.s.c.c.ZkConfigManager Copying zk node /configs/_default/lang/stopwords_fr.txt to /configs/testPeersyncFailureReplicationSuccess.AUTOCREATED/lang/stopwords_fr.txt
   [junit4]   2> 1220350 INFO  (OverseerThreadFactory-7625-thread-1-processing-n:127.0.0.1:46297_solr) [n:127.0.0.1:46297_solr    ] o.a.s.c.c.ZkConfigManager Copying zk node /configs/_default/lang/stopwords_sv.txt to /configs/testPeersyncFailureReplicationSuccess.AUTOCREATED/lang/stopwords_sv.txt
   [junit4]   2> 1220351 INFO  (OverseerThreadFactory-7625-thread-1-processing-n:127.0.0.1:46297_solr) [n:127.0.0.1:46297_solr    ] o.a.s.c.c.ZkConfigManager Copying zk node /configs/_default/lang/stopwords_fi.txt to /configs/testPeersyncFailureReplicationSuccess.AUTOCREATED/lang/stopwords_fi.txt
   [junit4]   2> 1220351 INFO  (OverseerThreadFactory-7625-thread-1-processing-n:127.0.0.1:46297_solr) [n:127.0.0.1:46297_solr    ] o.a.s.c.c.ZkConfigManager Copying zk node /configs/_default/lang/hyphenations_ga.txt to /configs/testPeersyncFailureReplicationSuccess.AUTOCREATED/lang/hyphenations_ga.txt
   [junit4]   2> 1220351 INFO  (OverseerThreadFactory-7625-thread-1-processing-n:127.0.0.1:46297_solr) [n:127.0.0.1:46297_solr    ] o.a.s.c.c.ZkConfigManager Copying zk node /configs/_default/lang/stopwords_gl.txt to /configs/testPeersyncFailureReplicationSuccess.AUTOCREATED/lang/stopwords_gl.txt
   [junit4]   2> 1220352 INFO  (OverseerThreadFactory-7625-thread-1-processing-n:127.0.0.1:46297_solr) [n:127.0.0.1:46297_solr    ] o.a.s.c.c.ZkConfigManager Copying zk node /configs/_default/params.json to /configs/testPeersyncFailureReplicationSuccess.AUTOCREATED/params.json
   [junit4]   2> 1220455 INFO  (OverseerStateUpdate-72220976476520453-127.0.0.1:46297_solr-n_0000000000) [n:127.0.0.1:46297_solr    ] o.a.s.c.o.SliceMutator createReplica() {
   [junit4]   2>   "operation":"ADDREPLICA",
   [junit4]   2>   "collection":"testPeersyncFailureReplicationSuccess",
   [junit4]   2>   "shard":"shard1",
   [junit4]   2>   "core":"testPeersyncFailureReplicationSuccess_shard1_replica_n1",
   [junit4]   2>   "state":"down",
   [junit4]   2>   "base_url":"http://127.0.0.1:46297/solr",
   [junit4]   2>   "type":"NRT",
   [junit4]   2>   "waitForFinalState":"false"} 
   [junit4]   2> 1220658 INFO  (qtp1311002158-25388) [n:127.0.0.1:46297_solr    x:testPeersyncFailureReplicationSuccess_shard1_replica_n1] o.a.s.h.a.CoreAdminOperation core create command qt=/admin/cores&coreNodeName=core_node2&collection.configName=testPeersyncFailureReplicationSuccess.AUTOCREATED&newCollection=true&name=testPeersyncFailureReplicationSuccess_shard1_replica_n1&action=CREATE&numShards=1&collection=testPeersyncFailureReplicationSuccess&shard=shard1&wt=javabin&version=2&replicaType=NRT
   [junit4]   2> 1220658 INFO  (qtp1311002158-25388) [n:127.0.0.1:46297_solr    x:testPeersyncFailureReplicationSuccess_shard1_replica_n1] o.a.s.c.TransientSolrCoreCacheDefault Allocating transient cache for 2147483647 transient cores
   [junit4]   2> 1221664 INFO  (qtp1311002158-25388) [n:127.0.0.1:46297_solr c:testPeersyncFailureReplicationSuccess s:shard1 r:core_node2 x:testPeersyncFailureReplicationSuccess_shard1_replica_n1] o.a.s.c.RequestParams conf resource params.json loaded . version : 0 
   [junit4]   2> 1221665 INFO  (qtp1311002158-25388) [n:127.0.0.1:46297_solr c:testPeersyncFailureReplicationSuccess s:shard1 r:core_node2 x:testPeersyncFailureReplicationSuccess_shard1_replica_n1] o.a.s.c.RequestParams request params refreshed to version 0
   [junit4]   2> 1221665 WARN  (qtp1311002158-25388) [n:127.0.0.1:46297_solr c:testPeersyncFailureReplicationSuccess s:shard1 r:core_node2 x:testPeersyncFailureReplicationSuccess_shard1_replica_n1] o.a.s.c.SolrConfig Couldn't add files from /home/jenkins/workspace/Lucene-Solr-master-Linux/solr/build/solr-core/test/J1/temp/solr.cloud.TestCloudSearcherWarming_418E3D0241D041AB-001/tempDir-001/node1/testPeersyncFailureReplicationSuccess_shard1_replica_n1/../../../../contrib/extraction/lib filtered by .*\.jar to classpath: /home/jenkins/workspace/Lucene-Solr-master-Linux/solr/build/solr-core/test/J1/temp/solr.cloud.TestCloudSearcherWarming_418E3D0241D041AB-001/tempDir-001/node1/testPeersyncFailureReplicationSuccess_shard1_replica_n1/../../../../contrib/extraction/lib
   [junit4]   2> 1221665 WARN  (qtp1311002158-25388) [n:127.0.0.1:46297_solr c:testPeersyncFailureReplicationSuccess s:shard1 r:core_node2 x:testPeersyncFailureReplicationSuccess_shard1_replica_n1] o.a.s.c.SolrConfig Couldn't add files from /home/jenkins/workspace/Lucene-Solr-master-Linux/solr/build/solr-core/test/J1/temp/solr.cloud.TestCloudSearcherWarming_418E3D0241D041AB-001/tempDir-001/node1/testPeersyncFailureReplicationSuccess_shard1_replica_n1/../../../../dist filtered by solr-cell-\d.*\.jar to classpath: /home/jenkins/workspace/Lucene-Solr-master-Linux/solr/build/solr-core/test/J1/temp/solr.cloud.TestCloudSearcherWarming_418E3D0241D041AB-001/tempDir-001/node1/testPeersyncFailureReplicationSuccess_shard1_replica_n1/../../../../dist
   [junit4]   2> 1221665 WARN  (qtp1311002158-25388) [n:127.0.0.1:46297_solr c:testPeersyncFailureReplicationSuccess s:shard1 r:core_node2 x:testPeersyncFailureReplicationSuccess_shard1_replica_n1] o.a.s.c.SolrConfig Couldn't add files from /home/jenkins/workspace/Lucene-Solr-master-Linux/solr/build/solr-core/test/J1/temp/solr.cloud.TestCloudSearcherWarming_418E3D0241D041AB-001/tempDir-001/node1/testPeersyncFailureReplicationSuccess_shard1_replica_n1/../../../../contrib/clustering/lib filtered by .*\.jar to classpath: /home/jenkins/workspace/Lucene-Solr-master-Linux/solr/build/solr-core/test/J1/temp/solr.cloud.TestCloudSearcherWarming_418E3D0241D041AB-001/tempDir-001/node1/testPeersyncFailureReplicationSuccess_shard1_replica_n1/../../../../contrib/clustering/lib
   [junit4]   2> 1221665 WARN  (qtp1311002158-25388) [n:127.0.0.1:46297_solr c:testPeersyncFailureReplicationSuccess s:shard1 r:core_node2 x:testPeersyncFailureReplicationSuccess_shard1_replica_n1] o.a.s.c.SolrConfig Couldn't add files from /home/jenkins/workspace/Lucene-Solr-master-Linux/solr/build/solr-core/test/J1/temp/solr.cloud.TestCloudSearcherWarming_418E3D0241D041AB-001/tempDir-001/node1/testPeersyncFailureReplicationSuccess_shard1_replica_n1/../../../../dist filtered by solr-clustering-\d.*\.jar to classpath: /home/jenkins/workspace/Lucene-Solr-master-Linux/solr/build/solr-core/test/J1/temp/solr.cloud.TestCloudSearcherWarming_418E3D0241D041AB-001/tempDir-001/node1/testPeersyncFailureReplicationSuccess_shard1_replica_n1/../../../../dist
   [junit4]   2> 1221665 WARN  (qtp1311002158-25388) [n:127.0.0.1:46297_solr c:testPeersyncFailureReplicationSuccess s:shard1 r:core_node2 x:testPeersyncFailureReplicationSuccess_shard1_replica_n1] o.a.s.c.SolrConfig Couldn't add files from /home/jenkins/workspace/Lucene-Solr-master-Linux/solr/build/solr-core/test/J1/temp/solr.cloud.TestCloudSearcherWarming_418E3D0241D041AB-001/tempDir-001/node1/testPeersyncFailureReplicationSuccess_shard1_replica_n1/../../../../contrib/langid/lib filtered by .*\.jar to classpath: /home/jenkins/workspace/Lucene-Solr-master-Linux/solr/build/solr-core/test/J1/temp/solr.cloud.TestCloudSearcherWarming_418E3D0241D041AB-001/tempDir-001/node1/testPeersyncFailureReplicationSuccess_shard1_replica_n1/../../../../contrib/langid/lib
   [junit4]   2> 1221665 WARN  (qtp1311002158-25388) [n:127.0.0.1:46297_solr c:testPeersyncFailureReplicationSuccess s:shard1 r:core_node2 x:testPeersyncFailureReplicationSuccess_shard1_replica_n1] o.a.s.c.SolrConfig Couldn't add files from /home/jenkins/workspace/Lucene-Solr-master-Linux/solr/build/solr-core/test/J1/temp/solr.cloud.TestCloudSearcherWarming_418E3D0241D041AB-001/tempDir-001/node1/testPeersyncFailureReplicationSuccess_shard1_replica_n1/../../../../dist filtered by solr-langid-\d.*\.jar to classpath: /home/jenkins/workspace/Lucene-Solr-master-Linux/solr/build/solr-core/test/J1/temp/solr.cloud.TestCloudSearcherWarming_418E3D0241D041AB-001/tempDir-001/node1/testPeersyncFailureReplicationSuccess_shard1_replica_n1/../../../../dist
   [junit4]   2> 1221665 WARN  (qtp1311002158-25388) [n:127.0.0.1:46297_solr c:testPeersyncFailureReplicationSuccess s:shard1 r:core_node2 x:testPeersyncFailureReplicationSuccess_shard1_replica_n1] o.a.s.c.SolrConfig Couldn't add files from /home/jenkins/workspace/Lucene-Solr-master-Linux/solr/build/solr-core/test/J1/temp/solr.cloud.TestCloudSearcherWarming_418E3D0241D041AB-001/tempDir-001/node1/testPeersyncFailureReplicationSuccess_shard1_replica_n1/../../../../contrib/velocity/lib filtered by .*\.jar to classpath: /home/jenkins/workspace/Lucene-Solr-master-Linux/solr/build/solr-core/test/J1/temp/solr.cloud.TestCloudSearcherWarming_418E3D0241D041AB-001/tempDir-001/node1/testPeersyncFailureReplicationSuccess_shard1_replica_n1/../../../../contrib/velocity/lib
   [junit4]   2> 1221665 WARN  (qtp1311002158-25388) [n:127.0.0.1:46297_solr c:testPeersyncFailureReplicationSuccess s:shard1 r:core_node2 x:testPeersyncFailureReplicationSuccess_shard1_replica_n1] o.a.s.c.SolrConfig Couldn't add files from /home/jenkins/workspace/Lucene-Solr-master-Linux/solr/build/solr-core/test/J1/temp/solr.cloud.TestCloudSearcherWarming_418E3D0241D041AB-001/tempDir-001/node1/testPeersyncFailureReplicationSuccess_shard1_replica_n1/../../../../dist filtered by solr-velocity-\d.*\.jar to classpath: /home/jenkins/workspace/Lucene-Solr-master-Linux/solr/build/solr-core/test/J1/temp/solr.cloud.TestCloudSearcherWarming_418E3D0241D041AB-001/tempDir-001/node1/testPeersyncFailureReplicationSuccess_shard1_replica_n1/../../../../dist
   [junit4]   2> 1221665 WARN  (qtp1311002158-25388) [n:127.0.0.1:46297_solr c:testPeersyncFailureReplicationSuccess s:shard1 r:core_node2 x:testPeersyncFailureReplicationSuccess_shard1_replica_n1] o.a.s.c.SolrConfig Couldn't add files from /home/jenkins/workspace/Lucene-Solr-master-Linux/solr/build/solr-core/test/J1/temp/solr.cloud.TestCloudSearcherWarming_418E3D0241D041AB-001/tempDir-001/node1/testPeersyncFailureReplicationSuccess_shard1_replica_n1/../../../../dist filtered by solr-ltr-\d.*\.jar to classpath: /home/jenkins/workspace/Lucene-Solr-master-Linux/solr/build/solr-core/test/J1/temp/solr.cloud.TestCloudSearcherWarming_418E3D0241D041AB-001/tempDir-001/node1/testPeersyncFailureReplicationSuccess_shard1_replica_n1/../../../../dist
   [junit4]   2> 1221666 INFO  (qtp1311002158-25388) [n:127.0.0.1:46297_solr c:testPeersyncFailureReplicationSuccess s:shard1 r:core_node2 x:testPeersyncFailureReplicationSuccess_shard1_replica_n1] o.a.s.c.SolrConfig Using Lucene MatchVersion: 9.0.0
   [junit4]   2> 1221686 INFO  (qtp1311002158-25388) [n:127.0.0.1:46297_solr c:testPeersyncFailureReplicationSuccess s:shard1 r:core_node2 x:testPeersyncFailureReplicationSuccess_shard1_replica_n1] o.a.s.s.IndexSchema [testPeersyncFailureReplicationSuccess_shard1_replica_n1] Schema name=default-config
   [junit4]   2> 1221787 INFO  (qtp1311002158-25388) [n:127.0.0.1:46297_solr c:testPeersyncFailureReplicationSuccess s:shard1 r:core_node2 x:testPeersyncFailureReplicationSuccess_shard1_replica_n1] o.a.s.s.IndexSchema Loaded schema default-config/1.6 with uniqueid field id
   [junit4]   2> 1221798 INFO  (qtp1311002158-25388) [n:127.0.0.1:46297_solr c:testPeersyncFailureReplicationSuccess s:shard1 r:core_node2 x:testPeersyncFailureReplicationSuccess_shard1_replica_n1] o.a.s.c.CoreContainer Creating SolrCore 'testPeersyncFailureReplicationSuccess_shard1_replica_n1' using configuration from collection testPeersyncFailureReplicationSuccess, trusted=true
   [junit4]   2> 1221798 INFO  (qtp1311002158-25388) [n:127.0.0.1:46297_solr c:testPeersyncFailureReplicationSuccess s:shard1 r:core_node2 x:testPeersyncFailureReplicationSuccess_shard1_replica_n1] o.a.s.m.r.SolrJmxReporter JMX monitoring for 'solr_46297.solr.core.testPeersyncFailureReplicationSuccess.shard1.replica_n1' (registry 'solr.core.testPeersyncFailureReplicationSuccess.shard1.replica_n1') enabled at server: com.sun.jmx.mbeanserver.JmxMBeanServer@57a36b0c
   [junit4]   2> 1221798 INFO  (qtp1311002158-25388) [n:127.0.0.1:46297_solr c:testPeersyncFailureReplicationSuccess s:shard1 r:core_node2 x:testPeersyncFailureReplicationSuccess_shard1_replica_n1] o.a.s.c.SolrCore [[testPeersyncFailureReplicationSuccess_shard1_replica_n1] ] Opening new SolrCore at [/home/jenkins/workspace/Lucene-Solr-master-Linux/solr/build/solr-core/test/J1/temp/solr.cloud.TestCloudSearcherWarming_418E3D0241D041AB-001/tempDir-001/node1/testPeersyncFailureReplicationSuccess_shard1_replica_n1], dataDir=[/home/jenkins/workspace/Lucene-Solr-master-Linux/solr/build/solr-core/test/J1/temp/solr.cloud.TestCloudSearcherWarming_418E3D0241D041AB-001/tempDir-001/node1/./testPeersyncFailureReplicationSuccess_shard1_replica_n1/data/]
   [junit4]   2> 1221933 INFO  (qtp1311002158-25388) [n:127.0.0.1:46297_solr c:testPeersyncFailureReplicationSuccess s:shard1 r:core_node2 x:testPeersyncFailureReplicationSuccess_shard1_replica_n1] o.a.s.r.XSLTResponseWriter xsltCacheLifetimeSeconds=5
   [junit4]   2> 1221965 INFO  (qtp1311002158-25388) [n:127.0.0.1:46297_solr c:testPeersyncFailureReplicationSuccess s:shard1 r:core_node2 x:testPeersyncFailureReplicationSuccess_shard1_replica_n1] o.a.s.u.UpdateHandler Using UpdateLog implementation: org.apache.solr.update.UpdateLog
   [junit4]   2> 1221965 INFO  (qtp1311002158-25388) [n:127.0.0.1:46297_solr c:testPeersyncFailureReplicationSuccess s:shard1 r:core_node2 x:testPeersyncFailureReplicationSuccess_shard1_replica_n1] o.a.s.u.UpdateLog Initializing UpdateLog: dataDir= defaultSyncLevel=FLUSH numRecordsToKeep=100 maxNumLogsToKeep=10 numVersionBuckets=65536
   [junit4]   2> 1221966 INFO  (qtp1311002158-25388) [n:127.0.0.1:46297_solr c:testPeersyncFailureReplicationSuccess s:shard1 r:core_node2 x:testPeersyncFailureReplicationSuccess_shard1_replica_n1] o.a.s.u.CommitTracker Hard AutoCommit: if uncommitted for 15000ms; 
   [junit4]   2> 1221966 INFO  (qtp1311002158-25388) [n:127.0.0.1:46297_solr c:testPeersyncFailureReplicationSuccess s:shard1 r:core_node2 x:testPeersyncFailureReplicationSuccess_shard1_replica_n1] o.a.s.u.CommitTracker Soft AutoCommit: disabled
   [junit4]   2> 1221967 INFO  (qtp1311002158-25388) [n:127.0.0.1:46297_solr c:testPeersyncFailureReplicationSuccess s:shard1 r:core_node2 x:testPeersyncFailureReplicationSuccess_shard1_replica_n1] o.a.s.s.SolrIndexSearcher Opening [Searcher@6d007f31[testPeersyncFailureReplicationSuccess_shard1_replica_n1] main]
   [junit4]   2> 1221968 INFO  (qtp1311002158-25388) [n:127.0.0.1:46297_solr c:testPeersyncFailureReplicationSuccess s:shard1 r:core_node2 x:testPeersyncFailureReplicationSuccess_shard1_replica_n1] o.a.s.r.ManagedResourceStorage Configured ZooKeeperStorageIO with znodeBase: /configs/testPeersyncFailureReplicationSuccess.AUTOCREATED
   [junit4]   2> 1221968 INFO  (qtp1311002158-25388) [n:127.0.0.1:46297_solr c:testPeersyncFailureReplicationSuccess s:shard1 r:core_node2 x:testPeersyncFailureReplicationSuccess_shard1_replica_n1] o.a.s.r.ManagedResourceStorage Loaded null at path _rest_managed.json using ZooKeeperStorageIO:path=/configs/testPeersyncFailureReplicationSuccess.AUTOCREATED
   [junit4]   2> 1221969 INFO  (qtp1311002158-25388) [n:127.0.0.1:46297_solr c:testPeersyncFailureReplicationSuccess s:shard1 r:core_node2 x:testPeersyncFailureReplicationSuccess_shard1_replica_n1] o.a.s.s.ZkIndexSchemaReader Creating ZooKeeper watch for the managed schema at /configs/testPeersyncFailureReplicationSuccess.AUTOCREATED/managed-schema
   [junit4]   2> 1221969 INFO  (qtp1311002158-25388) [n:127.0.0.1:46297_solr c:testPeersyncFailureReplicationSuccess s:shard1 r:core_node2 x:testPeersyncFailureReplicationSuccess_shard1_replica_n1] o.a.s.s.ZkIndexSchemaReader Current schema version 0 is already the latest
   [junit4]   2> 1221969 INFO  (qtp1311002158-25388) [n:127.0.0.1:46297_solr c:testPeersyncFailureReplicationSuccess s:shard1 r:core_node2 x:testPeersyncFailureReplicationSuccess_shard1_replica_n1] o.a.s.h.c.SpellCheckComponent Initializing spell checkers
   [junit4]   2> 1221969 INFO  (qtp1311002158-25388) [n:127.0.0.1:46297_solr c:testPeersyncFailureReplicationSuccess s:shard1 r:core_node2 x:testPeersyncFailureReplicationSuccess_shard1_replica_n1] o.a.s.s.DirectSolrSpellChecker init: {name=default,field=_text_,classname=solr.DirectSolrSpellChecker,distanceMeasure=internal,accuracy=0.5,maxEdits=2,minPrefix=1,maxInspections=5,minQueryLength=4,maxQueryFrequency=0.01}
   [junit4]   2> 1221970 INFO  (qtp1311002158-25388) [n:127.0.0.1:46297_solr c:testPeersyncFailureReplicationSuccess s:shard1 r:core_node2 x:testPeersyncFailureReplicationSuccess_shard1_replica_n1] o.a.s.h.ReplicationHandler Commits will be reserved for 10000ms.
   [junit4]   2> 1221970 INFO  (qtp1311002158-25388) [n:127.0.0.1:46297_solr c:testPeersyncFailureReplicationSuccess s:shard1 r:core_node2 x:testPeersyncFailureReplicationSuccess_shard1_replica_n1] o.a.s.u.UpdateLog Could not find max version in index or recent updates, using new clock 1633049834751524864
   [junit4]   2> 1221972 INFO  (searcherExecutor-7630-thread-1-processing-n:127.0.0.1:46297_solr x:testPeersyncFailureReplicationSuccess_shard1_replica_n1 c:testPeersyncFailureReplicationSuccess s:shard1 r:core_node2) [n:127.0.0.1:46297_solr c:testPeersyncFailureReplicationSuccess s:shard1 r:core_node2 x:testPeersyncFailureReplicationSuccess_shard1_replica_n1] o.a.s.c.QuerySenderListener QuerySenderListener sending requests to Searcher@6d007f31[testPeersyncFailureReplicationSuccess_shard1_replica_n1] main{ExitableDirectoryReader(UninvertingDirectoryReader())}
   [junit4]   2> 1221972 INFO  (searcherExecutor-7630-thread-1-processing-n:127.0.0.1:46297_solr x:testPeersyncFailureReplicationSuccess_shard1_replica_n1 c:testPeersyncFailureReplicationSuccess s:shard1 r:core_node2) [n:127.0.0.1:46297_solr c:testPeersyncFailureReplicationSuccess s:shard1 r:core_node2 x:testPeersyncFailureReplicationSuccess_shard1_replica_n1] o.a.s.c.QuerySenderListener QuerySenderListener done.
   [junit4]   2> 1221972 INFO  (searcherExecutor-7630-thread-1-processing-n:127.0.0.1:46297_solr x:testPeersyncFailureReplicationSuccess_shard1_replica_n1 c:testPeersyncFailureReplicationSuccess s:shard1 r:core_node2) [n:127.0.0.1:46297_solr c:testPeersyncFailureReplicationSuccess s:shard1 r:core_node2 x:testPeersyncFailureReplicationSuccess_shard1_replica_n1] o.a.s.h.c.SpellCheckComponent Loading spell index for spellchecker: default
   [junit4]   2> 1221972 INFO  (searcherExecutor-7630-thread-1-processing-n:127.0.0.1:46297_solr x:testPeersyncFailureReplicationSuccess_shard1_replica_n1 c:testPeersyncFailureReplicationSuccess s:shard1 r:core_node2) [n:127.0.0.1:46297_solr c:testPeersyncFailureReplicationSuccess s:shard1 r:core_node2 x:testPeersyncFailureReplicationSuccess_shard1_replica_n1] o.a.s.c.SolrCore [testPeersyncFailureReplicationSuccess_shard1_replica_n1] Registered new searcher Searcher@6d007f31[testPeersyncFailureReplicationSuccess_shard1_replica_n1] main{ExitableDirectoryReader(UninvertingDirectoryReader())}
   [junit4]   2> 1221973 INFO  (qtp1311002158-25388) [n:127.0.0.1:46297_solr c:testPeersyncFailureReplicationSuccess s:shard1 r:core_node2 x:testPeersyncFailureReplicationSuccess_shard1_replica_n1] o.a.s.c.ZkShardTerms Successful update of terms at /collections/testPeersyncFailureReplicationSuccess/terms/shard1 to Terms{values={core_node2=0}, version=0}
   [junit4]   2> 1221973 INFO  (qtp1311002158-25388) [n:127.0.0.1:46297_solr c:testPeersyncFailureReplicationSuccess s:shard1 r:core_node2 x:testPeersyncFailureReplicationSuccess_shard1_replica_n1] o.a.s.c.ShardLeaderElectionContextBase make sure parent is created /collections/testPeersyncFailureReplicationSuccess/leaders/shard1
   [junit4]   2> 1221974 INFO  (qtp1311002158-25388) [n:127.0.0.1:46297_solr c:testPeersyncFailureReplicationSuccess s:shard1 r:core_node2 x:testPeersyncFailureReplicationSuccess_shard1_replica_n1] o.a.s.c.ShardLeaderElectionContext Enough replicas found to continue.
   [junit4]   2> 1221974 INFO  (qtp1311002158-25388) [n:127.0.0.1:46297_solr c:testPeersyncFailureReplicationSuccess s:shard1 r:core_node2 x:testPeersyncFailureReplicationSuccess_shard1_replica_n1] o.a.s.c.ShardLeaderElectionContext I may be the new leader - try and sync
   [junit4]   2> 1221974 INFO  (qtp1311002158-25388) [n:127.0.0.1:46297_solr c:testPeersyncFailureReplicationSuccess s:shard1 r:core_node2 x:testPeersyncFailureReplicationSuccess_shard1_replica_n1] o.a.s.c.SyncStrategy Sync replicas to http://127.0.0.1:46297/solr/testPeersyncFailureReplicationSuccess_shard1_replica_n1/
   [junit4]   2> 1221974 INFO  (qtp1311002158-25388) [n:127.0.0.1:46297_solr c:testPeersyncFailureReplicationSuccess s:shard1 r:core_node2 x:testPeersyncFailureReplicationSuccess_shard1_replica_n1] o.a.s.c.SyncStrategy Sync Success - now sync replicas to me
   [junit4]   2> 1221974 INFO  (qtp1311002158-25388) [n:127.0.0.1:46297_solr c:testPeersyncFailureReplicationSuccess s:shard1 r:core_node2 x:testPeersyncFailureReplicationSuccess_shard1_replica_n1] o.a.s.c.SyncStrategy http://127.0.0.1:46297/solr/testPeersyncFailureRe

[...truncated too long message...]

+UseConcMarkSweepGC" -Dtests.seed=418E3D0241D041AB -Dtests.multiplier=3 -Dtests.slow=true -Dtests.locale=he -Dtests.timezone=Pacific/Pago_Pago -Dtests.asserts=true -Dtests.file.encoding=ISO-8859-1
Buildfile: /home/jenkins/workspace/Lucene-Solr-master-Linux/solr/core/build.xml

-clover.disable:

ivy-configure:
[ivy:configure] :: Apache Ivy 2.4.0 - 20141213170938 :: http://ant.apache.org/ivy/ ::
[ivy:configure] :: loading settings :: file = /home/jenkins/workspace/Lucene-Solr-master-Linux/lucene/top-level-ivy-settings.xml

install-junit4-taskdef:

ivy-availability-check:
[loadresource] Do not set property disallowed.ivy.jars.list as its length is 0.

-ivy-fail-disallowed-ivy-version:

ivy-fail:

resolve-groovy:
[ivy:cachepath] :: resolving dependencies :: org.codehaus.groovy#groovy-all-caller;working
[ivy:cachepath] 	confs: [default]
[ivy:cachepath] 	found org.codehaus.groovy#groovy-all;2.4.16 in public
[ivy:cachepath] :: resolution report :: resolve 17ms :: artifacts dl 0ms
	---------------------------------------------------------------------
	|                  |            modules            ||   artifacts   |
	|       conf       | number| search|dwnlded|evicted|| number|dwnlded|
	---------------------------------------------------------------------
	|      default     |   1   |   0   |   0   |   0   ||   1   |   0   |
	---------------------------------------------------------------------

-init-totals:

-test:
    [mkdir] Created dir: /home/jenkins/workspace/Lucene-Solr-master-Linux/solr/build/solr-core/test
[junit4:pickseed] Seed property 'tests.seed' already defined: 418E3D0241D041AB
    [mkdir] Created dir: /home/jenkins/workspace/Lucene-Solr-master-Linux/solr/build/solr-core/test/temp
   [junit4] <JUnit4> says नमस्ते! Master seed: 418E3D0241D041AB
   [junit4] Executing 5 suites with 3 JVMs.
   [junit4] 
   [junit4] Started J0 PID(6075@serv1.sd-datasolutions.de).
   [junit4] Started J2 PID(6076@serv1.sd-datasolutions.de).
   [junit4] Started J1 PID(6077@serv1.sd-datasolutions.de).
   [junit4] Suite: org.apache.solr.cloud.TestCloudSearcherWarming
   [junit4] OK      49.3s J2 | TestCloudSearcherWarming.testPeersyncFailureReplicationSuccess
   [junit4] OK      5.71s J2 | TestCloudSearcherWarming.testRepFactor1LeaderStartup
   [junit4] Completed [1/5] on J2 in 57.89s, 2 tests
   [junit4] 
   [junit4] Suite: org.apache.solr.cloud.TestCloudSearcherWarming
   [junit4] OK      50.8s J0 | TestCloudSearcherWarming.testPeersyncFailureReplicationSuccess
   [junit4] OK      6.26s J0 | TestCloudSearcherWarming.testRepFactor1LeaderStartup
   [junit4] Completed [2/5] on J0 in 59.86s, 2 tests
   [junit4] 
   [junit4] Suite: org.apache.solr.cloud.TestCloudSearcherWarming
   [junit4] OK      50.4s J1 | TestCloudSearcherWarming.testPeersyncFailureReplicationSuccess
   [junit4] OK      6.26s J1 | TestCloudSearcherWarming.testRepFactor1LeaderStartup
   [junit4] Completed [3/5] on J1 in 60.00s, 2 tests
   [junit4] 
   [junit4] JVM J1: stderr was not empty, see: /home/jenkins/workspace/Lucene-Solr-master-Linux/solr/build/solr-core/test/temp/junit4-J1-20190509_110041_5725257955615142843980.syserr
   [junit4] >>> JVM J1 emitted unexpected output (verbatim) ----
   [junit4] OpenJDK 64-Bit Server VM warning: Option UseConcMarkSweepGC was deprecated in version 9.0 and will likely be removed in a future release.
   [junit4] <<< JVM J1: EOF ----
   [junit4] Suite: org.apache.solr.cloud.TestCloudSearcherWarming
   [junit4] OK      39.1s J2 | TestCloudSearcherWarming.testPeersyncFailureReplicationSuccess
   [junit4] OK      4.52s J2 | TestCloudSearcherWarming.testRepFactor1LeaderStartup
   [junit4] Completed [4/5] on J2 in 44.77s, 2 tests
   [junit4] 
   [junit4] JVM J2: stderr was not empty, see: /home/jenkins/workspace/Lucene-Solr-master-Linux/solr/build/solr-core/test/temp/junit4-J2-20190509_110041_576286726155792650973.syserr
   [junit4] >>> JVM J2 emitted unexpected output (verbatim) ----
   [junit4] OpenJDK 64-Bit Server VM warning: Option UseConcMarkSweepGC was deprecated in version 9.0 and will likely be removed in a future release.
   [junit4] <<< JVM J2: EOF ----
   [junit4] Suite: org.apache.solr.cloud.TestCloudSearcherWarming
   [junit4] OK      39.1s J0 | TestCloudSearcherWarming.testPeersyncFailureReplicationSuccess
   [junit4] OK      4.58s J0 | TestCloudSearcherWarming.testRepFactor1LeaderStartup
   [junit4] Completed [5/5] on J0 in 44.78s, 2 tests
   [junit4] 
   [junit4] JVM J0: stderr was not empty, see: /home/jenkins/workspace/Lucene-Solr-master-Linux/solr/build/solr-core/test/temp/junit4-J0-20190509_110041_57010226794762165645591.syserr
   [junit4] >>> JVM J0 emitted unexpected output (verbatim) ----
   [junit4] OpenJDK 64-Bit Server VM warning: Option UseConcMarkSweepGC was deprecated in version 9.0 and will likely be removed in a future release.
   [junit4] <<< JVM J0: EOF ----
   [junit4] JVM J0:     0.88 ..   106.76 =   105.88s
   [junit4] JVM J1:     0.88 ..    61.77 =    60.89s
   [junit4] JVM J2:     0.89 ..   104.71 =   103.82s
   [junit4] Execution time total: 1 minute 46 seconds
   [junit4] Tests summary: 5 suites, 10 tests
   [junit4] Could not remove temporary path: /home/jenkins/workspace/Lucene-Solr-master-Linux/solr/build/solr-core/test/J2 (java.nio.file.DirectoryNotEmptyException: Remaining files: [/home/jenkins/workspace/Lucene-Solr-master-Linux/solr/build/solr-core/test/J2/temp])
   [junit4] Could not remove temporary path: /home/jenkins/workspace/Lucene-Solr-master-Linux/solr/build/solr-core/test/J0 (java.nio.file.DirectoryNotEmptyException: Remaining files: [/home/jenkins/workspace/Lucene-Solr-master-Linux/solr/build/solr-core/test/J0/temp])
   [junit4] Could not remove temporary path: /home/jenkins/workspace/Lucene-Solr-master-Linux/solr/build/solr-core/test/J1 (java.nio.file.DirectoryNotEmptyException: Remaining files: [/home/jenkins/workspace/Lucene-Solr-master-Linux/solr/build/solr-core/test/J1/temp])
     [echo] 5 slowest tests:
[junit4:tophints] 196.90s | org.apache.solr.cloud.api.collections.ShardSplitTest
[junit4:tophints] 116.56s | org.apache.solr.update.SoftAutoCommitTest
[junit4:tophints] 111.05s | org.apache.solr.request.TestIntervalFaceting
[junit4:tophints] 101.81s | org.apache.solr.cloud.HttpPartitionWithTlogReplicasTest
[junit4:tophints] 101.67s | org.apache.solr.index.hdfs.CheckHdfsIndexTest

-check-totals:
WARNING: An illegal reflective access operation has occurred
WARNING: Illegal reflective access by org.codehaus.groovy.reflection.CachedClass (file:/home/jenkins/.ivy2/cache/org.codehaus.groovy/groovy-all/jars/groovy-all-2.4.16.jar) to method java.lang.Object.finalize()
WARNING: Please consider reporting this to the maintainers of org.codehaus.groovy.reflection.CachedClass
WARNING: Use --illegal-access=warn to enable warnings of further illegal reflective access operations
WARNING: All illegal access operations will be denied in a future release

test-nocompile:

BUILD SUCCESSFUL
Total time: 1 minute 49 seconds
[repro] Failures:
[repro]   0/5 failed: org.apache.solr.cloud.TestCloudSearcherWarming
[repro] Exiting with code 0
+ mv lucene/build lucene/build.repro
+ mv solr/build solr/build.repro
+ mv lucene/build.orig lucene/build
+ mv solr/build.orig solr/build
Archiving artifacts
Setting ANT_1_8_2_HOME=/home/jenkins/tools/hudson.tasks.Ant_AntInstallation/ANT_1.8.2
java.lang.InterruptedException: no matches found within 10000
	at hudson.FilePath$ValidateAntFileMask.hasMatch(FilePath.java:2802)
	at hudson.FilePath$ValidateAntFileMask.invoke(FilePath.java:2681)
	at hudson.FilePath$ValidateAntFileMask.invoke(FilePath.java:2662)
	at hudson.FilePath.act(FilePath.java:1075)
	at hudson.FilePath.act(FilePath.java:1058)
	at hudson.FilePath.validateAntFileMask(FilePath.java:2660)
	at hudson.tasks.ArtifactArchiver.perform(ArtifactArchiver.java:243)
	at hudson.tasks.BuildStepCompatibilityLayer.perform(BuildStepCompatibilityLayer.java:79)
	at hudson.tasks.BuildStepMonitor$1.perform(BuildStepMonitor.java:20)
	at hudson.model.AbstractBuild$AbstractBuildExecution.perform(AbstractBuild.java:741)
	at hudson.model.AbstractBuild$AbstractBuildExecution.performAllBuildSteps(AbstractBuild.java:690)
	at hudson.model.Build$BuildExecution.post2(Build.java:186)
	at hudson.model.AbstractBuild$AbstractBuildExecution.post(AbstractBuild.java:635)
	at hudson.model.Run.execute(Run.java:1843)
	at hudson.model.FreeStyleBuild.run(FreeStyleBuild.java:43)
	at hudson.model.ResourceController.execute(ResourceController.java:97)
	at hudson.model.Executor.run(Executor.java:429)
No artifacts found that match the file pattern "**/*.events,heapdumps/**,**/*_pid*.log". Configuration error?
[WARNINGS] Parsing warnings in console log with parser Java Compiler (javac)
Setting ANT_1_8_2_HOME=/home/jenkins/tools/hudson.tasks.Ant_AntInstallation/ANT_1.8.2
No credentials specified
Setting ANT_1_8_2_HOME=/home/jenkins/tools/hudson.tasks.Ant_AntInstallation/ANT_1.8.2
<Git Blamer> Using GitBlamer to create author and commit information for all warnings.
<Git Blamer> GIT_COMMIT=c988b04b1888d5091a9455d3ae34762eb0ca0cea, workspace=/home/jenkins/workspace/Lucene-Solr-master-Linux
[WARNINGS] Computing warning deltas based on reference build #24054
Recording test results
Setting ANT_1_8_2_HOME=/home/jenkins/tools/hudson.tasks.Ant_AntInstallation/ANT_1.8.2
Build step 'Publish JUnit test result report' changed build result to UNSTABLE
Email was triggered for: Unstable (Test Failures)
Sending email for trigger: Unstable (Test Failures)
Setting ANT_1_8_2_HOME=/home/jenkins/tools/hudson.tasks.Ant_AntInstallation/ANT_1.8.2
Setting ANT_1_8_2_HOME=/home/jenkins/tools/hudson.tasks.Ant_AntInstallation/ANT_1.8.2
Setting ANT_1_8_2_HOME=/home/jenkins/tools/hudson.tasks.Ant_AntInstallation/ANT_1.8.2
Setting ANT_1_8_2_HOME=/home/jenkins/tools/hudson.tasks.Ant_AntInstallation/ANT_1.8.2
Setting ANT_1_8_2_HOME=/home/jenkins/tools/hudson.tasks.Ant_AntInstallation/ANT_1.8.2
Setting ANT_1_8_2_HOME=/home/jenkins/tools/hudson.tasks.Ant_AntInstallation/ANT_1.8.2