You are viewing a plain text version of this content. The canonical link for it is here.
Posted to builds@beam.apache.org by Apache Jenkins Server <je...@builds.apache.org> on 2023/05/25 21:23:21 UTC
Build failed in Jenkins: beam_PostCommit_Java_ValidatesRunner_Direct_Java17 #2031
See <https://ci-beam.apache.org/job/beam_PostCommit_Java_ValidatesRunner_Direct_Java17/2031/display/redirect>
Changes:
------------------------------------------
Started by timer
Running as SYSTEM
[EnvInject] - Loading node environment variables.
Building remotely on apache-beam-jenkins-11 (beam) in workspace <https://ci-beam.apache.org/job/beam_PostCommit_Java_ValidatesRunner_Direct_Java17/ws/>
The recommended git tool is: NONE
No credentials specified
Wiping out workspace first.
Cloning the remote Git repository
Using shallow clone with depth 1
Avoid fetching tags
Cloning repository https://github.com/apache/beam.git
> git init <https://ci-beam.apache.org/job/beam_PostCommit_Java_ValidatesRunner_Direct_Java17/ws/src> # timeout=10
Fetching upstream changes from https://github.com/apache/beam.git
> git --version # timeout=10
> git --version # 'git version 2.25.1'
> git fetch --no-tags --force --progress --depth=1 -- https://github.com/apache/beam.git +refs/heads/*:refs/remotes/origin/* # timeout=10
> git config remote.origin.url https://github.com/apache/beam.git # timeout=10
> git config --add remote.origin.fetch +refs/heads/*:refs/remotes/origin/* # timeout=10
> git config remote.origin.url https://github.com/apache/beam.git # timeout=10
Using shallow fetch with depth 1
Fetching upstream changes from https://github.com/apache/beam.git
> git fetch --no-tags --force --progress --depth=1 -- https://github.com/apache/beam.git +refs/heads/*:refs/remotes/origin/* +refs/pull/${ghprbPullId}/*:refs/remotes/origin/pr/${ghprbPullId}/* # timeout=10
> git rev-parse origin/master^{commit} # timeout=10
Checking out Revision 3d85be031ea60e4e4f2655116d6769c46316c4da (origin/master)
> git config core.sparsecheckout # timeout=10
> git checkout -f 3d85be031ea60e4e4f2655116d6769c46316c4da # timeout=10
Commit message: "[Tour of beam][Playground] Use source directory as working directory (#26842)"
> git rev-list --no-walk 0963cf0bd0a791f86c1353ad488fe28f99cdfd0c # timeout=10
First time build. Skipping changelog.
No emails were triggered.
[EnvInject] - Executing scripts and injecting environment variables after the SCM step.
[EnvInject] - Injecting as environment variables the properties content
SETUPTOOLS_USE_DISTUTILS=stdlib
SPARK_LOCAL_IP=127.0.0.1
[EnvInject] - Variables injected successfully.
[Gradle] - Launching build.
[src] $ <https://ci-beam.apache.org/job/beam_PostCommit_Java_ValidatesRunner_Direct_Java17/ws/src/gradlew> -Dorg.gradle.java.home=/usr/lib/jvm/java-8-openjdk-amd64 :runners:direct-java:shadowJar :runners:direct-java:shadowTestJar
To honour the JVM settings for this build a single-use Daemon process will be forked. See https://docs.gradle.org/7.5.1/userguide/gradle_daemon.html#sec:disabling_the_daemon.
Daemon will be stopped at the end of the build
Configuration on demand is an incubating feature.
Gradle Enterprise plugins resolution: https://plugins.gradle.org/m2
Enforcing Gradle Enterprise: https://ge.apache.org, allowUntrustedServer: false
> Task :buildSrc:compileJava NO-SOURCE
> Task :buildSrc:compileGroovy
> Task :buildSrc:compileGroovy FAILED
FAILURE: Build failed with an exception.
* What went wrong:
Execution failed for task ':buildSrc:compileGroovy'.
> Failed to load cache entry a2a8fd8b9e0b101333e72efd52e77e6f for task ':buildSrc:compileGroovy': Could not load from local cache: Timeout waiting to lock Build cache (/home/jenkins/.gradle/caches/build-cache-1). It is currently in use by another Gradle instance.
Owner PID: 2429149
Our PID: 2440191
Owner Operation:
Our operation:
Lock file: /home/jenkins/.gradle/caches/build-cache-1/build-cache-1.lock
* Try:
> Run with --stacktrace option to get the stack trace.
> Run with --info or --debug option to get more log output.
* Get more help at https://help.gradle.org
BUILD FAILED in 1m 14s
1 actionable task: 1 executed
Publishing build scan...
https://ge.apache.org/s/zz5e6djdiyu7y
Build step 'Invoke Gradle script' changed build result to FAILURE
Build step 'Invoke Gradle script' marked build as failure
---------------------------------------------------------------------
To unsubscribe, e-mail: builds-unsubscribe@beam.apache.org
For additional commands, e-mail: builds-help@beam.apache.org
Jenkins build is back to normal : beam_PostCommit_Java_ValidatesRunner_Direct_Java17 #2032
Posted by Apache Jenkins Server <je...@builds.apache.org>.
See <https://ci-beam.apache.org/job/beam_PostCommit_Java_ValidatesRunner_Direct_Java17/2032/display/redirect>
---------------------------------------------------------------------
To unsubscribe, e-mail: builds-unsubscribe@beam.apache.org
For additional commands, e-mail: builds-help@beam.apache.org