You are viewing a plain text version of this content. The canonical link for it is here.
Posted to dev@solr.apache.org by Chris Hostetter <ho...@fucit.org> on 2024/10/14 19:54:10 UTC
Re: [JENKINS] Solr-main-Linux (64bit/openj9/jdk-17.0.8) - Build # 20654 - Still Unstable!
Uwe:
We've been seeing an epic number of these types of TimerThread "leak"
failures from your jenkins box in the past few week -- all that i've seen
have a thread name "file lock watchdog" and seem to be run on "openj9"
Are these possibly related to an openJ9 upgrade you made to your boxes ?
... maybe back in september?
Some random googling suggests the sysprop below might be useful to disable
this watchdog -- can you try setting this in your jenkins gradle
command options?
-Dcom.ibm.tools.attach.useFileLockWatchdog=false
https://github.com/eclipse-openj9/openj9/commit/f40f665db811f7686dd61d32c1e7c140ab35d78a
: Date: Mon, 14 Oct 2024 03:24:58 +0000 (UTC)
: From: Policeman Jenkins Server <je...@thetaphi.de>
: Reply-To: dev@solr.apache.org
: To: builds@solr.apache.org
: Subject: [JENKINS] Solr-main-Linux (64bit/openj9/jdk-17.0.8) - Build # 20654 -
: Still Unstable!
:
: Build: https://jenkins.thetaphi.de/job/Solr-main-Linux/20654/
: Java: 64bit/openj9/jdk-17.0.8 -XX:+UseCompressedOops -Xgcpolicy:balanced
:
: 106 tests failed.
: FAILED: org.apache.solr.bench.MiniClusterBenchStateTest.classMethod
:
: Error Message:
: com.carrotsearch.randomizedtesting.ThreadLeakError: There are still zombie threads that couldn't be terminated:
: 1) Thread[id=132, name=file lock watchdog, state=WAITING, group=main]
: at java.base/java.lang.Object.waitImpl(Native Method)
: at java.base/java.lang.Object.wait(Object.java:251)
: at java.base/java.lang.Object.wait(Object.java:190)
: at java.base/java.util.TimerThread.mainLoop(Timer.java:563)
: at java.base/java.util.TimerThread.run(Timer.java:542)
:
: Stack Trace:
: com.carrotsearch.randomizedtesting.ThreadLeakError: There are still zombie threads that couldn't be terminated:
: 1) Thread[id=132, name=file lock watchdog, state=WAITING, group=main]
: at java.base/java.lang.Object.waitImpl(Native Method)
: at java.base/java.lang.Object.wait(Object.java:251)
: at java.base/java.lang.Object.wait(Object.java:190)
: at java.base/java.util.TimerThread.mainLoop(Timer.java:563)
: at java.base/java.util.TimerThread.run(Timer.java:542)
: at __randomizedtesting.SeedInfo.seed([340F9724D936425B]:0)
:
:
: FAILED: org.apache.solr.bench.MiniClusterBenchStateTest.classMethod
:
: Error Message:
: com.carrotsearch.randomizedtesting.ThreadLeakError: 1 thread leaked from SUITE scope at org.apache.solr.bench.MiniClusterBenchStateTest:
: 1) Thread[id=132, name=file lock watchdog, state=TIMED_WAITING, group=main]
: at java.base/java.lang.Object.waitImpl(Native Method)
: at java.base/java.lang.Object.wait(Object.java:251)
: at java.base/java.lang.Object.wait(Object.java:219)
: at java.base/java.util.TimerThread.mainLoop(Timer.java:599)
: at java.base/java.util.TimerThread.run(Timer.java:542)
:
: Stack Trace:
: com.carrotsearch.randomizedtesting.ThreadLeakError: 1 thread leaked from SUITE scope at org.apache.solr.bench.MiniClusterBenchStateTest:
: 1) Thread[id=132, name=file lock watchdog, state=TIMED_WAITING, group=main]
: at java.base/java.lang.Object.waitImpl(Native Method)
: at java.base/java.lang.Object.wait(Object.java:251)
: at java.base/java.lang.Object.wait(Object.java:219)
: at java.base/java.util.TimerThread.mainLoop(Timer.java:599)
: at java.base/java.util.TimerThread.run(Timer.java:542)
: at __randomizedtesting.SeedInfo.seed([340F9724D936425B]:0)
:
:
: FAILED: org.apache.solr.client.ref_guide_examples.IndexingNestedDocuments.classMethod
:
: Error Message:
: com.carrotsearch.randomizedtesting.ThreadLeakError: 1 thread leaked from SUITE scope at org.apache.solr.client.ref_guide_examples.IndexingNestedDocuments:
: 1) Thread[id=108, name=file lock watchdog, state=TIMED_WAITING, group=main]
: at java.base/java.lang.Object.waitImpl(Native Method)
: at java.base/java.lang.Object.wait(Object.java:251)
: at java.base/java.lang.Object.wait(Object.java:219)
: at java.base/java.util.TimerThread.mainLoop(Timer.java:599)
: at java.base/java.util.TimerThread.run(Timer.java:542)
:
: Stack Trace:
: com.carrotsearch.randomizedtesting.ThreadLeakError: 1 thread leaked from SUITE scope at org.apache.solr.client.ref_guide_examples.IndexingNestedDocuments:
: 1) Thread[id=108, name=file lock watchdog, state=TIMED_WAITING, group=main]
: at java.base/java.lang.Object.waitImpl(Native Method)
: at java.base/java.lang.Object.wait(Object.java:251)
: at java.base/java.lang.Object.wait(Object.java:219)
: at java.base/java.util.TimerThread.mainLoop(Timer.java:599)
: at java.base/java.util.TimerThread.run(Timer.java:542)
: at __randomizedtesting.SeedInfo.seed([340F9724D936425B]:0)
:
:
: FAILED: org.apache.solr.client.ref_guide_examples.IndexingNestedDocuments.classMethod
:
: Error Message:
: com.carrotsearch.randomizedtesting.ThreadLeakError: There are still zombie threads that couldn't be terminated:
: 1) Thread[id=90, name=file lock watchdog, state=WAITING, group=main]
: at java.base/java.lang.Object.waitImpl(Native Method)
: at java.base/java.lang.Object.wait(Object.java:251)
: at java.base/java.lang.Object.wait(Object.java:190)
: at java.base/java.util.TimerThread.mainLoop(Timer.java:563)
: at java.base/java.util.TimerThread.run(Timer.java:542)
:
: Stack Trace:
: com.carrotsearch.randomizedtesting.ThreadLeakError: There are still zombie threads that couldn't be terminated:
: 1) Thread[id=90, name=file lock watchdog, state=WAITING, group=main]
: at java.base/java.lang.Object.waitImpl(Native Method)
: at java.base/java.lang.Object.wait(Object.java:251)
: at java.base/java.lang.Object.wait(Object.java:190)
: at java.base/java.util.TimerThread.mainLoop(Timer.java:563)
: at java.base/java.util.TimerThread.run(Timer.java:542)
: at __randomizedtesting.SeedInfo.seed([340F9724D936425B]:0)
:
:
: FAILED: org.apache.solr.client.ref_guide_examples.IndexingNestedDocuments.classMethod
:
: Error Message:
: com.carrotsearch.randomizedtesting.ThreadLeakError: There are still zombie threads that couldn't be terminated:
: 1) Thread[id=108, name=file lock watchdog, state=WAITING, group=main]
: at java.base/java.lang.Object.waitImpl(Native Method)
: at java.base/java.lang.Object.wait(Object.java:251)
: at java.base/java.lang.Object.wait(Object.java:190)
: at java.base/java.util.TimerThread.mainLoop(Timer.java:563)
: at java.base/java.util.TimerThread.run(Timer.java:542)
:
: Stack Trace:
: com.carrotsearch.randomizedtesting.ThreadLeakError: There are still zombie threads that couldn't be terminated:
: 1) Thread[id=108, name=file lock watchdog, state=WAITING, group=main]
: at java.base/java.lang.Object.waitImpl(Native Method)
: at java.base/java.lang.Object.wait(Object.java:251)
: at java.base/java.lang.Object.wait(Object.java:190)
: at java.base/java.util.TimerThread.mainLoop(Timer.java:563)
: at java.base/java.util.TimerThread.run(Timer.java:542)
: at __randomizedtesting.SeedInfo.seed([340F9724D936425B]:0)
:
:
: FAILED: org.apache.solr.client.ref_guide_examples.IndexingNestedDocuments.classMethod
:
: Error Message:
: com.carrotsearch.randomizedtesting.ThreadLeakError: 1 thread leaked from SUITE scope at org.apache.solr.client.ref_guide_examples.IndexingNestedDocuments:
: 1) Thread[id=112, name=file lock watchdog, state=TIMED_WAITING, group=main]
: at java.base/java.lang.Object.waitImpl(Native Method)
: at java.base/java.lang.Object.wait(Object.java:251)
: at java.base/java.lang.Object.wait(Object.java:219)
: at java.base/java.util.TimerThread.mainLoop(Timer.java:599)
: at java.base/java.util.TimerThread.run(Timer.java:542)
:
: Stack Trace:
: com.carrotsearch.randomizedtesting.ThreadLeakError: 1 thread leaked from SUITE scope at org.apache.solr.client.ref_guide_examples.IndexingNestedDocuments:
: 1) Thread[id=112, name=file lock watchdog, state=TIMED_WAITING, group=main]
: at java.base/java.lang.Object.waitImpl(Native Method)
: at java.base/java.lang.Object.wait(Object.java:251)
: at java.base/java.lang.Object.wait(Object.java:219)
: at java.base/java.util.TimerThread.mainLoop(Timer.java:599)
: at java.base/java.util.TimerThread.run(Timer.java:542)
: at __randomizedtesting.SeedInfo.seed([340F9724D936425B]:0)
:
:
: FAILED: org.apache.solr.client.ref_guide_examples.IndexingNestedDocuments.classMethod
:
: Error Message:
: com.carrotsearch.randomizedtesting.ThreadLeakError: There are still zombie threads that couldn't be terminated:
: 1) Thread[id=112, name=file lock watchdog, state=WAITING, group=main]
: at java.base/java.lang.Object.waitImpl(Native Method)
: at java.base/java.lang.Object.wait(Object.java:251)
: at java.base/java.lang.Object.wait(Object.java:190)
: at java.base/java.util.TimerThread.mainLoop(Timer.java:563)
: at java.base/java.util.TimerThread.run(Timer.java:542)
:
: Stack Trace:
: com.carrotsearch.randomizedtesting.ThreadLeakError: There are still zombie threads that couldn't be terminated:
: 1) Thread[id=112, name=file lock watchdog, state=WAITING, group=main]
: at java.base/java.lang.Object.waitImpl(Native Method)
: at java.base/java.lang.Object.wait(Object.java:251)
: at java.base/java.lang.Object.wait(Object.java:190)
: at java.base/java.util.TimerThread.mainLoop(Timer.java:563)
: at java.base/java.util.TimerThread.run(Timer.java:542)
: at __randomizedtesting.SeedInfo.seed([340F9724D936425B]:0)
:
:
: FAILED: org.apache.solr.client.ref_guide_examples.IndexingNestedDocuments.classMethod
:
: Error Message:
: com.carrotsearch.randomizedtesting.ThreadLeakError: 1 thread leaked from SUITE scope at org.apache.solr.client.ref_guide_examples.IndexingNestedDocuments:
: 1) Thread[id=90, name=file lock watchdog, state=TIMED_WAITING, group=main]
: at java.base/java.lang.Object.waitImpl(Native Method)
: at java.base/java.lang.Object.wait(Object.java:251)
: at java.base/java.lang.Object.wait(Object.java:219)
: at java.base/java.util.TimerThread.mainLoop(Timer.java:599)
: at java.base/java.util.TimerThread.run(Timer.java:542)
:
: Stack Trace:
: com.carrotsearch.randomizedtesting.ThreadLeakError: 1 thread leaked from SUITE scope at org.apache.solr.client.ref_guide_examples.IndexingNestedDocuments:
: 1) Thread[id=90, name=file lock watchdog, state=TIMED_WAITING, group=main]
: at java.base/java.lang.Object.waitImpl(Native Method)
: at java.base/java.lang.Object.wait(Object.java:251)
: at java.base/java.lang.Object.wait(Object.java:219)
: at java.base/java.util.TimerThread.mainLoop(Timer.java:599)
: at java.base/java.util.TimerThread.run(Timer.java:542)
: at __randomizedtesting.SeedInfo.seed([340F9724D936425B]:0)
:
:
: FAILED: org.apache.solr.client.ref_guide_examples.JsonRequestApiHeatmapFacetingTest.classMethod
:
: Error Message:
: com.carrotsearch.randomizedtesting.ThreadLeakError: 1 thread leaked from SUITE scope at org.apache.solr.client.ref_guide_examples.JsonRequestApiHeatmapFacetingTest:
: 1) Thread[id=117, name=file lock watchdog, state=TIMED_WAITING, group=main]
: at java.base/java.lang.Object.waitImpl(Native Method)
: at java.base/java.lang.Object.wait(Object.java:251)
: at java.base/java.lang.Object.wait(Object.java:219)
: at java.base/java.util.TimerThread.mainLoop(Timer.java:599)
: at java.base/java.util.TimerThread.run(Timer.java:542)
:
: Stack Trace:
: com.carrotsearch.randomizedtesting.ThreadLeakError: 1 thread leaked from SUITE scope at org.apache.solr.client.ref_guide_examples.JsonRequestApiHeatmapFacetingTest:
: 1) Thread[id=117, name=file lock watchdog, state=TIMED_WAITING, group=main]
: at java.base/java.lang.Object.waitImpl(Native Method)
: at java.base/java.lang.Object.wait(Object.java:251)
: at java.base/java.lang.Object.wait(Object.java:219)
: at java.base/java.util.TimerThread.mainLoop(Timer.java:599)
: at java.base/java.util.TimerThread.run(Timer.java:542)
: at __randomizedtesting.SeedInfo.seed([340F9724D936425B]:0)
:
:
: FAILED: org.apache.solr.client.ref_guide_examples.JsonRequestApiHeatmapFacetingTest.classMethod
:
: Error Message:
: com.carrotsearch.randomizedtesting.ThreadLeakError: There are still zombie threads that couldn't be terminated:
: 1) Thread[id=117, name=file lock watchdog, state=WAITING, group=main]
: at java.base/java.lang.Object.waitImpl(Native Method)
: at java.base/java.lang.Object.wait(Object.java:251)
: at java.base/java.lang.Object.wait(Object.java:190)
: at java.base/java.util.TimerThread.mainLoop(Timer.java:563)
: at java.base/java.util.TimerThread.run(Timer.java:542)
:
: Stack Trace:
: com.carrotsearch.randomizedtesting.ThreadLeakError: There are still zombie threads that couldn't be terminated:
: 1) Thread[id=117, name=file lock watchdog, state=WAITING, group=main]
: at java.base/java.lang.Object.waitImpl(Native Method)
: at java.base/java.lang.Object.wait(Object.java:251)
: at java.base/java.lang.Object.wait(Object.java:190)
: at java.base/java.util.TimerThread.mainLoop(Timer.java:563)
: at java.base/java.util.TimerThread.run(Timer.java:542)
: at __randomizedtesting.SeedInfo.seed([340F9724D936425B]:0)
:
:
: FAILED: org.apache.solr.client.ref_guide_examples.JsonRequestApiTest.classMethod
:
: Error Message:
: com.carrotsearch.randomizedtesting.ThreadLeakError: There are still zombie threads that couldn't be terminated:
: 1) Thread[id=114, name=file lock watchdog, state=WAITING, group=main]
: at java.base/java.lang.Object.waitImpl(Native Method)
: at java.base/java.lang.Object.wait(Object.java:251)
: at java.base/java.lang.Object.wait(Object.java:190)
: at java.base/java.util.TimerThread.mainLoop(Timer.java:563)
: at java.base/java.util.TimerThread.run(Timer.java:542)
:
: Stack Trace:
: com.carrotsearch.randomizedtesting.ThreadLeakError: There are still zombie threads that couldn't be terminated:
: 1) Thread[id=114, name=file lock watchdog, state=WAITING, group=main]
: at java.base/java.lang.Object.waitImpl(Native Method)
: at java.base/java.lang.Object.wait(Object.java:251)
: at java.base/java.lang.Object.wait(Object.java:190)
: at java.base/java.util.TimerThread.mainLoop(Timer.java:563)
: at java.base/java.util.TimerThread.run(Timer.java:542)
: at __randomizedtesting.SeedInfo.seed([340F9724D936425B]:0)
:
:
: FAILED: org.apache.solr.client.ref_guide_examples.JsonRequestApiTest.classMethod
:
: Error Message:
: com.carrotsearch.randomizedtesting.ThreadLeakError: 1 thread leaked from SUITE scope at org.apache.solr.client.ref_guide_examples.JsonRequestApiTest:
: 1) Thread[id=114, name=file lock watchdog, state=TIMED_WAITING, group=main]
: at java.base/java.lang.Object.waitImpl(Native Method)
: at java.base/java.lang.Object.wait(Object.java:251)
: at java.base/java.lang.Object.wait(Object.java:219)
: at java.base/java.util.TimerThread.mainLoop(Timer.java:599)
: at java.base/java.util.TimerThread.run(Timer.java:542)
:
: Stack Trace:
: com.carrotsearch.randomizedtesting.ThreadLeakError: 1 thread leaked from SUITE scope at org.apache.solr.client.ref_guide_examples.JsonRequestApiTest:
: 1) Thread[id=114, name=file lock watchdog, state=TIMED_WAITING, group=main]
: at java.base/java.lang.Object.waitImpl(Native Method)
: at java.base/java.lang.Object.wait(Object.java:251)
: at java.base/java.lang.Object.wait(Object.java:219)
: at java.base/java.util.TimerThread.mainLoop(Timer.java:599)
: at java.base/java.util.TimerThread.run(Timer.java:542)
: at __randomizedtesting.SeedInfo.seed([340F9724D936425B]:0)
:
:
: FAILED: org.apache.solr.client.solrj.embedded.SolrExampleStreamingBinaryHttp2Test.classMethod
:
: Error Message:
: com.carrotsearch.randomizedtesting.ThreadLeakError: There are still zombie threads that couldn't be terminated:
: 1) Thread[id=315, name=file lock watchdog, state=WAITING, group=main]
: at java.base/java.lang.Object.waitImpl(Native Method)
: at java.base/java.lang.Object.wait(Object.java:251)
: at java.base/java.lang.Object.wait(Object.java:190)
: at java.base/java.util.TimerThread.mainLoop(Timer.java:563)
: at java.base/java.util.TimerThread.run(Timer.java:542)
:
: Stack Trace:
: com.carrotsearch.randomizedtesting.ThreadLeakError: There are still zombie threads that couldn't be terminated:
: 1) Thread[id=315, name=file lock watchdog, state=WAITING, group=main]
: at java.base/java.lang.Object.waitImpl(Native Method)
: at java.base/java.lang.Object.wait(Object.java:251)
: at java.base/java.lang.Object.wait(Object.java:190)
: at java.base/java.util.TimerThread.mainLoop(Timer.java:563)
: at java.base/java.util.TimerThread.run(Timer.java:542)
: at __randomizedtesting.SeedInfo.seed([340F9724D936425B]:0)
:
:
: FAILED: org.apache.solr.client.solrj.embedded.SolrExampleStreamingBinaryHttp2Test.classMethod
:
: Error Message:
: com.carrotsearch.randomizedtesting.ThreadLeakError: 1 thread leaked from SUITE scope at org.apache.solr.client.solrj.embedded.SolrExampleStreamingBinaryHttp2Test:
: 1) Thread[id=315, name=file lock watchdog, state=TIMED_WAITING, group=main]
: at java.base/java.lang.Object.waitImpl(Native Method)
: at java.base/java.lang.Object.wait(Object.java:251)
: at java.base/java.lang.Object.wait(Object.java:219)
: at java.base/java.util.TimerThread.mainLoop(Timer.java:599)
: at java.base/java.util.TimerThread.run(Timer.java:542)
:
: Stack Trace:
: com.carrotsearch.randomizedtesting.ThreadLeakError: 1 thread leaked from SUITE scope at org.apache.solr.client.solrj.embedded.SolrExampleStreamingBinaryHttp2Test:
: 1) Thread[id=315, name=file lock watchdog, state=TIMED_WAITING, group=main]
: at java.base/java.lang.Object.waitImpl(Native Method)
: at java.base/java.lang.Object.wait(Object.java:251)
: at java.base/java.lang.Object.wait(Object.java:219)
: at java.base/java.util.TimerThread.mainLoop(Timer.java:599)
: at java.base/java.util.TimerThread.run(Timer.java:542)
: at __randomizedtesting.SeedInfo.seed([340F9724D936425B]:0)
:
:
: FAILED: org.apache.solr.client.solrj.impl.CloudSolrClientTest.classMethod
:
: Error Message:
: com.carrotsearch.randomizedtesting.ThreadLeakError: There are still zombie threads that couldn't be terminated:
: 1) Thread[id=1368, name=file lock watchdog, state=WAITING, group=main]
: at java.base/java.lang.Object.waitImpl(Native Method)
: at java.base/java.lang.Object.wait(Object.java:251)
: at java.base/java.lang.Object.wait(Object.java:190)
: at java.base/java.util.TimerThread.mainLoop(Timer.java:563)
: at java.base/java.util.TimerThread.run(Timer.java:542)
:
: Stack Trace:
: com.carrotsearch.randomizedtesting.ThreadLeakError: There are still zombie threads that couldn't be terminated:
: 1) Thread[id=1368, name=file lock watchdog, state=WAITING, group=main]
: at java.base/java.lang.Object.waitImpl(Native Method)
: at java.base/java.lang.Object.wait(Object.java:251)
: at java.base/java.lang.Object.wait(Object.java:190)
: at java.base/java.util.TimerThread.mainLoop(Timer.java:563)
: at java.base/java.util.TimerThread.run(Timer.java:542)
: at __randomizedtesting.SeedInfo.seed([340F9724D936425B]:0)
:
:
: FAILED: org.apache.solr.client.solrj.impl.CloudSolrClientTest.classMethod
:
: Error Message:
: com.carrotsearch.randomizedtesting.ThreadLeakError: 1 thread leaked from SUITE scope at org.apache.solr.client.solrj.impl.CloudSolrClientTest:
: 1) Thread[id=1368, name=file lock watchdog, state=TIMED_WAITING, group=main]
: at java.base/java.lang.Object.waitImpl(Native Method)
: at java.base/java.lang.Object.wait(Object.java:251)
: at java.base/java.lang.Object.wait(Object.java:219)
: at java.base/java.util.TimerThread.mainLoop(Timer.java:599)
: at java.base/java.util.TimerThread.run(Timer.java:542)
:
: Stack Trace:
: com.carrotsearch.randomizedtesting.ThreadLeakError: 1 thread leaked from SUITE scope at org.apache.solr.client.solrj.impl.CloudSolrClientTest:
: 1) Thread[id=1368, name=file lock watchdog, state=TIMED_WAITING, group=main]
: at java.base/java.lang.Object.waitImpl(Native Method)
: at java.base/java.lang.Object.wait(Object.java:251)
: at java.base/java.lang.Object.wait(Object.java:219)
: at java.base/java.util.TimerThread.mainLoop(Timer.java:599)
: at java.base/java.util.TimerThread.run(Timer.java:542)
: at __randomizedtesting.SeedInfo.seed([340F9724D936425B]:0)
:
:
: FAILED: org.apache.solr.client.solrj.request.SchemaTest.classMethod
:
: Error Message:
: com.carrotsearch.randomizedtesting.ThreadLeakError: There are still zombie threads that couldn't be terminated:
: 1) Thread[id=1870, name=file lock watchdog, state=WAITING, group=main]
: at java.base/java.lang.Object.waitImpl(Native Method)
: at java.base/java.lang.Object.wait(Object.java:251)
: at java.base/java.lang.Object.wait(Object.java:190)
: at java.base/java.util.TimerThread.mainLoop(Timer.java:563)
: at java.base/java.util.TimerThread.run(Timer.java:542)
:
: Stack Trace:
: com.carrotsearch.randomizedtesting.ThreadLeakError: There are still zombie threads that couldn't be terminated:
: 1) Thread[id=1870, name=file lock watchdog, state=WAITING, group=main]
: at java.base/java.lang.Object.waitImpl(Native Method)
: at java.base/java.lang.Object.wait(Object.java:251)
: at java.base/java.lang.Object.wait(Object.java:190)
: at java.base/java.util.TimerThread.mainLoop(Timer.java:563)
: at java.base/java.util.TimerThread.run(Timer.java:542)
: at __randomizedtesting.SeedInfo.seed([340F9724D936425B]:0)
:
:
: FAILED: org.apache.solr.client.solrj.request.SchemaTest.classMethod
:
: Error Message:
: com.carrotsearch.randomizedtesting.ThreadLeakError: 1 thread leaked from SUITE scope at org.apache.solr.client.solrj.request.SchemaTest:
: 1) Thread[id=1870, name=file lock watchdog, state=TIMED_WAITING, group=main]
: at java.base/java.lang.Object.waitImpl(Native Method)
: at java.base/java.lang.Object.wait(Object.java:251)
: at java.base/java.lang.Object.wait(Object.java:219)
: at java.base/java.util.TimerThread.mainLoop(Timer.java:599)
: at java.base/java.util.TimerThread.run(Timer.java:542)
:
: Stack Trace:
: com.carrotsearch.randomizedtesting.ThreadLeakError: 1 thread leaked from SUITE scope at org.apache.solr.client.solrj.request.SchemaTest:
: 1) Thread[id=1870, name=file lock watchdog, state=TIMED_WAITING, group=main]
: at java.base/java.lang.Object.waitImpl(Native Method)
: at java.base/java.lang.Object.wait(Object.java:251)
: at java.base/java.lang.Object.wait(Object.java:219)
: at java.base/java.util.TimerThread.mainLoop(Timer.java:599)
: at java.base/java.util.TimerThread.run(Timer.java:542)
: at __randomizedtesting.SeedInfo.seed([340F9724D936425B]:0)
:
:
: FAILED: org.apache.solr.common.cloud.PerReplicaStatesIntegrationTest.classMethod
:
: Error Message:
: com.carrotsearch.randomizedtesting.ThreadLeakError: There are still zombie threads that couldn't be terminated:
: 1) Thread[id=2246, name=file lock watchdog, state=WAITING, group=main]
: at java.base/java.lang.Object.waitImpl(Native Method)
: at java.base/java.lang.Object.wait(Object.java:251)
: at java.base/java.lang.Object.wait(Object.java:190)
: at java.base/java.util.TimerThread.mainLoop(Timer.java:563)
: at java.base/java.util.TimerThread.run(Timer.java:542)
:
: Stack Trace:
: com.carrotsearch.randomizedtesting.ThreadLeakError: There are still zombie threads that couldn't be terminated:
: 1) Thread[id=2246, name=file lock watchdog, state=WAITING, group=main]
: at java.base/java.lang.Object.waitImpl(Native Method)
: at java.base/java.lang.Object.wait(Object.java:251)
: at java.base/java.lang.Object.wait(Object.java:190)
: at java.base/java.util.TimerThread.mainLoop(Timer.java:563)
: at java.base/java.util.TimerThread.run(Timer.java:542)
: at __randomizedtesting.SeedInfo.seed([340F9724D936425B]:0)
:
:
: FAILED: org.apache.solr.common.cloud.PerReplicaStatesIntegrationTest.classMethod
:
: Error Message:
: com.carrotsearch.randomizedtesting.ThreadLeakError: 1 thread leaked from SUITE scope at org.apache.solr.common.cloud.PerReplicaStatesIntegrationTest:
: 1) Thread[id=2246, name=file lock watchdog, state=TIMED_WAITING, group=main]
: at java.base/java.lang.Object.waitImpl(Native Method)
: at java.base/java.lang.Object.wait(Object.java:251)
: at java.base/java.lang.Object.wait(Object.java:219)
: at java.base/java.util.TimerThread.mainLoop(Timer.java:599)
: at java.base/java.util.TimerThread.run(Timer.java:542)
:
: Stack Trace:
: com.carrotsearch.randomizedtesting.ThreadLeakError: 1 thread leaked from SUITE scope at org.apache.solr.common.cloud.PerReplicaStatesIntegrationTest:
: 1) Thread[id=2246, name=file lock watchdog, state=TIMED_WAITING, group=main]
: at java.base/java.lang.Object.waitImpl(Native Method)
: at java.base/java.lang.Object.wait(Object.java:251)
: at java.base/java.lang.Object.wait(Object.java:219)
: at java.base/java.util.TimerThread.mainLoop(Timer.java:599)
: at java.base/java.util.TimerThread.run(Timer.java:542)
: at __randomizedtesting.SeedInfo.seed([340F9724D936425B]:0)
:
:
: FAILED: org.apache.solr.common.cloud.TestPerReplicaStates.classMethod
:
: Error Message:
: com.carrotsearch.randomizedtesting.ThreadLeakError: 1 thread leaked from SUITE scope at org.apache.solr.common.cloud.TestPerReplicaStates:
: 1) Thread[id=502, name=file lock watchdog, state=TIMED_WAITING, group=main]
: at java.base/java.lang.Object.waitImpl(Native Method)
: at java.base/java.lang.Object.wait(Object.java:251)
: at java.base/java.lang.Object.wait(Object.java:219)
: at java.base/java.util.TimerThread.mainLoop(Timer.java:599)
: at java.base/java.util.TimerThread.run(Timer.java:542)
:
: Stack Trace:
: com.carrotsearch.randomizedtesting.ThreadLeakError: 1 thread leaked from SUITE scope at org.apache.solr.common.cloud.TestPerReplicaStates:
: 1) Thread[id=502, name=file lock watchdog, state=TIMED_WAITING, group=main]
: at java.base/java.lang.Object.waitImpl(Native Method)
: at java.base/java.lang.Object.wait(Object.java:251)
: at java.base/java.lang.Object.wait(Object.java:219)
: at java.base/java.util.TimerThread.mainLoop(Timer.java:599)
: at java.base/java.util.TimerThread.run(Timer.java:542)
: at __randomizedtesting.SeedInfo.seed([340F9724D936425B]:0)
:
:
: FAILED: org.apache.solr.common.cloud.TestPerReplicaStates.classMethod
:
: Error Message:
: com.carrotsearch.randomizedtesting.ThreadLeakError: There are still zombie threads that couldn't be terminated:
: 1) Thread[id=502, name=file lock watchdog, state=WAITING, group=main]
: at java.base/java.lang.Object.waitImpl(Native Method)
: at java.base/java.lang.Object.wait(Object.java:251)
: at java.base/java.lang.Object.wait(Object.java:190)
: at java.base/java.util.TimerThread.mainLoop(Timer.java:563)
: at java.base/java.util.TimerThread.run(Timer.java:542)
:
: Stack Trace:
: com.carrotsearch.randomizedtesting.ThreadLeakError: There are still zombie threads that couldn't be terminated:
: 1) Thread[id=502, name=file lock watchdog, state=WAITING, group=main]
: at java.base/java.lang.Object.waitImpl(Native Method)
: at java.base/java.lang.Object.wait(Object.java:251)
: at java.base/java.lang.Object.wait(Object.java:190)
: at java.base/java.util.TimerThread.mainLoop(Timer.java:563)
: at java.base/java.util.TimerThread.run(Timer.java:542)
: at __randomizedtesting.SeedInfo.seed([340F9724D936425B]:0)
:
:
: FAILED: org.apache.solr.crossdc.CrossDCProducerSolrStandaloneTest.classMethod
:
: Error Message:
: com.carrotsearch.randomizedtesting.ThreadLeakError: 1 thread leaked from SUITE scope at org.apache.solr.crossdc.CrossDCProducerSolrStandaloneTest:
: 1) Thread[id=49, name=file lock watchdog, state=TIMED_WAITING, group=main]
: at java.base/java.lang.Object.waitImpl(Native Method)
: at java.base/java.lang.Object.wait(Object.java:251)
: at java.base/java.lang.Object.wait(Object.java:219)
: at java.base/java.util.TimerThread.mainLoop(Timer.java:599)
: at java.base/java.util.TimerThread.run(Timer.java:542)
:
: Stack Trace:
: com.carrotsearch.randomizedtesting.ThreadLeakError: 1 thread leaked from SUITE scope at org.apache.solr.crossdc.CrossDCProducerSolrStandaloneTest:
: 1) Thread[id=49, name=file lock watchdog, state=TIMED_WAITING, group=main]
: at java.base/java.lang.Object.waitImpl(Native Method)
: at java.base/java.lang.Object.wait(Object.java:251)
: at java.base/java.lang.Object.wait(Object.java:219)
: at java.base/java.util.TimerThread.mainLoop(Timer.java:599)
: at java.base/java.util.TimerThread.run(Timer.java:542)
: at __randomizedtesting.SeedInfo.seed([340F9724D936425B]:0)
:
:
: FAILED: org.apache.solr.crossdc.CrossDCProducerSolrStandaloneTest.classMethod
:
: Error Message:
: com.carrotsearch.randomizedtesting.ThreadLeakError: There are still zombie threads that couldn't be terminated:
: 1) Thread[id=49, name=file lock watchdog, state=WAITING, group=main]
: at java.base/java.lang.Object.waitImpl(Native Method)
: at java.base/java.lang.Object.wait(Object.java:251)
: at java.base/java.lang.Object.wait(Object.java:190)
: at java.base/java.util.TimerThread.mainLoop(Timer.java:563)
: at java.base/java.util.TimerThread.run(Timer.java:542)
:
: Stack Trace:
: com.carrotsearch.randomizedtesting.ThreadLeakError: There are still zombie threads that couldn't be terminated:
: 1) Thread[id=49, name=file lock watchdog, state=WAITING, group=main]
: at java.base/java.lang.Object.waitImpl(Native Method)
: at java.base/java.lang.Object.wait(Object.java:251)
: at java.base/java.lang.Object.wait(Object.java:190)
: at java.base/java.util.TimerThread.mainLoop(Timer.java:563)
: at java.base/java.util.TimerThread.run(Timer.java:542)
: at __randomizedtesting.SeedInfo.seed([340F9724D936425B]:0)
:
:
: FAILED: org.apache.solr.crossdc.handler.MirroringCollectionsHandlerTest.classMethod
:
: Error Message:
: com.carrotsearch.randomizedtesting.ThreadLeakError: 1 thread leaked from SUITE scope at org.apache.solr.crossdc.handler.MirroringCollectionsHandlerTest:
: 1) Thread[id=42, name=file lock watchdog, state=TIMED_WAITING, group=main]
: at java.base/java.lang.Object.waitImpl(Native Method)
: at java.base/java.lang.Object.wait(Object.java:251)
: at java.base/java.lang.Object.wait(Object.java:219)
: at java.base/java.util.TimerThread.mainLoop(Timer.java:599)
: at java.base/java.util.TimerThread.run(Timer.java:542)
:
: Stack Trace:
: com.carrotsearch.randomizedtesting.ThreadLeakError: 1 thread leaked from SUITE scope at org.apache.solr.crossdc.handler.MirroringCollectionsHandlerTest:
: 1) Thread[id=42, name=file lock watchdog, state=TIMED_WAITING, group=main]
: at java.base/java.lang.Object.waitImpl(Native Method)
: at java.base/java.lang.Object.wait(Object.java:251)
: at java.base/java.lang.Object.wait(Object.java:219)
: at java.base/java.util.TimerThread.mainLoop(Timer.java:599)
: at java.base/java.util.TimerThread.run(Timer.java:542)
: at __randomizedtesting.SeedInfo.seed([340F9724D936425B]:0)
:
:
: FAILED: org.apache.solr.crossdc.handler.MirroringCollectionsHandlerTest.classMethod
:
: Error Message:
: com.carrotsearch.randomizedtesting.ThreadLeakError: There are still zombie threads that couldn't be terminated:
: 1) Thread[id=42, name=file lock watchdog, state=WAITING, group=main]
: at java.base/java.lang.Object.waitImpl(Native Method)
: at java.base/java.lang.Object.wait(Object.java:251)
: at java.base/java.lang.Object.wait(Object.java:190)
: at java.base/java.util.TimerThread.mainLoop(Timer.java:563)
: at java.base/java.util.TimerThread.run(Timer.java:542)
:
: Stack Trace:
: com.carrotsearch.randomizedtesting.ThreadLeakError: There are still zombie threads that couldn't be terminated:
: 1) Thread[id=42, name=file lock watchdog, state=WAITING, group=main]
: at java.base/java.lang.Object.waitImpl(Native Method)
: at java.base/java.lang.Object.wait(Object.java:251)
: at java.base/java.lang.Object.wait(Object.java:190)
: at java.base/java.util.TimerThread.mainLoop(Timer.java:563)
: at java.base/java.util.TimerThread.run(Timer.java:542)
: at __randomizedtesting.SeedInfo.seed([340F9724D936425B]:0)
:
:
: FAILED: org.apache.solr.crossdc.handler.MirroringConfigSetsHandlerTest.classMethod
:
: Error Message:
: com.carrotsearch.randomizedtesting.ThreadLeakError: There are still zombie threads that couldn't be terminated:
: 1) Thread[id=42, name=file lock watchdog, state=WAITING, group=main]
: at java.base/java.lang.Object.waitImpl(Native Method)
: at java.base/java.lang.Object.wait(Object.java:251)
: at java.base/java.lang.Object.wait(Object.java:190)
: at java.base/java.util.TimerThread.mainLoop(Timer.java:563)
: at java.base/java.util.TimerThread.run(Timer.java:542)
:
: Stack Trace:
: com.carrotsearch.randomizedtesting.ThreadLeakError: There are still zombie threads that couldn't be terminated:
: 1) Thread[id=42, name=file lock watchdog, state=WAITING, group=main]
: at java.base/java.lang.Object.waitImpl(Native Method)
: at java.base/java.lang.Object.wait(Object.java:251)
: at java.base/java.lang.Object.wait(Object.java:190)
: at java.base/java.util.TimerThread.mainLoop(Timer.java:563)
: at java.base/java.util.TimerThread.run(Timer.java:542)
: at __randomizedtesting.SeedInfo.seed([340F9724D936425B]:0)
:
:
: FAILED: org.apache.solr.crossdc.handler.MirroringConfigSetsHandlerTest.classMethod
:
: Error Message:
: com.carrotsearch.randomizedtesting.ThreadLeakError: 1 thread leaked from SUITE scope at org.apache.solr.crossdc.handler.MirroringConfigSetsHandlerTest:
: 1) Thread[id=42, name=file lock watchdog, state=TIMED_WAITING, group=main]
: at java.base/java.lang.Object.waitImpl(Native Method)
: at java.base/java.lang.Object.wait(Object.java:251)
: at java.base/java.lang.Object.wait(Object.java:219)
: at java.base/java.util.TimerThread.mainLoop(Timer.java:599)
: at java.base/java.util.TimerThread.run(Timer.java:542)
:
: Stack Trace:
: com.carrotsearch.randomizedtesting.ThreadLeakError: 1 thread leaked from SUITE scope at org.apache.solr.crossdc.handler.MirroringConfigSetsHandlerTest:
: 1) Thread[id=42, name=file lock watchdog, state=TIMED_WAITING, group=main]
: at java.base/java.lang.Object.waitImpl(Native Method)
: at java.base/java.lang.Object.wait(Object.java:251)
: at java.base/java.lang.Object.wait(Object.java:219)
: at java.base/java.util.TimerThread.mainLoop(Timer.java:599)
: at java.base/java.util.TimerThread.run(Timer.java:542)
: at __randomizedtesting.SeedInfo.seed([340F9724D936425B]:0)
:
:
: FAILED: org.apache.solr.crossdc.handler.MirroringConfigSetsHandlerTest.classMethod
:
: Error Message:
: com.carrotsearch.randomizedtesting.ThreadLeakError: There are still zombie threads that couldn't be terminated:
: 1) Thread[id=42, name=file lock watchdog, state=WAITING, group=main]
: at java.base/java.lang.Object.waitImpl(Native Method)
: at java.base/java.lang.Object.wait(Object.java:251)
: at java.base/java.lang.Object.wait(Object.java:190)
: at java.base/java.util.TimerThread.mainLoop(Timer.java:563)
: at java.base/java.util.TimerThread.run(Timer.java:542)
:
: Stack Trace:
: com.carrotsearch.randomizedtesting.ThreadLeakError: There are still zombie threads that couldn't be terminated:
: 1) Thread[id=42, name=file lock watchdog, state=WAITING, group=main]
: at java.base/java.lang.Object.waitImpl(Native Method)
: at java.base/java.lang.Object.wait(Object.java:251)
: at java.base/java.lang.Object.wait(Object.java:190)
: at java.base/java.util.TimerThread.mainLoop(Timer.java:563)
: at java.base/java.util.TimerThread.run(Timer.java:542)
: at __randomizedtesting.SeedInfo.seed([340F9724D936425B]:0)
:
:
: FAILED: org.apache.solr.crossdc.handler.MirroringConfigSetsHandlerTest.classMethod
:
: Error Message:
: com.carrotsearch.randomizedtesting.ThreadLeakError: There are still zombie threads that couldn't be terminated:
: 1) Thread[id=42, name=file lock watchdog, state=WAITING, group=main]
: at java.base/java.lang.Object.waitImpl(Native Method)
: at java.base/java.lang.Object.wait(Object.java:251)
: at java.base/java.lang.Object.wait(Object.java:190)
: at java.base/java.util.TimerThread.mainLoop(Timer.java:563)
: at java.base/java.util.TimerThread.run(Timer.java:542)
:
: Stack Trace:
: com.carrotsearch.randomizedtesting.ThreadLeakError: There are still zombie threads that couldn't be terminated:
: 1) Thread[id=42, name=file lock watchdog, state=WAITING, group=main]
: at java.base/java.lang.Object.waitImpl(Native Method)
: at java.base/java.lang.Object.wait(Object.java:251)
: at java.base/java.lang.Object.wait(Object.java:190)
: at java.base/java.util.TimerThread.mainLoop(Timer.java:563)
: at java.base/java.util.TimerThread.run(Timer.java:542)
: at __randomizedtesting.SeedInfo.seed([340F9724D936425B]:0)
:
:
: FAILED: org.apache.solr.crossdc.handler.MirroringConfigSetsHandlerTest.classMethod
:
: Error Message:
: com.carrotsearch.randomizedtesting.ThreadLeakError: 1 thread leaked from SUITE scope at org.apache.solr.crossdc.handler.MirroringConfigSetsHandlerTest:
: 1) Thread[id=42, name=file lock watchdog, state=TIMED_WAITING, group=main]
: at java.base/java.lang.Object.waitImpl(Native Method)
: at java.base/java.lang.Object.wait(Object.java:251)
: at java.base/java.lang.Object.wait(Object.java:219)
: at java.base/java.util.TimerThread.mainLoop(Timer.java:599)
: at java.base/java.util.TimerThread.run(Timer.java:542)
:
: Stack Trace:
: com.carrotsearch.randomizedtesting.ThreadLeakError: 1 thread leaked from SUITE scope at org.apache.solr.crossdc.handler.MirroringConfigSetsHandlerTest:
: 1) Thread[id=42, name=file lock watchdog, state=TIMED_WAITING, group=main]
: at java.base/java.lang.Object.waitImpl(Native Method)
: at java.base/java.lang.Object.wait(Object.java:251)
: at java.base/java.lang.Object.wait(Object.java:219)
: at java.base/java.util.TimerThread.mainLoop(Timer.java:599)
: at java.base/java.util.TimerThread.run(Timer.java:542)
: at __randomizedtesting.SeedInfo.seed([340F9724D936425B]:0)
:
:
: FAILED: org.apache.solr.crossdc.handler.MirroringConfigSetsHandlerTest.classMethod
:
: Error Message:
: com.carrotsearch.randomizedtesting.ThreadLeakError: 1 thread leaked from SUITE scope at org.apache.solr.crossdc.handler.MirroringConfigSetsHandlerTest:
: 1) Thread[id=42, name=file lock watchdog, state=TIMED_WAITING, group=main]
: at java.base/java.lang.Object.waitImpl(Native Method)
: at java.base/java.lang.Object.wait(Object.java:251)
: at java.base/java.lang.Object.wait(Object.java:219)
: at java.base/java.util.TimerThread.mainLoop(Timer.java:599)
: at java.base/java.util.TimerThread.run(Timer.java:542)
:
: Stack Trace:
: com.carrotsearch.randomizedtesting.ThreadLeakError: 1 thread leaked from SUITE scope at org.apache.solr.crossdc.handler.MirroringConfigSetsHandlerTest:
: 1) Thread[id=42, name=file lock watchdog, state=TIMED_WAITING, group=main]
: at java.base/java.lang.Object.waitImpl(Native Method)
: at java.base/java.lang.Object.wait(Object.java:251)
: at java.base/java.lang.Object.wait(Object.java:219)
: at java.base/java.util.TimerThread.mainLoop(Timer.java:599)
: at java.base/java.util.TimerThread.run(Timer.java:542)
: at __randomizedtesting.SeedInfo.seed([340F9724D936425B]:0)
:
:
: FAILED: org.apache.solr.crossdc.handler.MirroringConfigSetsHandlerTest.classMethod
:
: Error Message:
: com.carrotsearch.randomizedtesting.ThreadLeakError: There are still zombie threads that couldn't be terminated:
: 1) Thread[id=42, name=file lock watchdog, state=WAITING, group=main]
: at java.base/java.lang.Object.waitImpl(Native Method)
: at java.base/java.lang.Object.wait(Object.java:251)
: at java.base/java.lang.Object.wait(Object.java:190)
: at java.base/java.util.TimerThread.mainLoop(Timer.java:563)
: at java.base/java.util.TimerThread.run(Timer.java:542)
:
: Stack Trace:
: com.carrotsearch.randomizedtesting.ThreadLeakError: There are still zombie threads that couldn't be terminated:
: 1) Thread[id=42, name=file lock watchdog, state=WAITING, group=main]
: at java.base/java.lang.Object.waitImpl(Native Method)
: at java.base/java.lang.Object.wait(Object.java:251)
: at java.base/java.lang.Object.wait(Object.java:190)
: at java.base/java.util.TimerThread.mainLoop(Timer.java:563)
: at java.base/java.util.TimerThread.run(Timer.java:542)
: at __randomizedtesting.SeedInfo.seed([340F9724D936425B]:0)
:
:
: FAILED: org.apache.solr.crossdc.handler.MirroringConfigSetsHandlerTest.classMethod
:
: Error Message:
: com.carrotsearch.randomizedtesting.ThreadLeakError: 1 thread leaked from SUITE scope at org.apache.solr.crossdc.handler.MirroringConfigSetsHandlerTest:
: 1) Thread[id=42, name=file lock watchdog, state=TIMED_WAITING, group=main]
: at java.base/java.lang.Object.waitImpl(Native Method)
: at java.base/java.lang.Object.wait(Object.java:251)
: at java.base/java.lang.Object.wait(Object.java:219)
: at java.base/java.util.TimerThread.mainLoop(Timer.java:599)
: at java.base/java.util.TimerThread.run(Timer.java:542)
:
: Stack Trace:
: com.carrotsearch.randomizedtesting.ThreadLeakError: 1 thread leaked from SUITE scope at org.apache.solr.crossdc.handler.MirroringConfigSetsHandlerTest:
: 1) Thread[id=42, name=file lock watchdog, state=TIMED_WAITING, group=main]
: at java.base/java.lang.Object.waitImpl(Native Method)
: at java.base/java.lang.Object.wait(Object.java:251)
: at java.base/java.lang.Object.wait(Object.java:219)
: at java.base/java.util.TimerThread.mainLoop(Timer.java:599)
: at java.base/java.util.TimerThread.run(Timer.java:542)
: at __randomizedtesting.SeedInfo.seed([340F9724D936425B]:0)
:
:
: FAILED: org.apache.solr.crossdc.manager.SolrAndKafkaReindexTest.classMethod
:
: Error Message:
: com.carrotsearch.randomizedtesting.ThreadLeakError: There are still zombie threads that couldn't be terminated:
: 1) Thread[id=578, name=file lock watchdog, state=WAITING, group=main]
: at java.base/java.lang.Object.waitImpl(Native Method)
: at java.base/java.lang.Object.wait(Object.java:251)
: at java.base/java.lang.Object.wait(Object.java:190)
: at java.base/java.util.TimerThread.mainLoop(Timer.java:563)
: at java.base/java.util.TimerThread.run(Timer.java:542)
:
: Stack Trace:
: com.carrotsearch.randomizedtesting.ThreadLeakError: There are still zombie threads that couldn't be terminated:
: 1) Thread[id=578, name=file lock watchdog, state=WAITING, group=main]
: at java.base/java.lang.Object.waitImpl(Native Method)
: at java.base/java.lang.Object.wait(Object.java:251)
: at java.base/java.lang.Object.wait(Object.java:190)
: at java.base/java.util.TimerThread.mainLoop(Timer.java:563)
: at java.base/java.util.TimerThread.run(Timer.java:542)
: at __randomizedtesting.SeedInfo.seed([340F9724D936425B]:0)
:
:
: FAILED: org.apache.solr.crossdc.manager.SolrAndKafkaReindexTest.classMethod
:
: Error Message:
: com.carrotsearch.randomizedtesting.ThreadLeakError: 1 thread leaked from SUITE scope at org.apache.solr.crossdc.manager.SolrAndKafkaReindexTest:
: 1) Thread[id=578, name=file lock watchdog, state=TIMED_WAITING, group=main]
: at java.base/java.lang.Object.waitImpl(Native Method)
: at java.base/java.lang.Object.wait(Object.java:251)
: at java.base/java.lang.Object.wait(Object.java:219)
: at java.base/java.util.TimerThread.mainLoop(Timer.java:599)
: at java.base/java.util.TimerThread.run(Timer.java:542)
:
: Stack Trace:
: com.carrotsearch.randomizedtesting.ThreadLeakError: 1 thread leaked from SUITE scope at org.apache.solr.crossdc.manager.SolrAndKafkaReindexTest:
: 1) Thread[id=578, name=file lock watchdog, state=TIMED_WAITING, group=main]
: at java.base/java.lang.Object.waitImpl(Native Method)
: at java.base/java.lang.Object.wait(Object.java:251)
: at java.base/java.lang.Object.wait(Object.java:219)
: at java.base/java.util.TimerThread.mainLoop(Timer.java:599)
: at java.base/java.util.TimerThread.run(Timer.java:542)
: at __randomizedtesting.SeedInfo.seed([340F9724D936425B]:0)
:
:
: FAILED: org.apache.solr.crossdc.manager.ZkConfigIntegrationTest.classMethod
:
: Error Message:
: com.carrotsearch.randomizedtesting.ThreadLeakError: 1 thread leaked from SUITE scope at org.apache.solr.crossdc.manager.ZkConfigIntegrationTest:
: 1) Thread[id=40, name=file lock watchdog, state=TIMED_WAITING, group=main]
: at java.base/java.lang.Object.waitImpl(Native Method)
: at java.base/java.lang.Object.wait(Object.java:251)
: at java.base/java.lang.Object.wait(Object.java:219)
: at java.base/java.util.TimerThread.mainLoop(Timer.java:599)
: at java.base/java.util.TimerThread.run(Timer.java:542)
:
: Stack Trace:
: com.carrotsearch.randomizedtesting.ThreadLeakError: 1 thread leaked from SUITE scope at org.apache.solr.crossdc.manager.ZkConfigIntegrationTest:
: 1) Thread[id=40, name=file lock watchdog, state=TIMED_WAITING, group=main]
: at java.base/java.lang.Object.waitImpl(Native Method)
: at java.base/java.lang.Object.wait(Object.java:251)
: at java.base/java.lang.Object.wait(Object.java:219)
: at java.base/java.util.TimerThread.mainLoop(Timer.java:599)
: at java.base/java.util.TimerThread.run(Timer.java:542)
: at __randomizedtesting.SeedInfo.seed([340F9724D936425B]:0)
:
:
: FAILED: org.apache.solr.crossdc.manager.ZkConfigIntegrationTest.classMethod
:
: Error Message:
: com.carrotsearch.randomizedtesting.ThreadLeakError: There are still zombie threads that couldn't be terminated:
: 1) Thread[id=40, name=file lock watchdog, state=WAITING, group=main]
: at java.base/java.lang.Object.waitImpl(Native Method)
: at java.base/java.lang.Object.wait(Object.java:251)
: at java.base/java.lang.Object.wait(Object.java:190)
: at java.base/java.util.TimerThread.mainLoop(Timer.java:563)
: at java.base/java.util.TimerThread.run(Timer.java:542)
:
: Stack Trace:
: com.carrotsearch.randomizedtesting.ThreadLeakError: There are still zombie threads that couldn't be terminated:
: 1) Thread[id=40, name=file lock watchdog, state=WAITING, group=main]
: at java.base/java.lang.Object.waitImpl(Native Method)
: at java.base/java.lang.Object.wait(Object.java:251)
: at java.base/java.lang.Object.wait(Object.java:190)
: at java.base/java.util.TimerThread.mainLoop(Timer.java:563)
: at java.base/java.util.TimerThread.run(Timer.java:542)
: at __randomizedtesting.SeedInfo.seed([340F9724D936425B]:0)
:
:
: FAILED: org.apache.solr.gcs.GCSIncrementalBackupTest.classMethod
:
: Error Message:
: com.carrotsearch.randomizedtesting.ThreadLeakError: There are still zombie threads that couldn't be terminated:
: 1) Thread[id=183, name=file lock watchdog, state=WAITING, group=main]
: at java.base/java.lang.Object.waitImpl(Native Method)
: at java.base/java.lang.Object.wait(Object.java:251)
: at java.base/java.lang.Object.wait(Object.java:190)
: at java.base/java.util.TimerThread.mainLoop(Timer.java:563)
: at java.base/java.util.TimerThread.run(Timer.java:542)
:
: Stack Trace:
: com.carrotsearch.randomizedtesting.ThreadLeakError: There are still zombie threads that couldn't be terminated:
: 1) Thread[id=183, name=file lock watchdog, state=WAITING, group=main]
: at java.base/java.lang.Object.waitImpl(Native Method)
: at java.base/java.lang.Object.wait(Object.java:251)
: at java.base/java.lang.Object.wait(Object.java:190)
: at java.base/java.util.TimerThread.mainLoop(Timer.java:563)
: at java.base/java.util.TimerThread.run(Timer.java:542)
: at __randomizedtesting.SeedInfo.seed([340F9724D936425B]:0)
:
:
: FAILED: org.apache.solr.gcs.GCSIncrementalBackupTest.classMethod
:
: Error Message:
: com.carrotsearch.randomizedtesting.ThreadLeakError: 1 thread leaked from SUITE scope at org.apache.solr.gcs.GCSIncrementalBackupTest:
: 1) Thread[id=180, name=file lock watchdog, state=TIMED_WAITING, group=main]
: at java.base/java.lang.Object.waitImpl(Native Method)
: at java.base/java.lang.Object.wait(Object.java:251)
: at java.base/java.lang.Object.wait(Object.java:219)
: at java.base/java.util.TimerThread.mainLoop(Timer.java:599)
: at java.base/java.util.TimerThread.run(Timer.java:542)
:
: Stack Trace:
: com.carrotsearch.randomizedtesting.ThreadLeakError: 1 thread leaked from SUITE scope at org.apache.solr.gcs.GCSIncrementalBackupTest:
: 1) Thread[id=180, name=file lock watchdog, state=TIMED_WAITING, group=main]
: at java.base/java.lang.Object.waitImpl(Native Method)
: at java.base/java.lang.Object.wait(Object.java:251)
: at java.base/java.lang.Object.wait(Object.java:219)
: at java.base/java.util.TimerThread.mainLoop(Timer.java:599)
: at java.base/java.util.TimerThread.run(Timer.java:542)
: at __randomizedtesting.SeedInfo.seed([340F9724D936425B]:0)
:
:
: FAILED: org.apache.solr.gcs.GCSIncrementalBackupTest.classMethod
:
: Error Message:
: com.carrotsearch.randomizedtesting.ThreadLeakError: 1 thread leaked from SUITE scope at org.apache.solr.gcs.GCSIncrementalBackupTest:
: 1) Thread[id=185, name=file lock watchdog, state=WAITING, group=main]
: at java.base/java.lang.Object.waitImpl(Native Method)
: at java.base/java.lang.Object.wait(Object.java:251)
: at java.base/java.lang.Object.wait(Object.java:190)
: at java.base/java.util.TimerThread.mainLoop(Timer.java:563)
: at java.base/java.util.TimerThread.run(Timer.java:542)
:
: Stack Trace:
: com.carrotsearch.randomizedtesting.ThreadLeakError: 1 thread leaked from SUITE scope at org.apache.solr.gcs.GCSIncrementalBackupTest:
: 1) Thread[id=185, name=file lock watchdog, state=WAITING, group=main]
: at java.base/java.lang.Object.waitImpl(Native Method)
: at java.base/java.lang.Object.wait(Object.java:251)
: at java.base/java.lang.Object.wait(Object.java:190)
: at java.base/java.util.TimerThread.mainLoop(Timer.java:563)
: at java.base/java.util.TimerThread.run(Timer.java:542)
: at __randomizedtesting.SeedInfo.seed([340F9724D936425B]:0)
:
:
: FAILED: org.apache.solr.gcs.GCSIncrementalBackupTest.classMethod
:
: Error Message:
: com.carrotsearch.randomizedtesting.ThreadLeakError: There are still zombie threads that couldn't be terminated:
: 1) Thread[id=181, name=file lock watchdog, state=WAITING, group=main]
: at java.base/java.lang.Object.waitImpl(Native Method)
: at java.base/java.lang.Object.wait(Object.java:251)
: at java.base/java.lang.Object.wait(Object.java:190)
: at java.base/java.util.TimerThread.mainLoop(Timer.java:563)
: at java.base/java.util.TimerThread.run(Timer.java:542)
:
: Stack Trace:
: com.carrotsearch.randomizedtesting.ThreadLeakError: There are still zombie threads that couldn't be terminated:
: 1) Thread[id=181, name=file lock watchdog, state=WAITING, group=main]
: at java.base/java.lang.Object.waitImpl(Native Method)
: at java.base/java.lang.Object.wait(Object.java:251)
: at java.base/java.lang.Object.wait(Object.java:190)
: at java.base/java.util.TimerThread.mainLoop(Timer.java:563)
: at java.base/java.util.TimerThread.run(Timer.java:542)
: at __randomizedtesting.SeedInfo.seed([340F9724D936425B]:0)
:
:
: FAILED: org.apache.solr.gcs.GCSIncrementalBackupTest.classMethod
:
: Error Message:
: com.carrotsearch.randomizedtesting.ThreadLeakError: There are still zombie threads that couldn't be terminated:
: 1) Thread[id=180, name=file lock watchdog, state=WAITING, group=main]
: at java.base/java.lang.Object.waitImpl(Native Method)
: at java.base/java.lang.Object.wait(Object.java:251)
: at java.base/java.lang.Object.wait(Object.java:190)
: at java.base/java.util.TimerThread.mainLoop(Timer.java:563)
: at java.base/java.util.TimerThread.run(Timer.java:542)
:
: Stack Trace:
: com.carrotsearch.randomizedtesting.ThreadLeakError: There are still zombie threads that couldn't be terminated:
: 1) Thread[id=180, name=file lock watchdog, state=WAITING, group=main]
: at java.base/java.lang.Object.waitImpl(Native Method)
: at java.base/java.lang.Object.wait(Object.java:251)
: at java.base/java.lang.Object.wait(Object.java:190)
: at java.base/java.util.TimerThread.mainLoop(Timer.java:563)
: at java.base/java.util.TimerThread.run(Timer.java:542)
: at __randomizedtesting.SeedInfo.seed([340F9724D936425B]:0)
:
:
: FAILED: org.apache.solr.gcs.GCSIncrementalBackupTest.classMethod
:
: Error Message:
: com.carrotsearch.randomizedtesting.ThreadLeakError: 1 thread leaked from SUITE scope at org.apache.solr.gcs.GCSIncrementalBackupTest:
: 1) Thread[id=183, name=file lock watchdog, state=TIMED_WAITING, group=main]
: at java.base/java.lang.Object.waitImpl(Native Method)
: at java.base/java.lang.Object.wait(Object.java:251)
: at java.base/java.lang.Object.wait(Object.java:219)
: at java.base/java.util.TimerThread.mainLoop(Timer.java:599)
: at java.base/java.util.TimerThread.run(Timer.java:542)
:
: Stack Trace:
: com.carrotsearch.randomizedtesting.ThreadLeakError: 1 thread leaked from SUITE scope at org.apache.solr.gcs.GCSIncrementalBackupTest:
: 1) Thread[id=183, name=file lock watchdog, state=TIMED_WAITING, group=main]
: at java.base/java.lang.Object.waitImpl(Native Method)
: at java.base/java.lang.Object.wait(Object.java:251)
: at java.base/java.lang.Object.wait(Object.java:219)
: at java.base/java.util.TimerThread.mainLoop(Timer.java:599)
: at java.base/java.util.TimerThread.run(Timer.java:542)
: at __randomizedtesting.SeedInfo.seed([340F9724D936425B]:0)
:
:
: FAILED: org.apache.solr.gcs.GCSIncrementalBackupTest.classMethod
:
: Error Message:
: com.carrotsearch.randomizedtesting.ThreadLeakError: 1 thread leaked from SUITE scope at org.apache.solr.gcs.GCSIncrementalBackupTest:
: 1) Thread[id=181, name=file lock watchdog, state=TIMED_WAITING, group=main]
: at java.base/java.lang.Object.waitImpl(Native Method)
: at java.base/java.lang.Object.wait(Object.java:251)
: at java.base/java.lang.Object.wait(Object.java:219)
: at java.base/java.util.TimerThread.mainLoop(Timer.java:599)
: at java.base/java.util.TimerThread.run(Timer.java:542)
:
: Stack Trace:
: com.carrotsearch.randomizedtesting.ThreadLeakError: 1 thread leaked from SUITE scope at org.apache.solr.gcs.GCSIncrementalBackupTest:
: 1) Thread[id=181, name=file lock watchdog, state=TIMED_WAITING, group=main]
: at java.base/java.lang.Object.waitImpl(Native Method)
: at java.base/java.lang.Object.wait(Object.java:251)
: at java.base/java.lang.Object.wait(Object.java:219)
: at java.base/java.util.TimerThread.mainLoop(Timer.java:599)
: at java.base/java.util.TimerThread.run(Timer.java:542)
: at __randomizedtesting.SeedInfo.seed([340F9724D936425B]:0)
:
:
: FAILED: org.apache.solr.gcs.GCSIncrementalBackupTest.classMethod
:
: Error Message:
: com.carrotsearch.randomizedtesting.ThreadLeakError: There are still zombie threads that couldn't be terminated:
: 1) Thread[id=185, name=file lock watchdog, state=WAITING, group=main]
: at java.base/java.lang.Object.waitImpl(Native Method)
: at java.base/java.lang.Object.wait(Object.java:251)
: at java.base/java.lang.Object.wait(Object.java:190)
: at java.base/java.util.TimerThread.mainLoop(Timer.java:563)
: at java.base/java.util.TimerThread.run(Timer.java:542)
:
: Stack Trace:
: com.carrotsearch.randomizedtesting.ThreadLeakError: There are still zombie threads that couldn't be terminated:
: 1) Thread[id=185, name=file lock watchdog, state=WAITING, group=main]
: at java.base/java.lang.Object.waitImpl(Native Method)
: at java.base/java.lang.Object.wait(Object.java:251)
: at java.base/java.lang.Object.wait(Object.java:190)
: at java.base/java.util.TimerThread.mainLoop(Timer.java:563)
: at java.base/java.util.TimerThread.run(Timer.java:542)
: at __randomizedtesting.SeedInfo.seed([340F9724D936425B]:0)
:
:
: FAILED: org.apache.solr.gcs.GCSIncrementalBackupTest.testSkipConfigset
:
: Error Message:
: org.apache.solr.common.SolrException: Could not find a healthy node to handle the request.
:
: Stack Trace:
: org.apache.solr.common.SolrException: Could not find a healthy node to handle the request.
: at __randomizedtesting.SeedInfo.seed([340F9724D936425B:3FF6082D4174144C]:0)
: at app//org.apache.solr.client.solrj.impl.CloudSolrClient.sendRequest(CloudSolrClient.java:1133)
: at app//org.apache.solr.client.solrj.impl.CloudSolrClient.requestWithRetryOnStaleState(CloudSolrClient.java:834)
: at app//org.apache.solr.client.solrj.impl.CloudSolrClient.requestWithRetryOnStaleState(CloudSolrClient.java:971)
: at app//org.apache.solr.client.solrj.impl.CloudSolrClient.requestWithRetryOnStaleState(CloudSolrClient.java:971)
: at app//org.apache.solr.client.solrj.impl.CloudSolrClient.requestWithRetryOnStaleState(CloudSolrClient.java:971)
: at app//org.apache.solr.client.solrj.impl.CloudSolrClient.requestWithRetryOnStaleState(CloudSolrClient.java:971)
: at app//org.apache.solr.client.solrj.impl.CloudSolrClient.requestWithRetryOnStaleState(CloudSolrClient.java:971)
: at app//org.apache.solr.client.solrj.impl.CloudSolrClient.request(CloudSolrClient.java:765)
: at app//org.apache.solr.client.solrj.SolrRequest.process(SolrRequest.java:253)
: at app//org.apache.solr.client.solrj.SolrClient.query(SolrClient.java:928)
: at app//org.apache.solr.cloud.api.collections.AbstractIncrementalBackupTest.testSkipConfigset(AbstractIncrementalBackupTest.java:418)
: at java.base@17.0.8.1/jdk.internal.reflect.NativeMethodAccessorImpl.invoke0(Native Method)
: at java.base@17.0.8.1/jdk.internal.reflect.NativeMethodAccessorImpl.invoke(NativeMethodAccessorImpl.java:77)
: at java.base@17.0.8.1/jdk.internal.reflect.DelegatingMethodAccessorImpl.invoke(DelegatingMethodAccessorImpl.java:43)
: at java.base@17.0.8.1/java.lang.reflect.Method.invoke(Method.java:568)
: at app//com.carrotsearch.randomizedtesting.RandomizedRunner.invoke(RandomizedRunner.java:1758)
: at app//com.carrotsearch.randomizedtesting.RandomizedRunner$8.evaluate(RandomizedRunner.java:946)
: at app//com.carrotsearch.randomizedtesting.RandomizedRunner$9.evaluate(RandomizedRunner.java:982)
: at app//com.carrotsearch.randomizedtesting.RandomizedRunner$10.evaluate(RandomizedRunner.java:996)
: at app//com.carrotsearch.randomizedtesting.rules.SystemPropertiesRestoreRule$1.evaluate(SystemPropertiesRestoreRule.java:80)
: at app//org.junit.rules.RunRules.evaluate(RunRules.java:20)
: at app//org.apache.lucene.tests.util.TestRuleSetupTeardownChained$1.evaluate(TestRuleSetupTeardownChained.java:48)
: at app//org.apache.lucene.tests.util.AbstractBeforeAfterRule$1.evaluate(AbstractBeforeAfterRule.java:43)
: at app//org.apache.lucene.tests.util.TestRuleThreadAndTestName$1.evaluate(TestRuleThreadAndTestName.java:45)
: at app//org.apache.lucene.tests.util.TestRuleIgnoreAfterMaxFailures$1.evaluate(TestRuleIgnoreAfterMaxFailures.java:60)
: at app//org.apache.lucene.tests.util.TestRuleMarkFailure$1.evaluate(TestRuleMarkFailure.java:44)
: at app//org.junit.rules.RunRules.evaluate(RunRules.java:20)
: at app//com.carrotsearch.randomizedtesting.rules.StatementAdapter.evaluate(StatementAdapter.java:36)
: at app//com.carrotsearch.randomizedtesting.ThreadLeakControl$StatementRunner.run(ThreadLeakControl.java:390)
: at app//com.carrotsearch.randomizedtesting.ThreadLeakControl.forkTimeoutingTask(ThreadLeakControl.java:843)
: at app//com.carrotsearch.randomizedtesting.ThreadLeakControl$3.evaluate(ThreadLeakControl.java:490)
: at app//com.carrotsearch.randomizedtesting.RandomizedRunner.runSingleTest(RandomizedRunner.java:955)
: at app//com.carrotsearch.randomizedtesting.RandomizedRunner$5.evaluate(RandomizedRunner.java:840)
: at app//com.carrotsearch.randomizedtesting.RandomizedRunner$6.evaluate(RandomizedRunner.java:891)
: at app//com.carrotsearch.randomizedtesting.RandomizedRunner$7.evaluate(RandomizedRunner.java:902)
: at app//com.carrotsearch.randomizedtesting.rules.StatementAdapter.evaluate(StatementAdapter.java:36)
: at app//com.carrotsearch.randomizedtesting.rules.StatementAdapter.evaluate(StatementAdapter.java:36)
: at app//org.apache.lucene.tests.util.AbstractBeforeAfterRule$1.evaluate(AbstractBeforeAfterRule.java:43)
: at app//com.carrotsearch.randomizedtesting.rules.SystemPropertiesRestoreRule$1.evaluate(SystemPropertiesRestoreRule.java:80)
: at app//org.junit.rules.RunRules.evaluate(RunRules.java:20)
: at app//org.apache.lucene.tests.util.AbstractBeforeAfterRule$1.evaluate(AbstractBeforeAfterRule.java:43)
: at app//com.carrotsearch.randomizedtesting.rules.StatementAdapter.evaluate(StatementAdapter.java:36)
: at app//org.apache.lucene.tests.util.TestRuleStoreClassName$1.evaluate(TestRuleStoreClassName.java:38)
: at app//com.carrotsearch.randomizedtesting.rules.NoShadowingOrOverridesOnMethodsRule$1.evaluate(NoShadowingOrOverridesOnMethodsRule.java:40)
: at app//com.carrotsearch.randomizedtesting.rules.NoShadowingOrOverridesOnMethodsRule$1.evaluate(NoShadowingOrOverridesOnMethodsRule.java:40)
: at app//com.carrotsearch.randomizedtesting.rules.StatementAdapter.evaluate(StatementAdapter.java:36)
: at app//com.carrotsearch.randomizedtesting.rules.StatementAdapter.evaluate(StatementAdapter.java:36)
: at app//org.apache.lucene.tests.util.TestRuleAssertionsRequired$1.evaluate(TestRuleAssertionsRequired.java:53)
: at app//org.apache.lucene.tests.util.AbstractBeforeAfterRule$1.evaluate(AbstractBeforeAfterRule.java:43)
: at app//org.apache.lucene.tests.util.TestRuleMarkFailure$1.evaluate(TestRuleMarkFailure.java:44)
: at app//org.apache.lucene.tests.util.TestRuleIgnoreAfterMaxFailures$1.evaluate(TestRuleIgnoreAfterMaxFailures.java:60)
: at app//org.apache.lucene.tests.util.TestRuleIgnoreTestSuites$1.evaluate(TestRuleIgnoreTestSuites.java:47)
: at app//org.junit.rules.RunRules.evaluate(RunRules.java:20)
: at app//com.carrotsearch.randomizedtesting.rules.StatementAdapter.evaluate(StatementAdapter.java:36)
: at app//com.carrotsearch.randomizedtesting.ThreadLeakControl$StatementRunner.run(ThreadLeakControl.java:390)
: at app//com.carrotsearch.randomizedtesting.ThreadLeakControl.lambda$forkTimeoutingTask$0(ThreadLeakControl.java:850)
: at java.base@17.0.8.1/java.lang.Thread.run(Thread.java:857)
:
:
: FAILED: org.apache.solr.gcs.GCSInstallShardTest.classMethod
:
: Error Message:
: com.carrotsearch.randomizedtesting.ThreadLeakError: There are still zombie threads that couldn't be terminated:
: 1) Thread[id=228, name=file lock watchdog, state=WAITING, group=main]
: at java.base/java.lang.Object.waitImpl(Native Method)
: at java.base/java.lang.Object.wait(Object.java:251)
: at java.base/java.lang.Object.wait(Object.java:190)
: at java.base/java.util.TimerThread.mainLoop(Timer.java:563)
: at java.base/java.util.TimerThread.run(Timer.java:542)
:
: Stack Trace:
: com.carrotsearch.randomizedtesting.ThreadLeakError: There are still zombie threads that couldn't be terminated:
: 1) Thread[id=228, name=file lock watchdog, state=WAITING, group=main]
: at java.base/java.lang.Object.waitImpl(Native Method)
: at java.base/java.lang.Object.wait(Object.java:251)
: at java.base/java.lang.Object.wait(Object.java:190)
: at java.base/java.util.TimerThread.mainLoop(Timer.java:563)
: at java.base/java.util.TimerThread.run(Timer.java:542)
: at __randomizedtesting.SeedInfo.seed([340F9724D936425B]:0)
:
:
: FAILED: org.apache.solr.gcs.GCSInstallShardTest.classMethod
:
: Error Message:
: com.carrotsearch.randomizedtesting.ThreadLeakError: 1 thread leaked from SUITE scope at org.apache.solr.gcs.GCSInstallShardTest:
: 1) Thread[id=228, name=file lock watchdog, state=TIMED_WAITING, group=main]
: at java.base/java.lang.Object.waitImpl(Native Method)
: at java.base/java.lang.Object.wait(Object.java:251)
: at java.base/java.lang.Object.wait(Object.java:219)
: at java.base/java.util.TimerThread.mainLoop(Timer.java:599)
: at java.base/java.util.TimerThread.run(Timer.java:542)
:
: Stack Trace:
: com.carrotsearch.randomizedtesting.ThreadLeakError: 1 thread leaked from SUITE scope at org.apache.solr.gcs.GCSInstallShardTest:
: 1) Thread[id=228, name=file lock watchdog, state=TIMED_WAITING, group=main]
: at java.base/java.lang.Object.waitImpl(Native Method)
: at java.base/java.lang.Object.wait(Object.java:251)
: at java.base/java.lang.Object.wait(Object.java:219)
: at java.base/java.util.TimerThread.mainLoop(Timer.java:599)
: at java.base/java.util.TimerThread.run(Timer.java:542)
: at __randomizedtesting.SeedInfo.seed([340F9724D936425B]:0)
:
:
: FAILED: org.apache.solr.hdfs.cloud.HdfsCollectionsApiTest.classMethod
:
: Error Message:
: com.carrotsearch.randomizedtesting.ThreadLeakError: 1 thread leaked from SUITE scope at org.apache.solr.hdfs.cloud.HdfsCollectionsApiTest:
: 1) Thread[id=682, name=file lock watchdog, state=TIMED_WAITING, group=main]
: at java.base/java.lang.Object.waitImpl(Native Method)
: at java.base/java.lang.Object.wait(Object.java:251)
: at java.base/java.lang.Object.wait(Object.java:219)
: at java.base/java.util.TimerThread.mainLoop(Timer.java:599)
: at java.base/java.util.TimerThread.run(Timer.java:542)
:
: Stack Trace:
: com.carrotsearch.randomizedtesting.ThreadLeakError: 1 thread leaked from SUITE scope at org.apache.solr.hdfs.cloud.HdfsCollectionsApiTest:
: 1) Thread[id=682, name=file lock watchdog, state=TIMED_WAITING, group=main]
: at java.base/java.lang.Object.waitImpl(Native Method)
: at java.base/java.lang.Object.wait(Object.java:251)
: at java.base/java.lang.Object.wait(Object.java:219)
: at java.base/java.util.TimerThread.mainLoop(Timer.java:599)
: at java.base/java.util.TimerThread.run(Timer.java:542)
: at __randomizedtesting.SeedInfo.seed([340F9724D936425B]:0)
:
:
: FAILED: org.apache.solr.hdfs.cloud.HdfsCollectionsApiTest.classMethod
:
: Error Message:
: com.carrotsearch.randomizedtesting.ThreadLeakError: There are still zombie threads that couldn't be terminated:
: 1) Thread[id=682, name=file lock watchdog, state=WAITING, group=main]
: at java.base/java.lang.Object.waitImpl(Native Method)
: at java.base/java.lang.Object.wait(Object.java:251)
: at java.base/java.lang.Object.wait(Object.java:190)
: at java.base/java.util.TimerThread.mainLoop(Timer.java:563)
: at java.base/java.util.TimerThread.run(Timer.java:542)
:
: Stack Trace:
: com.carrotsearch.randomizedtesting.ThreadLeakError: There are still zombie threads that couldn't be terminated:
: 1) Thread[id=682, name=file lock watchdog, state=WAITING, group=main]
: at java.base/java.lang.Object.waitImpl(Native Method)
: at java.base/java.lang.Object.wait(Object.java:251)
: at java.base/java.lang.Object.wait(Object.java:190)
: at java.base/java.util.TimerThread.mainLoop(Timer.java:563)
: at java.base/java.util.TimerThread.run(Timer.java:542)
: at __randomizedtesting.SeedInfo.seed([340F9724D936425B]:0)
:
:
: FAILED: org.apache.solr.hdfs.cloud.api.collections.HdfsCloudIncrementalBackupTest.classMethod
:
: Error Message:
: com.carrotsearch.randomizedtesting.ThreadLeakError: 1 thread leaked from SUITE scope at org.apache.solr.hdfs.cloud.api.collections.HdfsCloudIncrementalBackupTest:
: 1) Thread[id=473, name=file lock watchdog, state=TIMED_WAITING, group=main]
: at java.base/java.lang.Object.waitImpl(Native Method)
: at java.base/java.lang.Object.wait(Object.java:251)
: at java.base/java.lang.Object.wait(Object.java:219)
: at java.base/java.util.TimerThread.mainLoop(Timer.java:599)
: at java.base/java.util.TimerThread.run(Timer.java:542)
:
: Stack Trace:
: com.carrotsearch.randomizedtesting.ThreadLeakError: 1 thread leaked from SUITE scope at org.apache.solr.hdfs.cloud.api.collections.HdfsCloudIncrementalBackupTest:
: 1) Thread[id=473, name=file lock watchdog, state=TIMED_WAITING, group=main]
: at java.base/java.lang.Object.waitImpl(Native Method)
: at java.base/java.lang.Object.wait(Object.java:251)
: at java.base/java.lang.Object.wait(Object.java:219)
: at java.base/java.util.TimerThread.mainLoop(Timer.java:599)
: at java.base/java.util.TimerThread.run(Timer.java:542)
: at __randomizedtesting.SeedInfo.seed([340F9724D936425B]:0)
:
:
: FAILED: org.apache.solr.hdfs.cloud.api.collections.HdfsCloudIncrementalBackupTest.classMethod
:
: Error Message:
: com.carrotsearch.randomizedtesting.ThreadLeakError: There are still zombie threads that couldn't be terminated:
: 1) Thread[id=473, name=file lock watchdog, state=WAITING, group=main]
: at java.base/java.lang.Object.waitImpl(Native Method)
: at java.base/java.lang.Object.wait(Object.java:251)
: at java.base/java.lang.Object.wait(Object.java:190)
: at java.base/java.util.TimerThread.mainLoop(Timer.java:563)
: at java.base/java.util.TimerThread.run(Timer.java:542)
:
: Stack Trace:
: com.carrotsearch.randomizedtesting.ThreadLeakError: There are still zombie threads that couldn't be terminated:
: 1) Thread[id=473, name=file lock watchdog, state=WAITING, group=main]
: at java.base/java.lang.Object.waitImpl(Native Method)
: at java.base/java.lang.Object.wait(Object.java:251)
: at java.base/java.lang.Object.wait(Object.java:190)
: at java.base/java.util.TimerThread.mainLoop(Timer.java:563)
: at java.base/java.util.TimerThread.run(Timer.java:542)
: at __randomizedtesting.SeedInfo.seed([340F9724D936425B]:0)
:
:
: FAILED: org.apache.solr.hdfs.search.TestRecoveryHdfs.classMethod
:
: Error Message:
: com.carrotsearch.randomizedtesting.ThreadLeakError: 1 thread leaked from SUITE scope at org.apache.solr.hdfs.search.TestRecoveryHdfs:
: 1) Thread[id=459, name=file lock watchdog, state=WAITING, group=main]
: at java.base/java.lang.Object.waitImpl(Native Method)
: at java.base/java.lang.Object.wait(Object.java:251)
: at java.base/java.lang.Object.wait(Object.java:190)
: at java.base/java.util.TimerThread.mainLoop(Timer.java:563)
: at java.base/java.util.TimerThread.run(Timer.java:542)
:
: Stack Trace:
: com.carrotsearch.randomizedtesting.ThreadLeakError: 1 thread leaked from SUITE scope at org.apache.solr.hdfs.search.TestRecoveryHdfs:
: 1) Thread[id=459, name=file lock watchdog, state=WAITING, group=main]
: at java.base/java.lang.Object.waitImpl(Native Method)
: at java.base/java.lang.Object.wait(Object.java:251)
: at java.base/java.lang.Object.wait(Object.java:190)
: at java.base/java.util.TimerThread.mainLoop(Timer.java:563)
: at java.base/java.util.TimerThread.run(Timer.java:542)
: at __randomizedtesting.SeedInfo.seed([340F9724D936425B]:0)
:
:
: FAILED: org.apache.solr.hdfs.search.TestRecoveryHdfs.classMethod
:
: Error Message:
: com.carrotsearch.randomizedtesting.ThreadLeakError: There are still zombie threads that couldn't be terminated:
: 1) Thread[id=459, name=file lock watchdog, state=WAITING, group=main]
: at java.base/java.lang.Object.waitImpl(Native Method)
: at java.base/java.lang.Object.wait(Object.java:251)
: at java.base/java.lang.Object.wait(Object.java:190)
: at java.base/java.util.TimerThread.mainLoop(Timer.java:563)
: at java.base/java.util.TimerThread.run(Timer.java:542)
:
: Stack Trace:
: com.carrotsearch.randomizedtesting.ThreadLeakError: There are still zombie threads that couldn't be terminated:
: 1) Thread[id=459, name=file lock watchdog, state=WAITING, group=main]
: at java.base/java.lang.Object.waitImpl(Native Method)
: at java.base/java.lang.Object.wait(Object.java:251)
: at java.base/java.lang.Object.wait(Object.java:190)
: at java.base/java.util.TimerThread.mainLoop(Timer.java:563)
: at java.base/java.util.TimerThread.run(Timer.java:542)
: at __randomizedtesting.SeedInfo.seed([340F9724D936425B]:0)
:
:
: FAILED: org.apache.solr.prometheus.scraper.SolrCloudScraperTest.classMethod
:
: Error Message:
: com.carrotsearch.randomizedtesting.ThreadLeakError: 1 thread leaked from SUITE scope at org.apache.solr.prometheus.scraper.SolrCloudScraperTest:
: 1) Thread[id=224, name=file lock watchdog, state=TIMED_WAITING, group=main]
: at java.base/java.lang.Object.waitImpl(Native Method)
: at java.base/java.lang.Object.wait(Object.java:251)
: at java.base/java.lang.Object.wait(Object.java:219)
: at java.base/java.util.TimerThread.mainLoop(Timer.java:599)
: at java.base/java.util.TimerThread.run(Timer.java:542)
:
: Stack Trace:
: com.carrotsearch.randomizedtesting.ThreadLeakError: 1 thread leaked from SUITE scope at org.apache.solr.prometheus.scraper.SolrCloudScraperTest:
: 1) Thread[id=224, name=file lock watchdog, state=TIMED_WAITING, group=main]
: at java.base/java.lang.Object.waitImpl(Native Method)
: at java.base/java.lang.Object.wait(Object.java:251)
: at java.base/java.lang.Object.wait(Object.java:219)
: at java.base/java.util.TimerThread.mainLoop(Timer.java:599)
: at java.base/java.util.TimerThread.run(Timer.java:542)
: at __randomizedtesting.SeedInfo.seed([340F9724D936425B]:0)
:
:
: FAILED: org.apache.solr.prometheus.scraper.SolrCloudScraperTest.classMethod
:
: Error Message:
: com.carrotsearch.randomizedtesting.ThreadLeakError: There are still zombie threads that couldn't be terminated:
: 1) Thread[id=224, name=file lock watchdog, state=WAITING, group=main]
: at java.base/java.lang.Object.waitImpl(Native Method)
: at java.base/java.lang.Object.wait(Object.java:251)
: at java.base/java.lang.Object.wait(Object.java:190)
: at java.base/java.util.TimerThread.mainLoop(Timer.java:563)
: at java.base/java.util.TimerThread.run(Timer.java:542)
:
: Stack Trace:
: com.carrotsearch.randomizedtesting.ThreadLeakError: There are still zombie threads that couldn't be terminated:
: 1) Thread[id=224, name=file lock watchdog, state=WAITING, group=main]
: at java.base/java.lang.Object.waitImpl(Native Method)
: at java.base/java.lang.Object.wait(Object.java:251)
: at java.base/java.lang.Object.wait(Object.java:190)
: at java.base/java.util.TimerThread.mainLoop(Timer.java:563)
: at java.base/java.util.TimerThread.run(Timer.java:542)
: at __randomizedtesting.SeedInfo.seed([340F9724D936425B]:0)
:
:
: FAILED: org.apache.solr.search.TestRecovery.classMethod
:
: Error Message:
: com.carrotsearch.randomizedtesting.ThreadLeakError: There are still zombie threads that couldn't be terminated:
: 1) Thread[id=78, name=file lock watchdog, state=WAITING, group=main]
: at java.base/java.lang.Object.waitImpl(Native Method)
: at java.base/java.lang.Object.wait(Object.java:251)
: at java.base/java.lang.Object.wait(Object.java:190)
: at java.base/java.util.TimerThread.mainLoop(Timer.java:563)
: at java.base/java.util.TimerThread.run(Timer.java:542)
:
: Stack Trace:
: com.carrotsearch.randomizedtesting.ThreadLeakError: There are still zombie threads that couldn't be terminated:
: 1) Thread[id=78, name=file lock watchdog, state=WAITING, group=main]
: at java.base/java.lang.Object.waitImpl(Native Method)
: at java.base/java.lang.Object.wait(Object.java:251)
: at java.base/java.lang.Object.wait(Object.java:190)
: at java.base/java.util.TimerThread.mainLoop(Timer.java:563)
: at java.base/java.util.TimerThread.run(Timer.java:542)
: at __randomizedtesting.SeedInfo.seed([340F9724D936425B]:0)
:
:
: FAILED: org.apache.solr.search.TestRecovery.classMethod
:
: Error Message:
: com.carrotsearch.randomizedtesting.ThreadLeakError: There are still zombie threads that couldn't be terminated:
: 1) Thread[id=274, name=file lock watchdog, state=WAITING, group=main]
: at java.base/java.lang.Object.waitImpl(Native Method)
: at java.base/java.lang.Object.wait(Object.java:251)
: at java.base/java.lang.Object.wait(Object.java:190)
: at java.base/java.util.TimerThread.mainLoop(Timer.java:563)
: at java.base/java.util.TimerThread.run(Timer.java:542)
:
: Stack Trace:
: com.carrotsearch.randomizedtesting.ThreadLeakError: There are still zombie threads that couldn't be terminated:
: 1) Thread[id=274, name=file lock watchdog, state=WAITING, group=main]
: at java.base/java.lang.Object.waitImpl(Native Method)
: at java.base/java.lang.Object.wait(Object.java:251)
: at java.base/java.lang.Object.wait(Object.java:190)
: at java.base/java.util.TimerThread.mainLoop(Timer.java:563)
: at java.base/java.util.TimerThread.run(Timer.java:542)
: at __randomizedtesting.SeedInfo.seed([340F9724D936425B]:0)
:
:
: FAILED: org.apache.solr.search.TestRecovery.classMethod
:
: Error Message:
: com.carrotsearch.randomizedtesting.ThreadLeakError: 1 thread leaked from SUITE scope at org.apache.solr.search.TestRecovery:
: 1) Thread[id=78, name=file lock watchdog, state=TIMED_WAITING, group=main]
: at java.base/java.lang.Object.waitImpl(Native Method)
: at java.base/java.lang.Object.wait(Object.java:251)
: at java.base/java.lang.Object.wait(Object.java:219)
: at java.base/java.util.TimerThread.mainLoop(Timer.java:599)
: at java.base/java.util.TimerThread.run(Timer.java:542)
:
: Stack Trace:
: com.carrotsearch.randomizedtesting.ThreadLeakError: 1 thread leaked from SUITE scope at org.apache.solr.search.TestRecovery:
: 1) Thread[id=78, name=file lock watchdog, state=TIMED_WAITING, group=main]
: at java.base/java.lang.Object.waitImpl(Native Method)
: at java.base/java.lang.Object.wait(Object.java:251)
: at java.base/java.lang.Object.wait(Object.java:219)
: at java.base/java.util.TimerThread.mainLoop(Timer.java:599)
: at java.base/java.util.TimerThread.run(Timer.java:542)
: at __randomizedtesting.SeedInfo.seed([340F9724D936425B]:0)
:
:
: FAILED: org.apache.solr.search.TestRecovery.classMethod
:
: Error Message:
: com.carrotsearch.randomizedtesting.ThreadLeakError: There are still zombie threads that couldn't be terminated:
: 1) Thread[id=363, name=file lock watchdog, state=WAITING, group=main]
: at java.base/java.lang.Object.waitImpl(Native Method)
: at java.base/java.lang.Object.wait(Object.java:251)
: at java.base/java.lang.Object.wait(Object.java:190)
: at java.base/java.util.TimerThread.mainLoop(Timer.java:563)
: at java.base/java.util.TimerThread.run(Timer.java:542)
:
: Stack Trace:
: com.carrotsearch.randomizedtesting.ThreadLeakError: There are still zombie threads that couldn't be terminated:
: 1) Thread[id=363, name=file lock watchdog, state=WAITING, group=main]
: at java.base/java.lang.Object.waitImpl(Native Method)
: at java.base/java.lang.Object.wait(Object.java:251)
: at java.base/java.lang.Object.wait(Object.java:190)
: at java.base/java.util.TimerThread.mainLoop(Timer.java:563)
: at java.base/java.util.TimerThread.run(Timer.java:542)
: at __randomizedtesting.SeedInfo.seed([340F9724D936425B]:0)
:
:
: FAILED: org.apache.solr.search.TestRecovery.classMethod
:
: Error Message:
: com.carrotsearch.randomizedtesting.ThreadLeakError: 1 thread leaked from SUITE scope at org.apache.solr.search.TestRecovery:
: 1) Thread[id=363, name=file lock watchdog, state=WAITING, group=main]
: at java.base/java.lang.Object.waitImpl(Native Method)
: at java.base/java.lang.Object.wait(Object.java:251)
: at java.base/java.lang.Object.wait(Object.java:190)
: at java.base/java.util.TimerThread.mainLoop(Timer.java:563)
: at java.base/java.util.TimerThread.run(Timer.java:542)
:
: Stack Trace:
: com.carrotsearch.randomizedtesting.ThreadLeakError: 1 thread leaked from SUITE scope at org.apache.solr.search.TestRecovery:
: 1) Thread[id=363, name=file lock watchdog, state=WAITING, group=main]
: at java.base/java.lang.Object.waitImpl(Native Method)
: at java.base/java.lang.Object.wait(Object.java:251)
: at java.base/java.lang.Object.wait(Object.java:190)
: at java.base/java.util.TimerThread.mainLoop(Timer.java:563)
: at java.base/java.util.TimerThread.run(Timer.java:542)
: at __randomizedtesting.SeedInfo.seed([340F9724D936425B]:0)
:
:
: FAILED: org.apache.solr.search.TestRecovery.classMethod
:
: Error Message:
: com.carrotsearch.randomizedtesting.ThreadLeakError: 1 thread leaked from SUITE scope at org.apache.solr.search.TestRecovery:
: 1) Thread[id=274, name=file lock watchdog, state=TIMED_WAITING, group=main]
: at java.base/java.lang.Object.waitImpl(Native Method)
: at java.base/java.lang.Object.wait(Object.java:251)
: at java.base/java.lang.Object.wait(Object.java:219)
: at java.base/java.util.TimerThread.mainLoop(Timer.java:599)
: at java.base/java.util.TimerThread.run(Timer.java:542)
:
: Stack Trace:
: com.carrotsearch.randomizedtesting.ThreadLeakError: 1 thread leaked from SUITE scope at org.apache.solr.search.TestRecovery:
: 1) Thread[id=274, name=file lock watchdog, state=TIMED_WAITING, group=main]
: at java.base/java.lang.Object.waitImpl(Native Method)
: at java.base/java.lang.Object.wait(Object.java:251)
: at java.base/java.lang.Object.wait(Object.java:219)
: at java.base/java.util.TimerThread.mainLoop(Timer.java:599)
: at java.base/java.util.TimerThread.run(Timer.java:542)
: at __randomizedtesting.SeedInfo.seed([340F9724D936425B]:0)
:
:
: FAILED: org.apache.solr.search.TestRecovery.testBufferedMultipleCalls
:
: Error Message:
: java.lang.RuntimeException: mismatch: 'c105'!='c106' @ response/docs/[4]/id
:
: Stack Trace:
: java.lang.RuntimeException: mismatch: 'c105'!='c106' @ response/docs/[4]/id
: at app//org.apache.solr.SolrTestCaseJ4.assertJQ(SolrTestCaseJ4.java:1072)
: at app//org.apache.solr.SolrTestCaseJ4.assertJQ(SolrTestCaseJ4.java:1018)
: at app//org.apache.solr.search.TestRecovery.testBufferedMultipleCalls(TestRecovery.java:1112)
: at java.base@17.0.8.1/jdk.internal.reflect.NativeMethodAccessorImpl.invoke0(Native Method)
: at java.base@17.0.8.1/jdk.internal.reflect.NativeMethodAccessorImpl.invoke(NativeMethodAccessorImpl.java:77)
: at java.base@17.0.8.1/jdk.internal.reflect.DelegatingMethodAccessorImpl.invoke(DelegatingMethodAccessorImpl.java:43)
: at java.base@17.0.8.1/java.lang.reflect.Method.invoke(Method.java:568)
: at app//com.carrotsearch.randomizedtesting.RandomizedRunner.invoke(RandomizedRunner.java:1758)
: at app//com.carrotsearch.randomizedtesting.RandomizedRunner$8.evaluate(RandomizedRunner.java:946)
: at app//com.carrotsearch.randomizedtesting.RandomizedRunner$9.evaluate(RandomizedRunner.java:982)
: at app//com.carrotsearch.randomizedtesting.RandomizedRunner$10.evaluate(RandomizedRunner.java:996)
: at app//com.carrotsearch.randomizedtesting.rules.SystemPropertiesRestoreRule$1.evaluate(SystemPropertiesRestoreRule.java:80)
: at app//org.junit.rules.RunRules.evaluate(RunRules.java:20)
: at app//org.apache.lucene.tests.util.TestRuleSetupTeardownChained$1.evaluate(TestRuleSetupTeardownChained.java:48)
: at app//org.apache.lucene.tests.util.AbstractBeforeAfterRule$1.evaluate(AbstractBeforeAfterRule.java:43)
: at app//org.apache.lucene.tests.util.TestRuleThreadAndTestName$1.evaluate(TestRuleThreadAndTestName.java:45)
: at app//org.apache.lucene.tests.util.TestRuleIgnoreAfterMaxFailures$1.evaluate(TestRuleIgnoreAfterMaxFailures.java:60)
: at app//org.apache.lucene.tests.util.TestRuleMarkFailure$1.evaluate(TestRuleMarkFailure.java:44)
: at app//org.junit.rules.RunRules.evaluate(RunRules.java:20)
: at app//com.carrotsearch.randomizedtesting.rules.StatementAdapter.evaluate(StatementAdapter.java:36)
: at app//com.carrotsearch.randomizedtesting.ThreadLeakControl$StatementRunner.run(ThreadLeakControl.java:390)
: at app//com.carrotsearch.randomizedtesting.ThreadLeakControl.forkTimeoutingTask(ThreadLeakControl.java:843)
: at app//com.carrotsearch.randomizedtesting.ThreadLeakControl$3.evaluate(ThreadLeakControl.java:490)
: at app//com.carrotsearch.randomizedtesting.RandomizedRunner.runSingleTest(RandomizedRunner.java:955)
: at app//com.carrotsearch.randomizedtesting.RandomizedRunner$5.evaluate(RandomizedRunner.java:840)
: at app//com.carrotsearch.randomizedtesting.RandomizedRunner$6.evaluate(RandomizedRunner.java:891)
: at app//com.carrotsearch.randomizedtesting.RandomizedRunner$7.evaluate(RandomizedRunner.java:902)
: at app//com.carrotsearch.randomizedtesting.rules.StatementAdapter.evaluate(StatementAdapter.java:36)
: at app//com.carrotsearch.randomizedtesting.rules.StatementAdapter.evaluate(StatementAdapter.java:36)
: at app//org.apache.lucene.tests.util.AbstractBeforeAfterRule$1.evaluate(AbstractBeforeAfterRule.java:43)
: at app//com.carrotsearch.randomizedtesting.rules.SystemPropertiesRestoreRule$1.evaluate(SystemPropertiesRestoreRule.java:80)
: at app//org.junit.rules.RunRules.evaluate(RunRules.java:20)
: at app//org.apache.lucene.tests.util.AbstractBeforeAfterRule$1.evaluate(AbstractBeforeAfterRule.java:43)
: at app//com.carrotsearch.randomizedtesting.rules.StatementAdapter.evaluate(StatementAdapter.java:36)
: at app//org.apache.lucene.tests.util.TestRuleStoreClassName$1.evaluate(TestRuleStoreClassName.java:38)
: at app//com.carrotsearch.randomizedtesting.rules.NoShadowingOrOverridesOnMethodsRule$1.evaluate(NoShadowingOrOverridesOnMethodsRule.java:40)
: at app//com.carrotsearch.randomizedtesting.rules.NoShadowingOrOverridesOnMethodsRule$1.evaluate(NoShadowingOrOverridesOnMethodsRule.java:40)
: at app//com.carrotsearch.randomizedtesting.rules.StatementAdapter.evaluate(StatementAdapter.java:36)
: at app//com.carrotsearch.randomizedtesting.rules.StatementAdapter.evaluate(StatementAdapter.java:36)
: at app//org.apache.lucene.tests.util.TestRuleAssertionsRequired$1.evaluate(TestRuleAssertionsRequired.java:53)
: at app//org.apache.lucene.tests.util.AbstractBeforeAfterRule$1.evaluate(AbstractBeforeAfterRule.java:43)
: at app//org.apache.lucene.tests.util.TestRuleMarkFailure$1.evaluate(TestRuleMarkFailure.java:44)
: at app//org.apache.lucene.tests.util.TestRuleIgnoreAfterMaxFailures$1.evaluate(TestRuleIgnoreAfterMaxFailures.java:60)
: at app//org.apache.lucene.tests.util.TestRuleIgnoreTestSuites$1.evaluate(TestRuleIgnoreTestSuites.java:47)
: at app//org.junit.rules.RunRules.evaluate(RunRules.java:20)
: at app//com.carrotsearch.randomizedtesting.rules.StatementAdapter.evaluate(StatementAdapter.java:36)
: at app//com.carrotsearch.randomizedtesting.ThreadLeakControl$StatementRunner.run(ThreadLeakControl.java:390)
: at app//com.carrotsearch.randomizedtesting.ThreadLeakControl.lambda$forkTimeoutingTask$0(ThreadLeakControl.java:850)
: at java.base@17.0.8.1/java.lang.Thread.run(Thread.java:857)
:
:
: FAILED: org.apache.solr.search.TestRecovery.testBufferedMultipleCalls
:
: Error Message:
: java.lang.RuntimeException: mismatch: '43'!='42' @ versions/[0]
:
: Stack Trace:
: java.lang.RuntimeException: mismatch: '43'!='42' @ versions/[0]
: at __randomizedtesting.SeedInfo.seed([340F9724D936425B:7B701A2B666C3F64]:0)
: at app//org.apache.solr.SolrTestCaseJ4.assertJQ(SolrTestCaseJ4.java:1072)
: at app//org.apache.solr.SolrTestCaseJ4.assertJQ(SolrTestCaseJ4.java:1018)
: at app//org.apache.solr.search.TestRecovery.testBufferedMultipleCalls(TestRecovery.java:1081)
: at java.base@17.0.8.1/jdk.internal.reflect.NativeMethodAccessorImpl.invoke0(Native Method)
: at java.base@17.0.8.1/jdk.internal.reflect.NativeMethodAccessorImpl.invoke(NativeMethodAccessorImpl.java:77)
: at java.base@17.0.8.1/jdk.internal.reflect.DelegatingMethodAccessorImpl.invoke(DelegatingMethodAccessorImpl.java:43)
: at java.base@17.0.8.1/java.lang.reflect.Method.invoke(Method.java:568)
: at app//com.carrotsearch.randomizedtesting.RandomizedRunner.invoke(RandomizedRunner.java:1758)
: at app//com.carrotsearch.randomizedtesting.RandomizedRunner$8.evaluate(RandomizedRunner.java:946)
: at app//com.carrotsearch.randomizedtesting.RandomizedRunner$9.evaluate(RandomizedRunner.java:982)
: at app//com.carrotsearch.randomizedtesting.RandomizedRunner$10.evaluate(RandomizedRunner.java:996)
: at app//com.carrotsearch.randomizedtesting.rules.SystemPropertiesRestoreRule$1.evaluate(SystemPropertiesRestoreRule.java:80)
: at app//org.junit.rules.RunRules.evaluate(RunRules.java:20)
: at app//org.apache.lucene.tests.util.TestRuleSetupTeardownChained$1.evaluate(TestRuleSetupTeardownChained.java:48)
: at app//org.apache.lucene.tests.util.AbstractBeforeAfterRule$1.evaluate(AbstractBeforeAfterRule.java:43)
: at app//org.apache.lucene.tests.util.TestRuleThreadAndTestName$1.evaluate(TestRuleThreadAndTestName.java:45)
: at app//org.apache.lucene.tests.util.TestRuleIgnoreAfterMaxFailures$1.evaluate(TestRuleIgnoreAfterMaxFailures.java:60)
: at app//org.apache.lucene.tests.util.TestRuleMarkFailure$1.evaluate(TestRuleMarkFailure.java:44)
: at app//org.junit.rules.RunRules.evaluate(RunRules.java:20)
: at app//com.carrotsearch.randomizedtesting.rules.StatementAdapter.evaluate(StatementAdapter.java:36)
: at app//com.carrotsearch.randomizedtesting.ThreadLeakControl$StatementRunner.run(ThreadLeakControl.java:390)
: at app//com.carrotsearch.randomizedtesting.ThreadLeakControl.forkTimeoutingTask(ThreadLeakControl.java:843)
: at app//com.carrotsearch.randomizedtesting.ThreadLeakControl$3.evaluate(ThreadLeakControl.java:490)
: at app//com.carrotsearch.randomizedtesting.RandomizedRunner.runSingleTest(RandomizedRunner.java:955)
: at app//com.carrotsearch.randomizedtesting.RandomizedRunner$5.evaluate(RandomizedRunner.java:840)
: at app//com.carrotsearch.randomizedtesting.RandomizedRunner$6.evaluate(RandomizedRunner.java:891)
: at app//com.carrotsearch.randomizedtesting.RandomizedRunner$7.evaluate(RandomizedRunner.java:902)
: at app//com.carrotsearch.randomizedtesting.rules.StatementAdapter.evaluate(StatementAdapter.java:36)
: at app//com.carrotsearch.randomizedtesting.rules.StatementAdapter.evaluate(StatementAdapter.java:36)
: at app//org.apache.lucene.tests.util.AbstractBeforeAfterRule$1.evaluate(AbstractBeforeAfterRule.java:43)
: at app//com.carrotsearch.randomizedtesting.rules.SystemPropertiesRestoreRule$1.evaluate(SystemPropertiesRestoreRule.java:80)
: at app//org.junit.rules.RunRules.evaluate(RunRules.java:20)
: at app//org.apache.lucene.tests.util.AbstractBeforeAfterRule$1.evaluate(AbstractBeforeAfterRule.java:43)
: at app//com.carrotsearch.randomizedtesting.rules.StatementAdapter.evaluate(StatementAdapter.java:36)
: at app//org.apache.lucene.tests.util.TestRuleStoreClassName$1.evaluate(TestRuleStoreClassName.java:38)
: at app//com.carrotsearch.randomizedtesting.rules.NoShadowingOrOverridesOnMethodsRule$1.evaluate(NoShadowingOrOverridesOnMethodsRule.java:40)
: at app//com.carrotsearch.randomizedtesting.rules.NoShadowingOrOverridesOnMethodsRule$1.evaluate(NoShadowingOrOverridesOnMethodsRule.java:40)
: at app//com.carrotsearch.randomizedtesting.rules.StatementAdapter.evaluate(StatementAdapter.java:36)
: at app//com.carrotsearch.randomizedtesting.rules.StatementAdapter.evaluate(StatementAdapter.java:36)
: at app//org.apache.lucene.tests.util.TestRuleAssertionsRequired$1.evaluate(TestRuleAssertionsRequired.java:53)
: at app//org.apache.lucene.tests.util.AbstractBeforeAfterRule$1.evaluate(AbstractBeforeAfterRule.java:43)
: at app//org.apache.lucene.tests.util.TestRuleMarkFailure$1.evaluate(TestRuleMarkFailure.java:44)
: at app//org.apache.lucene.tests.util.TestRuleIgnoreAfterMaxFailures$1.evaluate(TestRuleIgnoreAfterMaxFailures.java:60)
: at app//org.apache.lucene.tests.util.TestRuleIgnoreTestSuites$1.evaluate(TestRuleIgnoreTestSuites.java:47)
: at app//org.junit.rules.RunRules.evaluate(RunRules.java:20)
: at app//com.carrotsearch.randomizedtesting.rules.StatementAdapter.evaluate(StatementAdapter.java:36)
: at app//com.carrotsearch.randomizedtesting.ThreadLeakControl$StatementRunner.run(ThreadLeakControl.java:390)
: at app//com.carrotsearch.randomizedtesting.ThreadLeakControl.lambda$forkTimeoutingTask$0(ThreadLeakControl.java:850)
: at java.base@17.0.8.1/java.lang.Thread.run(Thread.java:857)
:
:
: FAILED: org.apache.solr.search.TestRecovery.testDropBuffered
:
: Error Message:
: java.lang.RuntimeException: mismatch: '28'!='27' @ versions/[0]
:
: Stack Trace:
: java.lang.RuntimeException: mismatch: '28'!='27' @ versions/[0]
: at __randomizedtesting.SeedInfo.seed([340F9724D936425B:10F3BC760C783747]:0)
: at app//org.apache.solr.SolrTestCaseJ4.assertJQ(SolrTestCaseJ4.java:1072)
: at app//org.apache.solr.SolrTestCaseJ4.assertJQ(SolrTestCaseJ4.java:1018)
: at app//org.apache.solr.search.TestRecovery.testDropBuffered(TestRecovery.java:909)
: at java.base@17.0.8.1/jdk.internal.reflect.NativeMethodAccessorImpl.invoke0(Native Method)
: at java.base@17.0.8.1/jdk.internal.reflect.NativeMethodAccessorImpl.invoke(NativeMethodAccessorImpl.java:77)
: at java.base@17.0.8.1/jdk.internal.reflect.DelegatingMethodAccessorImpl.invoke(DelegatingMethodAccessorImpl.java:43)
: at java.base@17.0.8.1/java.lang.reflect.Method.invoke(Method.java:568)
: at app//com.carrotsearch.randomizedtesting.RandomizedRunner.invoke(RandomizedRunner.java:1758)
: at app//com.carrotsearch.randomizedtesting.RandomizedRunner$8.evaluate(RandomizedRunner.java:946)
: at app//com.carrotsearch.randomizedtesting.RandomizedRunner$9.evaluate(RandomizedRunner.java:982)
: at app//com.carrotsearch.randomizedtesting.RandomizedRunner$10.evaluate(RandomizedRunner.java:996)
: at app//com.carrotsearch.randomizedtesting.rules.SystemPropertiesRestoreRule$1.evaluate(SystemPropertiesRestoreRule.java:80)
: at app//org.junit.rules.RunRules.evaluate(RunRules.java:20)
: at app//org.apache.lucene.tests.util.TestRuleSetupTeardownChained$1.evaluate(TestRuleSetupTeardownChained.java:48)
: at app//org.apache.lucene.tests.util.AbstractBeforeAfterRule$1.evaluate(AbstractBeforeAfterRule.java:43)
: at app//org.apache.lucene.tests.util.TestRuleThreadAndTestName$1.evaluate(TestRuleThreadAndTestName.java:45)
: at app//org.apache.lucene.tests.util.TestRuleIgnoreAfterMaxFailures$1.evaluate(TestRuleIgnoreAfterMaxFailures.java:60)
: at app//org.apache.lucene.tests.util.TestRuleMarkFailure$1.evaluate(TestRuleMarkFailure.java:44)
: at app//org.junit.rules.RunRules.evaluate(RunRules.java:20)
: at app//com.carrotsearch.randomizedtesting.rules.StatementAdapter.evaluate(StatementAdapter.java:36)
: at app//com.carrotsearch.randomizedtesting.ThreadLeakControl$StatementRunner.run(ThreadLeakControl.java:390)
: at app//com.carrotsearch.randomizedtesting.ThreadLeakControl.forkTimeoutingTask(ThreadLeakControl.java:843)
: at app//com.carrotsearch.randomizedtesting.ThreadLeakControl$3.evaluate(ThreadLeakControl.java:490)
: at app//com.carrotsearch.randomizedtesting.RandomizedRunner.runSingleTest(RandomizedRunner.java:955)
: at app//com.carrotsearch.randomizedtesting.RandomizedRunner$5.evaluate(RandomizedRunner.java:840)
: at app//com.carrotsearch.randomizedtesting.RandomizedRunner$6.evaluate(RandomizedRunner.java:891)
: at app//com.carrotsearch.randomizedtesting.RandomizedRunner$7.evaluate(RandomizedRunner.java:902)
: at app//com.carrotsearch.randomizedtesting.rules.StatementAdapter.evaluate(StatementAdapter.java:36)
: at app//com.carrotsearch.randomizedtesting.rules.StatementAdapter.evaluate(StatementAdapter.java:36)
: at app//org.apache.lucene.tests.util.AbstractBeforeAfterRule$1.evaluate(AbstractBeforeAfterRule.java:43)
: at app//com.carrotsearch.randomizedtesting.rules.SystemPropertiesRestoreRule$1.evaluate(SystemPropertiesRestoreRule.java:80)
: at app//org.junit.rules.RunRules.evaluate(RunRules.java:20)
: at app//org.apache.lucene.tests.util.AbstractBeforeAfterRule$1.evaluate(AbstractBeforeAfterRule.java:43)
: at app//com.carrotsearch.randomizedtesting.rules.StatementAdapter.evaluate(StatementAdapter.java:36)
: at app//org.apache.lucene.tests.util.TestRuleStoreClassName$1.evaluate(TestRuleStoreClassName.java:38)
: at app//com.carrotsearch.randomizedtesting.rules.NoShadowingOrOverridesOnMethodsRule$1.evaluate(NoShadowingOrOverridesOnMethodsRule.java:40)
: at app//com.carrotsearch.randomizedtesting.rules.NoShadowingOrOverridesOnMethodsRule$1.evaluate(NoShadowingOrOverridesOnMethodsRule.java:40)
: at app//com.carrotsearch.randomizedtesting.rules.StatementAdapter.evaluate(StatementAdapter.java:36)
: at app//com.carrotsearch.randomizedtesting.rules.StatementAdapter.evaluate(StatementAdapter.java:36)
: at app//org.apache.lucene.tests.util.TestRuleAssertionsRequired$1.evaluate(TestRuleAssertionsRequired.java:53)
: at app//org.apache.lucene.tests.util.AbstractBeforeAfterRule$1.evaluate(AbstractBeforeAfterRule.java:43)
: at app//org.apache.lucene.tests.util.TestRuleMarkFailure$1.evaluate(TestRuleMarkFailure.java:44)
: at app//org.apache.lucene.tests.util.TestRuleIgnoreAfterMaxFailures$1.evaluate(TestRuleIgnoreAfterMaxFailures.java:60)
: at app//org.apache.lucene.tests.util.TestRuleIgnoreTestSuites$1.evaluate(TestRuleIgnoreTestSuites.java:47)
: at app//org.junit.rules.RunRules.evaluate(RunRules.java:20)
: at app//com.carrotsearch.randomizedtesting.rules.StatementAdapter.evaluate(StatementAdapter.java:36)
: at app//com.carrotsearch.randomizedtesting.ThreadLeakControl$StatementRunner.run(ThreadLeakControl.java:390)
: at app//com.carrotsearch.randomizedtesting.ThreadLeakControl.lambda$forkTimeoutingTask$0(ThreadLeakControl.java:850)
: at java.base@17.0.8.1/java.lang.Thread.run(Thread.java:857)
:
:
: FAILED: org.apache.solr.search.TestRecovery.testDropBuffered
:
: Error Message:
: java.lang.RuntimeException: mismatch: '5'!='4' @ versions/[0]
:
: Stack Trace:
: java.lang.RuntimeException: mismatch: '5'!='4' @ versions/[0]
: at __randomizedtesting.SeedInfo.seed([340F9724D936425B:10F3BC760C783747]:0)
: at app//org.apache.solr.SolrTestCaseJ4.assertJQ(SolrTestCaseJ4.java:1072)
: at app//org.apache.solr.SolrTestCaseJ4.assertJQ(SolrTestCaseJ4.java:1018)
: at app//org.apache.solr.search.TestRecovery.testDropBuffered(TestRecovery.java:909)
: at java.base@17.0.8.1/jdk.internal.reflect.NativeMethodAccessorImpl.invoke0(Native Method)
: at java.base@17.0.8.1/jdk.internal.reflect.NativeMethodAccessorImpl.invoke(NativeMethodAccessorImpl.java:77)
: at java.base@17.0.8.1/jdk.internal.reflect.DelegatingMethodAccessorImpl.invoke(DelegatingMethodAccessorImpl.java:43)
: at java.base@17.0.8.1/java.lang.reflect.Method.invoke(Method.java:568)
: at app//com.carrotsearch.randomizedtesting.RandomizedRunner.invoke(RandomizedRunner.java:1758)
: at app//com.carrotsearch.randomizedtesting.RandomizedRunner$8.evaluate(RandomizedRunner.java:946)
: at app//com.carrotsearch.randomizedtesting.RandomizedRunner$9.evaluate(RandomizedRunner.java:982)
: at app//com.carrotsearch.randomizedtesting.RandomizedRunner$10.evaluate(RandomizedRunner.java:996)
: at app//com.carrotsearch.randomizedtesting.rules.SystemPropertiesRestoreRule$1.evaluate(SystemPropertiesRestoreRule.java:80)
: at app//org.junit.rules.RunRules.evaluate(RunRules.java:20)
: at app//org.apache.lucene.tests.util.TestRuleSetupTeardownChained$1.evaluate(TestRuleSetupTeardownChained.java:48)
: at app//org.apache.lucene.tests.util.AbstractBeforeAfterRule$1.evaluate(AbstractBeforeAfterRule.java:43)
: at app//org.apache.lucene.tests.util.TestRuleThreadAndTestName$1.evaluate(TestRuleThreadAndTestName.java:45)
: at app//org.apache.lucene.tests.util.TestRuleIgnoreAfterMaxFailures$1.evaluate(TestRuleIgnoreAfterMaxFailures.java:60)
: at app//org.apache.lucene.tests.util.TestRuleMarkFailure$1.evaluate(TestRuleMarkFailure.java:44)
: at app//org.junit.rules.RunRules.evaluate(RunRules.java:20)
: at app//com.carrotsearch.randomizedtesting.rules.StatementAdapter.evaluate(StatementAdapter.java:36)
: at app//com.carrotsearch.randomizedtesting.ThreadLeakControl$StatementRunner.run(ThreadLeakControl.java:390)
: at app//com.carrotsearch.randomizedtesting.ThreadLeakControl.forkTimeoutingTask(ThreadLeakControl.java:843)
: at app//com.carrotsearch.randomizedtesting.ThreadLeakControl$3.evaluate(ThreadLeakControl.java:490)
: at app//com.carrotsearch.randomizedtesting.RandomizedRunner.runSingleTest(RandomizedRunner.java:955)
: at app//com.carrotsearch.randomizedtesting.RandomizedRunner$5.evaluate(RandomizedRunner.java:840)
: at app//com.carrotsearch.randomizedtesting.RandomizedRunner$6.evaluate(RandomizedRunner.java:891)
: at app//com.carrotsearch.randomizedtesting.RandomizedRunner$7.evaluate(RandomizedRunner.java:902)
: at app//com.carrotsearch.randomizedtesting.rules.StatementAdapter.evaluate(StatementAdapter.java:36)
: at app//com.carrotsearch.randomizedtesting.rules.StatementAdapter.evaluate(StatementAdapter.java:36)
: at app//org.apache.lucene.tests.util.AbstractBeforeAfterRule$1.evaluate(AbstractBeforeAfterRule.java:43)
: at app//com.carrotsearch.randomizedtesting.rules.SystemPropertiesRestoreRule$1.evaluate(SystemPropertiesRestoreRule.java:80)
: at app//org.junit.rules.RunRules.evaluate(RunRules.java:20)
: at app//org.apache.lucene.tests.util.AbstractBeforeAfterRule$1.evaluate(AbstractBeforeAfterRule.java:43)
: at app//com.carrotsearch.randomizedtesting.rules.StatementAdapter.evaluate(StatementAdapter.java:36)
: at app//org.apache.lucene.tests.util.TestRuleStoreClassName$1.evaluate(TestRuleStoreClassName.java:38)
: at app//com.carrotsearch.randomizedtesting.rules.NoShadowingOrOverridesOnMethodsRule$1.evaluate(NoShadowingOrOverridesOnMethodsRule.java:40)
: at app//com.carrotsearch.randomizedtesting.rules.NoShadowingOrOverridesOnMethodsRule$1.evaluate(NoShadowingOrOverridesOnMethodsRule.java:40)
: at app//com.carrotsearch.randomizedtesting.rules.StatementAdapter.evaluate(StatementAdapter.java:36)
: at app//com.carrotsearch.randomizedtesting.rules.StatementAdapter.evaluate(StatementAdapter.java:36)
: at app//org.apache.lucene.tests.util.TestRuleAssertionsRequired$1.evaluate(TestRuleAssertionsRequired.java:53)
: at app//org.apache.lucene.tests.util.AbstractBeforeAfterRule$1.evaluate(AbstractBeforeAfterRule.java:43)
: at app//org.apache.lucene.tests.util.TestRuleMarkFailure$1.evaluate(TestRuleMarkFailure.java:44)
: at app//org.apache.lucene.tests.util.TestRuleIgnoreAfterMaxFailures$1.evaluate(TestRuleIgnoreAfterMaxFailures.java:60)
: at app//org.apache.lucene.tests.util.TestRuleIgnoreTestSuites$1.evaluate(TestRuleIgnoreTestSuites.java:47)
: at app//org.junit.rules.RunRules.evaluate(RunRules.java:20)
: at app//com.carrotsearch.randomizedtesting.rules.StatementAdapter.evaluate(StatementAdapter.java:36)
: at app//com.carrotsearch.randomizedtesting.ThreadLeakControl$StatementRunner.run(ThreadLeakControl.java:390)
: at app//com.carrotsearch.randomizedtesting.ThreadLeakControl.lambda$forkTimeoutingTask$0(ThreadLeakControl.java:850)
: at java.base@17.0.8.1/java.lang.Thread.run(Thread.java:857)
:
:
: FAILED: org.apache.solr.search.TestRecovery.testDropBuffered
:
: Error Message:
: java.lang.RuntimeException: mismatch: '28'!='27' @ versions/[0]
:
: Stack Trace:
: java.lang.RuntimeException: mismatch: '28'!='27' @ versions/[0]
: at __randomizedtesting.SeedInfo.seed([340F9724D936425B:10F3BC760C783747]:0)
: at app//org.apache.solr.SolrTestCaseJ4.assertJQ(SolrTestCaseJ4.java:1072)
: at app//org.apache.solr.SolrTestCaseJ4.assertJQ(SolrTestCaseJ4.java:1018)
: at app//org.apache.solr.search.TestRecovery.testDropBuffered(TestRecovery.java:909)
: at java.base@17.0.8.1/jdk.internal.reflect.NativeMethodAccessorImpl.invoke0(Native Method)
: at java.base@17.0.8.1/jdk.internal.reflect.NativeMethodAccessorImpl.invoke(NativeMethodAccessorImpl.java:77)
: at java.base@17.0.8.1/jdk.internal.reflect.DelegatingMethodAccessorImpl.invoke(DelegatingMethodAccessorImpl.java:43)
: at java.base@17.0.8.1/java.lang.reflect.Method.invoke(Method.java:568)
: at app//com.carrotsearch.randomizedtesting.RandomizedRunner.invoke(RandomizedRunner.java:1758)
: at app//com.carrotsearch.randomizedtesting.RandomizedRunner$8.evaluate(RandomizedRunner.java:946)
: at app//com.carrotsearch.randomizedtesting.RandomizedRunner$9.evaluate(RandomizedRunner.java:982)
: at app//com.carrotsearch.randomizedtesting.RandomizedRunner$10.evaluate(RandomizedRunner.java:996)
: at app//com.carrotsearch.randomizedtesting.rules.SystemPropertiesRestoreRule$1.evaluate(SystemPropertiesRestoreRule.java:80)
: at app//org.junit.rules.RunRules.evaluate(RunRules.java:20)
: at app//org.apache.lucene.tests.util.TestRuleSetupTeardownChained$1.evaluate(TestRuleSetupTeardownChained.java:48)
: at app//org.apache.lucene.tests.util.AbstractBeforeAfterRule$1.evaluate(AbstractBeforeAfterRule.java:43)
: at app//org.apache.lucene.tests.util.TestRuleThreadAndTestName$1.evaluate(TestRuleThreadAndTestName.java:45)
: at app//org.apache.lucene.tests.util.TestRuleIgnoreAfterMaxFailures$1.evaluate(TestRuleIgnoreAfterMaxFailures.java:60)
: at app//org.apache.lucene.tests.util.TestRuleMarkFailure$1.evaluate(TestRuleMarkFailure.java:44)
: at app//org.junit.rules.RunRules.evaluate(RunRules.java:20)
: at app//com.carrotsearch.randomizedtesting.rules.StatementAdapter.evaluate(StatementAdapter.java:36)
: at app//com.carrotsearch.randomizedtesting.ThreadLeakControl$StatementRunner.run(ThreadLeakControl.java:390)
: at app//com.carrotsearch.randomizedtesting.ThreadLeakControl.forkTimeoutingTask(ThreadLeakControl.java:843)
: at app//com.carrotsearch.randomizedtesting.ThreadLeakControl$3.evaluate(ThreadLeakControl.java:490)
: at app//com.carrotsearch.randomizedtesting.RandomizedRunner.runSingleTest(RandomizedRunner.java:955)
: at app//com.carrotsearch.randomizedtesting.RandomizedRunner$5.evaluate(RandomizedRunner.java:840)
: at app//com.carrotsearch.randomizedtesting.RandomizedRunner$6.evaluate(RandomizedRunner.java:891)
: at app//com.carrotsearch.randomizedtesting.RandomizedRunner$7.evaluate(RandomizedRunner.java:902)
: at app//com.carrotsearch.randomizedtesting.rules.StatementAdapter.evaluate(StatementAdapter.java:36)
: at app//com.carrotsearch.randomizedtesting.rules.StatementAdapter.evaluate(StatementAdapter.java:36)
: at app//org.apache.lucene.tests.util.AbstractBeforeAfterRule$1.evaluate(AbstractBeforeAfterRule.java:43)
: at app//com.carrotsearch.randomizedtesting.rules.SystemPropertiesRestoreRule$1.evaluate(SystemPropertiesRestoreRule.java:80)
: at app//org.junit.rules.RunRules.evaluate(RunRules.java:20)
: at app//org.apache.lucene.tests.util.AbstractBeforeAfterRule$1.evaluate(AbstractBeforeAfterRule.java:43)
: at app//com.carrotsearch.randomizedtesting.rules.StatementAdapter.evaluate(StatementAdapter.java:36)
: at app//org.apache.lucene.tests.util.TestRuleStoreClassName$1.evaluate(TestRuleStoreClassName.java:38)
: at app//com.carrotsearch.randomizedtesting.rules.NoShadowingOrOverridesOnMethodsRule$1.evaluate(NoShadowingOrOverridesOnMethodsRule.java:40)
: at app//com.carrotsearch.randomizedtesting.rules.NoShadowingOrOverridesOnMethodsRule$1.evaluate(NoShadowingOrOverridesOnMethodsRule.java:40)
: at app//com.carrotsearch.randomizedtesting.rules.StatementAdapter.evaluate(StatementAdapter.java:36)
: at app//com.carrotsearch.randomizedtesting.rules.StatementAdapter.evaluate(StatementAdapter.java:36)
: at app//org.apache.lucene.tests.util.TestRuleAssertionsRequired$1.evaluate(TestRuleAssertionsRequired.java:53)
: at app//org.apache.lucene.tests.util.AbstractBeforeAfterRule$1.evaluate(AbstractBeforeAfterRule.java:43)
: at app//org.apache.lucene.tests.util.TestRuleMarkFailure$1.evaluate(TestRuleMarkFailure.java:44)
: at app//org.apache.lucene.tests.util.TestRuleIgnoreAfterMaxFailures$1.evaluate(TestRuleIgnoreAfterMaxFailures.java:60)
: at app//org.apache.lucene.tests.util.TestRuleIgnoreTestSuites$1.evaluate(TestRuleIgnoreTestSuites.java:47)
: at app//org.junit.rules.RunRules.evaluate(RunRules.java:20)
: at app//com.carrotsearch.randomizedtesting.rules.StatementAdapter.evaluate(StatementAdapter.java:36)
: at app//com.carrotsearch.randomizedtesting.ThreadLeakControl$StatementRunner.run(ThreadLeakControl.java:390)
: at app//com.carrotsearch.randomizedtesting.ThreadLeakControl.lambda$forkTimeoutingTask$0(ThreadLeakControl.java:850)
: at java.base@17.0.8.1/java.lang.Thread.run(Thread.java:857)
:
:
: FAILED: org.apache.solr.security.BasicAuthIntegrationTest.classMethod
:
: Error Message:
: com.carrotsearch.randomizedtesting.ThreadLeakError: There are still zombie threads that couldn't be terminated:
: 1) Thread[id=21226, name=file lock watchdog, state=WAITING, group=main]
: at java.base/java.lang.Object.waitImpl(Native Method)
: at java.base/java.lang.Object.wait(Object.java:251)
: at java.base/java.lang.Object.wait(Object.java:190)
: at java.base/java.util.TimerThread.mainLoop(Timer.java:563)
: at java.base/java.util.TimerThread.run(Timer.java:542)
:
: Stack Trace:
: com.carrotsearch.randomizedtesting.ThreadLeakError: There are still zombie threads that couldn't be terminated:
: 1) Thread[id=21226, name=file lock watchdog, state=WAITING, group=main]
: at java.base/java.lang.Object.waitImpl(Native Method)
: at java.base/java.lang.Object.wait(Object.java:251)
: at java.base/java.lang.Object.wait(Object.java:190)
: at java.base/java.util.TimerThread.mainLoop(Timer.java:563)
: at java.base/java.util.TimerThread.run(Timer.java:542)
: at __randomizedtesting.SeedInfo.seed([340F9724D936425B]:0)
:
:
: FAILED: org.apache.solr.security.BasicAuthIntegrationTest.classMethod
:
: Error Message:
: com.carrotsearch.randomizedtesting.ThreadLeakError: 1 thread leaked from SUITE scope at org.apache.solr.security.BasicAuthIntegrationTest:
: 1) Thread[id=151, name=file lock watchdog, state=TIMED_WAITING, group=main]
: at java.base/java.lang.Object.waitImpl(Native Method)
: at java.base/java.lang.Object.wait(Object.java:251)
: at java.base/java.lang.Object.wait(Object.java:219)
: at java.base/java.util.TimerThread.mainLoop(Timer.java:599)
: at java.base/java.util.TimerThread.run(Timer.java:542)
:
: Stack Trace:
: com.carrotsearch.randomizedtesting.ThreadLeakError: 1 thread leaked from SUITE scope at org.apache.solr.security.BasicAuthIntegrationTest:
: 1) Thread[id=151, name=file lock watchdog, state=TIMED_WAITING, group=main]
: at java.base/java.lang.Object.waitImpl(Native Method)
: at java.base/java.lang.Object.wait(Object.java:251)
: at java.base/java.lang.Object.wait(Object.java:219)
: at java.base/java.util.TimerThread.mainLoop(Timer.java:599)
: at java.base/java.util.TimerThread.run(Timer.java:542)
: at __randomizedtesting.SeedInfo.seed([340F9724D936425B]:0)
:
:
: FAILED: org.apache.solr.security.BasicAuthIntegrationTest.classMethod
:
: Error Message:
: com.carrotsearch.randomizedtesting.ThreadLeakError: 1 thread leaked from SUITE scope at org.apache.solr.security.BasicAuthIntegrationTest:
: 1) Thread[id=21226, name=file lock watchdog, state=TIMED_WAITING, group=main]
: at java.base/java.lang.Object.waitImpl(Native Method)
: at java.base/java.lang.Object.wait(Object.java:251)
: at java.base/java.lang.Object.wait(Object.java:219)
: at java.base/java.util.TimerThread.mainLoop(Timer.java:599)
: at java.base/java.util.TimerThread.run(Timer.java:542)
:
: Stack Trace:
: com.carrotsearch.randomizedtesting.ThreadLeakError: 1 thread leaked from SUITE scope at org.apache.solr.security.BasicAuthIntegrationTest:
: 1) Thread[id=21226, name=file lock watchdog, state=TIMED_WAITING, group=main]
: at java.base/java.lang.Object.waitImpl(Native Method)
: at java.base/java.lang.Object.wait(Object.java:251)
: at java.base/java.lang.Object.wait(Object.java:219)
: at java.base/java.util.TimerThread.mainLoop(Timer.java:599)
: at java.base/java.util.TimerThread.run(Timer.java:542)
: at __randomizedtesting.SeedInfo.seed([340F9724D936425B]:0)
:
:
: FAILED: org.apache.solr.security.BasicAuthIntegrationTest.classMethod
:
: Error Message:
: com.carrotsearch.randomizedtesting.ThreadLeakError: There are still zombie threads that couldn't be terminated:
: 1) Thread[id=151, name=file lock watchdog, state=WAITING, group=main]
: at java.base/java.lang.Object.waitImpl(Native Method)
: at java.base/java.lang.Object.wait(Object.java:251)
: at java.base/java.lang.Object.wait(Object.java:190)
: at java.base/java.util.TimerThread.mainLoop(Timer.java:563)
: at java.base/java.util.TimerThread.run(Timer.java:542)
:
: Stack Trace:
: com.carrotsearch.randomizedtesting.ThreadLeakError: There are still zombie threads that couldn't be terminated:
: 1) Thread[id=151, name=file lock watchdog, state=WAITING, group=main]
: at java.base/java.lang.Object.waitImpl(Native Method)
: at java.base/java.lang.Object.wait(Object.java:251)
: at java.base/java.lang.Object.wait(Object.java:190)
: at java.base/java.util.TimerThread.mainLoop(Timer.java:563)
: at java.base/java.util.TimerThread.run(Timer.java:542)
: at __randomizedtesting.SeedInfo.seed([340F9724D936425B]:0)
:
:
: FAILED: org.apache.solr.security.BasicAuthIntegrationTest.classMethod
:
: Error Message:
: com.carrotsearch.randomizedtesting.ThreadLeakError: There are still zombie threads that couldn't be terminated:
: 1) Thread[id=157, name=file lock watchdog, state=WAITING, group=main]
: at java.base/java.lang.Object.waitImpl(Native Method)
: at java.base/java.lang.Object.wait(Object.java:251)
: at java.base/java.lang.Object.wait(Object.java:190)
: at java.base/java.util.TimerThread.mainLoop(Timer.java:563)
: at java.base/java.util.TimerThread.run(Timer.java:542)
:
: Stack Trace:
: com.carrotsearch.randomizedtesting.ThreadLeakError: There are still zombie threads that couldn't be terminated:
: 1) Thread[id=157, name=file lock watchdog, state=WAITING, group=main]
: at java.base/java.lang.Object.waitImpl(Native Method)
: at java.base/java.lang.Object.wait(Object.java:251)
: at java.base/java.lang.Object.wait(Object.java:190)
: at java.base/java.util.TimerThread.mainLoop(Timer.java:563)
: at java.base/java.util.TimerThread.run(Timer.java:542)
: at __randomizedtesting.SeedInfo.seed([340F9724D936425B]:0)
:
:
: FAILED: org.apache.solr.security.BasicAuthIntegrationTest.classMethod
:
: Error Message:
: com.carrotsearch.randomizedtesting.ThreadLeakError: 1 thread leaked from SUITE scope at org.apache.solr.security.BasicAuthIntegrationTest:
: 1) Thread[id=157, name=file lock watchdog, state=TIMED_WAITING, group=main]
: at java.base/java.lang.Object.waitImpl(Native Method)
: at java.base/java.lang.Object.wait(Object.java:251)
: at java.base/java.lang.Object.wait(Object.java:219)
: at java.base/java.util.TimerThread.mainLoop(Timer.java:599)
: at java.base/java.util.TimerThread.run(Timer.java:542)
:
: Stack Trace:
: com.carrotsearch.randomizedtesting.ThreadLeakError: 1 thread leaked from SUITE scope at org.apache.solr.security.BasicAuthIntegrationTest:
: 1) Thread[id=157, name=file lock watchdog, state=TIMED_WAITING, group=main]
: at java.base/java.lang.Object.waitImpl(Native Method)
: at java.base/java.lang.Object.wait(Object.java:251)
: at java.base/java.lang.Object.wait(Object.java:219)
: at java.base/java.util.TimerThread.mainLoop(Timer.java:599)
: at java.base/java.util.TimerThread.run(Timer.java:542)
: at __randomizedtesting.SeedInfo.seed([340F9724D936425B]:0)
:
:
: FAILED: org.apache.solr.security.hadoop.TestDelegationWithHadoopAuth.classMethod
:
: Error Message:
: com.carrotsearch.randomizedtesting.ThreadLeakError: There are still zombie threads that couldn't be terminated:
: 1) Thread[id=171, name=file lock watchdog, state=WAITING, group=main]
: at java.base/java.lang.Object.waitImpl(Native Method)
: at java.base/java.lang.Object.wait(Object.java:251)
: at java.base/java.lang.Object.wait(Object.java:190)
: at java.base/java.util.TimerThread.mainLoop(Timer.java:563)
: at java.base/java.util.TimerThread.run(Timer.java:542)
:
: Stack Trace:
: com.carrotsearch.randomizedtesting.ThreadLeakError: There are still zombie threads that couldn't be terminated:
: 1) Thread[id=171, name=file lock watchdog, state=WAITING, group=main]
: at java.base/java.lang.Object.waitImpl(Native Method)
: at java.base/java.lang.Object.wait(Object.java:251)
: at java.base/java.lang.Object.wait(Object.java:190)
: at java.base/java.util.TimerThread.mainLoop(Timer.java:563)
: at java.base/java.util.TimerThread.run(Timer.java:542)
: at __randomizedtesting.SeedInfo.seed([340F9724D936425B]:0)
:
:
: FAILED: org.apache.solr.security.hadoop.TestDelegationWithHadoopAuth.classMethod
:
: Error Message:
: com.carrotsearch.randomizedtesting.ThreadLeakError: 1 thread leaked from SUITE scope at org.apache.solr.security.hadoop.TestDelegationWithHadoopAuth:
: 1) Thread[id=171, name=file lock watchdog, state=TIMED_WAITING, group=main]
: at java.base/java.lang.Object.waitImpl(Native Method)
: at java.base/java.lang.Object.wait(Object.java:251)
: at java.base/java.lang.Object.wait(Object.java:219)
: at java.base/java.util.TimerThread.mainLoop(Timer.java:599)
: at java.base/java.util.TimerThread.run(Timer.java:542)
:
: Stack Trace:
: com.carrotsearch.randomizedtesting.ThreadLeakError: 1 thread leaked from SUITE scope at org.apache.solr.security.hadoop.TestDelegationWithHadoopAuth:
: 1) Thread[id=171, name=file lock watchdog, state=TIMED_WAITING, group=main]
: at java.base/java.lang.Object.waitImpl(Native Method)
: at java.base/java.lang.Object.wait(Object.java:251)
: at java.base/java.lang.Object.wait(Object.java:219)
: at java.base/java.util.TimerThread.mainLoop(Timer.java:599)
: at java.base/java.util.TimerThread.run(Timer.java:542)
: at __randomizedtesting.SeedInfo.seed([340F9724D936425B]:0)
:
:
: FAILED: org.apache.solr.security.hadoop.TestSolrCloudWithHadoopAuthPlugin.classMethod
:
: Error Message:
: com.carrotsearch.randomizedtesting.ThreadLeakError: 1 thread leaked from SUITE scope at org.apache.solr.security.hadoop.TestSolrCloudWithHadoopAuthPlugin:
: 1) Thread[id=42, name=file lock watchdog, state=TIMED_WAITING, group=main]
: at java.base/java.lang.Object.waitImpl(Native Method)
: at java.base/java.lang.Object.wait(Object.java:251)
: at java.base/java.lang.Object.wait(Object.java:219)
: at java.base/java.util.TimerThread.mainLoop(Timer.java:599)
: at java.base/java.util.TimerThread.run(Timer.java:542)
:
: Stack Trace:
: com.carrotsearch.randomizedtesting.ThreadLeakError: 1 thread leaked from SUITE scope at org.apache.solr.security.hadoop.TestSolrCloudWithHadoopAuthPlugin:
: 1) Thread[id=42, name=file lock watchdog, state=TIMED_WAITING, group=main]
: at java.base/java.lang.Object.waitImpl(Native Method)
: at java.base/java.lang.Object.wait(Object.java:251)
: at java.base/java.lang.Object.wait(Object.java:219)
: at java.base/java.util.TimerThread.mainLoop(Timer.java:599)
: at java.base/java.util.TimerThread.run(Timer.java:542)
: at __randomizedtesting.SeedInfo.seed([340F9724D936425B]:0)
:
:
: FAILED: org.apache.solr.security.hadoop.TestSolrCloudWithHadoopAuthPlugin.classMethod
:
: Error Message:
: com.carrotsearch.randomizedtesting.ThreadLeakError: There are still zombie threads that couldn't be terminated:
: 1) Thread[id=42, name=file lock watchdog, state=WAITING, group=main]
: at java.base/java.lang.Object.waitImpl(Native Method)
: at java.base/java.lang.Object.wait(Object.java:251)
: at java.base/java.lang.Object.wait(Object.java:190)
: at java.base/java.util.TimerThread.mainLoop(Timer.java:563)
: at java.base/java.util.TimerThread.run(Timer.java:542)
:
: Stack Trace:
: com.carrotsearch.randomizedtesting.ThreadLeakError: There are still zombie threads that couldn't be terminated:
: 1) Thread[id=42, name=file lock watchdog, state=WAITING, group=main]
: at java.base/java.lang.Object.waitImpl(Native Method)
: at java.base/java.lang.Object.wait(Object.java:251)
: at java.base/java.lang.Object.wait(Object.java:190)
: at java.base/java.util.TimerThread.mainLoop(Timer.java:563)
: at java.base/java.util.TimerThread.run(Timer.java:542)
: at __randomizedtesting.SeedInfo.seed([340F9724D936425B]:0)
:
:
: FAILED: org.apache.solr.security.jwt.JWTAuthPluginIntegrationTest.classMethod
:
: Error Message:
: com.carrotsearch.randomizedtesting.ThreadLeakError: There are still zombie threads that couldn't be terminated:
: 1) Thread[id=532, name=file lock watchdog, state=WAITING, group=main]
: at java.base/java.lang.Object.waitImpl(Native Method)
: at java.base/java.lang.Object.wait(Object.java:251)
: at java.base/java.lang.Object.wait(Object.java:190)
: at java.base/java.util.TimerThread.mainLoop(Timer.java:563)
: at java.base/java.util.TimerThread.run(Timer.java:542)
:
: Stack Trace:
: com.carrotsearch.randomizedtesting.ThreadLeakError: There are still zombie threads that couldn't be terminated:
: 1) Thread[id=532, name=file lock watchdog, state=WAITING, group=main]
: at java.base/java.lang.Object.waitImpl(Native Method)
: at java.base/java.lang.Object.wait(Object.java:251)
: at java.base/java.lang.Object.wait(Object.java:190)
: at java.base/java.util.TimerThread.mainLoop(Timer.java:563)
: at java.base/java.util.TimerThread.run(Timer.java:542)
: at __randomizedtesting.SeedInfo.seed([340F9724D936425B]:0)
:
:
: FAILED: org.apache.solr.security.jwt.JWTAuthPluginIntegrationTest.classMethod
:
: Error Message:
: com.carrotsearch.randomizedtesting.ThreadLeakError: 1 thread leaked from SUITE scope at org.apache.solr.security.jwt.JWTAuthPluginIntegrationTest:
: 1) Thread[id=532, name=file lock watchdog, state=TIMED_WAITING, group=main]
: at java.base/java.lang.Object.waitImpl(Native Method)
: at java.base/java.lang.Object.wait(Object.java:251)
: at java.base/java.lang.Object.wait(Object.java:219)
: at java.base/java.util.TimerThread.mainLoop(Timer.java:599)
: at java.base/java.util.TimerThread.run(Timer.java:542)
:
: Stack Trace:
: com.carrotsearch.randomizedtesting.ThreadLeakError: 1 thread leaked from SUITE scope at org.apache.solr.security.jwt.JWTAuthPluginIntegrationTest:
: 1) Thread[id=532, name=file lock watchdog, state=TIMED_WAITING, group=main]
: at java.base/java.lang.Object.waitImpl(Native Method)
: at java.base/java.lang.Object.wait(Object.java:251)
: at java.base/java.lang.Object.wait(Object.java:219)
: at java.base/java.util.TimerThread.mainLoop(Timer.java:599)
: at java.base/java.util.TimerThread.run(Timer.java:542)
: at __randomizedtesting.SeedInfo.seed([340F9724D936425B]:0)
:
:
: FAILED: org.apache.solr.security.jwt.JWTAuthPluginIntegrationTest.classMethod
:
: Error Message:
: com.carrotsearch.randomizedtesting.ThreadLeakError: There are still zombie threads that couldn't be terminated:
: 1) Thread[id=381, name=file lock watchdog, state=WAITING, group=main]
: at java.base/java.lang.Object.waitImpl(Native Method)
: at java.base/java.lang.Object.wait(Object.java:251)
: at java.base/java.lang.Object.wait(Object.java:190)
: at java.base/java.util.TimerThread.mainLoop(Timer.java:563)
: at java.base/java.util.TimerThread.run(Timer.java:542)
:
: Stack Trace:
: com.carrotsearch.randomizedtesting.ThreadLeakError: There are still zombie threads that couldn't be terminated:
: 1) Thread[id=381, name=file lock watchdog, state=WAITING, group=main]
: at java.base/java.lang.Object.waitImpl(Native Method)
: at java.base/java.lang.Object.wait(Object.java:251)
: at java.base/java.lang.Object.wait(Object.java:190)
: at java.base/java.util.TimerThread.mainLoop(Timer.java:563)
: at java.base/java.util.TimerThread.run(Timer.java:542)
: at __randomizedtesting.SeedInfo.seed([340F9724D936425B]:0)
:
:
: FAILED: org.apache.solr.security.jwt.JWTAuthPluginIntegrationTest.classMethod
:
: Error Message:
: com.carrotsearch.randomizedtesting.ThreadLeakError: 1 thread leaked from SUITE scope at org.apache.solr.security.jwt.JWTAuthPluginIntegrationTest:
: 1) Thread[id=381, name=file lock watchdog, state=TIMED_WAITING, group=main]
: at java.base/java.lang.Object.waitImpl(Native Method)
: at java.base/java.lang.Object.wait(Object.java:251)
: at java.base/java.lang.Object.wait(Object.java:219)
: at java.base/java.util.TimerThread.mainLoop(Timer.java:599)
: at java.base/java.util.TimerThread.run(Timer.java:542)
:
: Stack Trace:
: com.carrotsearch.randomizedtesting.ThreadLeakError: 1 thread leaked from SUITE scope at org.apache.solr.security.jwt.JWTAuthPluginIntegrationTest:
: 1) Thread[id=381, name=file lock watchdog, state=TIMED_WAITING, group=main]
: at java.base/java.lang.Object.waitImpl(Native Method)
: at java.base/java.lang.Object.wait(Object.java:251)
: at java.base/java.lang.Object.wait(Object.java:219)
: at java.base/java.util.TimerThread.mainLoop(Timer.java:599)
: at java.base/java.util.TimerThread.run(Timer.java:542)
: at __randomizedtesting.SeedInfo.seed([340F9724D936425B]:0)
:
:
: FAILED: org.apache.solr.security.jwt.JWTIssuerConfigTest.classMethod
:
: Error Message:
: com.carrotsearch.randomizedtesting.ThreadLeakError: 1 thread leaked from SUITE scope at org.apache.solr.security.jwt.JWTIssuerConfigTest:
: 1) Thread[id=40, name=file lock watchdog, state=TIMED_WAITING, group=main]
: at java.base/java.lang.Object.waitImpl(Native Method)
: at java.base/java.lang.Object.wait(Object.java:251)
: at java.base/java.lang.Object.wait(Object.java:219)
: at java.base/java.util.TimerThread.mainLoop(Timer.java:599)
: at java.base/java.util.TimerThread.run(Timer.java:542)
:
: Stack Trace:
: com.carrotsearch.randomizedtesting.ThreadLeakError: 1 thread leaked from SUITE scope at org.apache.solr.security.jwt.JWTIssuerConfigTest:
: 1) Thread[id=40, name=file lock watchdog, state=TIMED_WAITING, group=main]
: at java.base/java.lang.Object.waitImpl(Native Method)
: at java.base/java.lang.Object.wait(Object.java:251)
: at java.base/java.lang.Object.wait(Object.java:219)
: at java.base/java.util.TimerThread.mainLoop(Timer.java:599)
: at java.base/java.util.TimerThread.run(Timer.java:542)
: at __randomizedtesting.SeedInfo.seed([340F9724D936425B]:0)
:
:
: FAILED: org.apache.solr.security.jwt.JWTIssuerConfigTest.classMethod
:
: Error Message:
: com.carrotsearch.randomizedtesting.ThreadLeakError: There are still zombie threads that couldn't be terminated:
: 1) Thread[id=40, name=file lock watchdog, state=WAITING, group=main]
: at java.base/java.lang.Object.waitImpl(Native Method)
: at java.base/java.lang.Object.wait(Object.java:251)
: at java.base/java.lang.Object.wait(Object.java:190)
: at java.base/java.util.TimerThread.mainLoop(Timer.java:563)
: at java.base/java.util.TimerThread.run(Timer.java:542)
:
: Stack Trace:
: com.carrotsearch.randomizedtesting.ThreadLeakError: There are still zombie threads that couldn't be terminated:
: 1) Thread[id=40, name=file lock watchdog, state=WAITING, group=main]
: at java.base/java.lang.Object.waitImpl(Native Method)
: at java.base/java.lang.Object.wait(Object.java:251)
: at java.base/java.lang.Object.wait(Object.java:190)
: at java.base/java.util.TimerThread.mainLoop(Timer.java:563)
: at java.base/java.util.TimerThread.run(Timer.java:542)
: at __randomizedtesting.SeedInfo.seed([340F9724D936425B]:0)
:
:
: FAILED: org.apache.solr.util.hll.BigEndianAscendingWordDeserializerTest.classMethod
:
: Error Message:
: com.carrotsearch.randomizedtesting.ThreadLeakError: There are still zombie threads that couldn't be terminated:
: 1) Thread[id=14706, name=file lock watchdog, state=WAITING, group=main]
: at java.base/java.lang.Object.waitImpl(Native Method)
: at java.base/java.lang.Object.wait(Object.java:251)
: at java.base/java.lang.Object.wait(Object.java:190)
: at java.base/java.util.TimerThread.mainLoop(Timer.java:563)
: at java.base/java.util.TimerThread.run(Timer.java:542)
:
: Stack Trace:
: com.carrotsearch.randomizedtesting.ThreadLeakError: There are still zombie threads that couldn't be terminated:
: 1) Thread[id=14706, name=file lock watchdog, state=WAITING, group=main]
: at java.base/java.lang.Object.waitImpl(Native Method)
: at java.base/java.lang.Object.wait(Object.java:251)
: at java.base/java.lang.Object.wait(Object.java:190)
: at java.base/java.util.TimerThread.mainLoop(Timer.java:563)
: at java.base/java.util.TimerThread.run(Timer.java:542)
: at __randomizedtesting.SeedInfo.seed([340F9724D936425B]:0)
:
:
: FAILED: org.apache.solr.util.hll.BigEndianAscendingWordDeserializerTest.classMethod
:
: Error Message:
: com.carrotsearch.randomizedtesting.ThreadLeakError: 1 thread leaked from SUITE scope at org.apache.solr.util.hll.BigEndianAscendingWordDeserializerTest:
: 1) Thread[id=14706, name=file lock watchdog, state=TIMED_WAITING, group=main]
: at java.base/java.lang.Object.waitImpl(Native Method)
: at java.base/java.lang.Object.wait(Object.java:251)
: at java.base/java.lang.Object.wait(Object.java:219)
: at java.base/java.util.TimerThread.mainLoop(Timer.java:599)
: at java.base/java.util.TimerThread.run(Timer.java:542)
:
: Stack Trace:
: com.carrotsearch.randomizedtesting.ThreadLeakError: 1 thread leaked from SUITE scope at org.apache.solr.util.hll.BigEndianAscendingWordDeserializerTest:
: 1) Thread[id=14706, name=file lock watchdog, state=TIMED_WAITING, group=main]
: at java.base/java.lang.Object.waitImpl(Native Method)
: at java.base/java.lang.Object.wait(Object.java:251)
: at java.base/java.lang.Object.wait(Object.java:219)
: at java.base/java.util.TimerThread.mainLoop(Timer.java:599)
: at java.base/java.util.TimerThread.run(Timer.java:542)
: at __randomizedtesting.SeedInfo.seed([340F9724D936425B]:0)
:
:
: FAILED: org.apache.solr.search.TestRecovery.testBuffering
:
: Error Message:
: java.lang.RuntimeException: mismatch: '-68'!='61' @ versions/[0]
:
: Stack Trace:
: java.lang.RuntimeException: mismatch: '-68'!='61' @ versions/[0]
: at __randomizedtesting.SeedInfo.seed([340F9724D936425B:29E1390F786FE370]:0)
: at app//org.apache.solr.SolrTestCaseJ4.assertJQ(SolrTestCaseJ4.java:1072)
: at app//org.apache.solr.SolrTestCaseJ4.assertJQ(SolrTestCaseJ4.java:1018)
: at app//org.apache.solr.search.TestRecovery.testBuffering(TestRecovery.java:739)
: at java.base@17.0.8.1/jdk.internal.reflect.NativeMethodAccessorImpl.invoke0(Native Method)
: at java.base@17.0.8.1/jdk.internal.reflect.NativeMethodAccessorImpl.invoke(NativeMethodAccessorImpl.java:77)
: at java.base@17.0.8.1/jdk.internal.reflect.DelegatingMethodAccessorImpl.invoke(DelegatingMethodAccessorImpl.java:43)
: at java.base@17.0.8.1/java.lang.reflect.Method.invoke(Method.java:568)
: at app//com.carrotsearch.randomizedtesting.RandomizedRunner.invoke(RandomizedRunner.java:1758)
: at app//com.carrotsearch.randomizedtesting.RandomizedRunner$8.evaluate(RandomizedRunner.java:946)
: at app//com.carrotsearch.randomizedtesting.RandomizedRunner$9.evaluate(RandomizedRunner.java:982)
: at app//com.carrotsearch.randomizedtesting.RandomizedRunner$10.evaluate(RandomizedRunner.java:996)
: at app//com.carrotsearch.randomizedtesting.rules.SystemPropertiesRestoreRule$1.evaluate(SystemPropertiesRestoreRule.java:80)
: at app//org.junit.rules.RunRules.evaluate(RunRules.java:20)
: at app//org.apache.lucene.tests.util.TestRuleSetupTeardownChained$1.evaluate(TestRuleSetupTeardownChained.java:48)
: at app//org.apache.lucene.tests.util.AbstractBeforeAfterRule$1.evaluate(AbstractBeforeAfterRule.java:43)
: at app//org.apache.lucene.tests.util.TestRuleThreadAndTestName$1.evaluate(TestRuleThreadAndTestName.java:45)
: at app//org.apache.lucene.tests.util.TestRuleIgnoreAfterMaxFailures$1.evaluate(TestRuleIgnoreAfterMaxFailures.java:60)
: at app//org.apache.lucene.tests.util.TestRuleMarkFailure$1.evaluate(TestRuleMarkFailure.java:44)
: at app//org.junit.rules.RunRules.evaluate(RunRules.java:20)
: at app//com.carrotsearch.randomizedtesting.rules.StatementAdapter.evaluate(StatementAdapter.java:36)
: at app//com.carrotsearch.randomizedtesting.ThreadLeakControl$StatementRunner.run(ThreadLeakControl.java:390)
: at app//com.carrotsearch.randomizedtesting.ThreadLeakControl.forkTimeoutingTask(ThreadLeakControl.java:843)
: at app//com.carrotsearch.randomizedtesting.ThreadLeakControl$3.evaluate(ThreadLeakControl.java:490)
: at app//com.carrotsearch.randomizedtesting.RandomizedRunner.runSingleTest(RandomizedRunner.java:955)
: at app//com.carrotsearch.randomizedtesting.RandomizedRunner$5.evaluate(RandomizedRunner.java:840)
: at app//com.carrotsearch.randomizedtesting.RandomizedRunner$6.evaluate(RandomizedRunner.java:891)
: at app//com.carrotsearch.randomizedtesting.RandomizedRunner$7.evaluate(RandomizedRunner.java:902)
: at app//com.carrotsearch.randomizedtesting.rules.StatementAdapter.evaluate(StatementAdapter.java:36)
: at app//com.carrotsearch.randomizedtesting.rules.StatementAdapter.evaluate(StatementAdapter.java:36)
: at app//org.apache.lucene.tests.util.AbstractBeforeAfterRule$1.evaluate(AbstractBeforeAfterRule.java:43)
: at app//com.carrotsearch.randomizedtesting.rules.SystemPropertiesRestoreRule$1.evaluate(SystemPropertiesRestoreRule.java:80)
: at app//org.junit.rules.RunRules.evaluate(RunRules.java:20)
: at app//org.apache.lucene.tests.util.AbstractBeforeAfterRule$1.evaluate(AbstractBeforeAfterRule.java:43)
: at app//com.carrotsearch.randomizedtesting.rules.StatementAdapter.evaluate(StatementAdapter.java:36)
: at app//org.apache.lucene.tests.util.TestRuleStoreClassName$1.evaluate(TestRuleStoreClassName.java:38)
: at app//com.carrotsearch.randomizedtesting.rules.NoShadowingOrOverridesOnMethodsRule$1.evaluate(NoShadowingOrOverridesOnMethodsRule.java:40)
: at app//com.carrotsearch.randomizedtesting.rules.NoShadowingOrOverridesOnMethodsRule$1.evaluate(NoShadowingOrOverridesOnMethodsRule.java:40)
: at app//com.carrotsearch.randomizedtesting.rules.StatementAdapter.evaluate(StatementAdapter.java:36)
: at app//com.carrotsearch.randomizedtesting.rules.StatementAdapter.evaluate(StatementAdapter.java:36)
: at app//org.apache.lucene.tests.util.TestRuleAssertionsRequired$1.evaluate(TestRuleAssertionsRequired.java:53)
: at app//org.apache.lucene.tests.util.AbstractBeforeAfterRule$1.evaluate(AbstractBeforeAfterRule.java:43)
: at app//org.apache.lucene.tests.util.TestRuleMarkFailure$1.evaluate(TestRuleMarkFailure.java:44)
: at app//org.apache.lucene.tests.util.TestRuleIgnoreAfterMaxFailures$1.evaluate(TestRuleIgnoreAfterMaxFailures.java:60)
: at app//org.apache.lucene.tests.util.TestRuleIgnoreTestSuites$1.evaluate(TestRuleIgnoreTestSuites.java:47)
: at app//org.junit.rules.RunRules.evaluate(RunRules.java:20)
: at app//com.carrotsearch.randomizedtesting.rules.StatementAdapter.evaluate(StatementAdapter.java:36)
: at app//com.carrotsearch.randomizedtesting.ThreadLeakControl$StatementRunner.run(ThreadLeakControl.java:390)
: at app//com.carrotsearch.randomizedtesting.ThreadLeakControl.lambda$forkTimeoutingTask$0(ThreadLeakControl.java:850)
: at java.base@17.0.8.1/java.lang.Thread.run(Thread.java:857)
:
:
: FAILED: org.apache.solr.search.TestRecovery.testBuffering
:
: Error Message:
: java.lang.RuntimeException: mismatch: '-40'!='34' @ versions/[0]
:
: Stack Trace:
: java.lang.RuntimeException: mismatch: '-40'!='34' @ versions/[0]
: at __randomizedtesting.SeedInfo.seed([340F9724D936425B:29E1390F786FE370]:0)
: at app//org.apache.solr.SolrTestCaseJ4.assertJQ(SolrTestCaseJ4.java:1072)
: at app//org.apache.solr.SolrTestCaseJ4.assertJQ(SolrTestCaseJ4.java:1018)
: at app//org.apache.solr.search.TestRecovery.testBuffering(TestRecovery.java:739)
: at java.base@17.0.8.1/jdk.internal.reflect.NativeMethodAccessorImpl.invoke0(Native Method)
: at java.base@17.0.8.1/jdk.internal.reflect.NativeMethodAccessorImpl.invoke(NativeMethodAccessorImpl.java:77)
: at java.base@17.0.8.1/jdk.internal.reflect.DelegatingMethodAccessorImpl.invoke(DelegatingMethodAccessorImpl.java:43)
: at java.base@17.0.8.1/java.lang.reflect.Method.invoke(Method.java:568)
: at app//com.carrotsearch.randomizedtesting.RandomizedRunner.invoke(RandomizedRunner.java:1758)
: at app//com.carrotsearch.randomizedtesting.RandomizedRunner$8.evaluate(RandomizedRunner.java:946)
: at app//com.carrotsearch.randomizedtesting.RandomizedRunner$9.evaluate(RandomizedRunner.java:982)
: at app//com.carrotsearch.randomizedtesting.RandomizedRunner$10.evaluate(RandomizedRunner.java:996)
: at app//com.carrotsearch.randomizedtesting.rules.SystemPropertiesRestoreRule$1.evaluate(SystemPropertiesRestoreRule.java:80)
: at app//org.junit.rules.RunRules.evaluate(RunRules.java:20)
: at app//org.apache.lucene.tests.util.TestRuleSetupTeardownChained$1.evaluate(TestRuleSetupTeardownChained.java:48)
: at app//org.apache.lucene.tests.util.AbstractBeforeAfterRule$1.evaluate(AbstractBeforeAfterRule.java:43)
: at app//org.apache.lucene.tests.util.TestRuleThreadAndTestName$1.evaluate(TestRuleThreadAndTestName.java:45)
: at app//org.apache.lucene.tests.util.TestRuleIgnoreAfterMaxFailures$1.evaluate(TestRuleIgnoreAfterMaxFailures.java:60)
: at app//org.apache.lucene.tests.util.TestRuleMarkFailure$1.evaluate(TestRuleMarkFailure.java:44)
: at app//org.junit.rules.RunRules.evaluate(RunRules.java:20)
: at app//com.carrotsearch.randomizedtesting.rules.StatementAdapter.evaluate(StatementAdapter.java:36)
: at app//com.carrotsearch.randomizedtesting.ThreadLeakControl$StatementRunner.run(ThreadLeakControl.java:390)
: at app//com.carrotsearch.randomizedtesting.ThreadLeakControl.forkTimeoutingTask(ThreadLeakControl.java:843)
: at app//com.carrotsearch.randomizedtesting.ThreadLeakControl$3.evaluate(ThreadLeakControl.java:490)
: at app//com.carrotsearch.randomizedtesting.RandomizedRunner.runSingleTest(RandomizedRunner.java:955)
: at app//com.carrotsearch.randomizedtesting.RandomizedRunner$5.evaluate(RandomizedRunner.java:840)
: at app//com.carrotsearch.randomizedtesting.RandomizedRunner$6.evaluate(RandomizedRunner.java:891)
: at app//com.carrotsearch.randomizedtesting.RandomizedRunner$7.evaluate(RandomizedRunner.java:902)
: at app//com.carrotsearch.randomizedtesting.rules.StatementAdapter.evaluate(StatementAdapter.java:36)
: at app//com.carrotsearch.randomizedtesting.rules.StatementAdapter.evaluate(StatementAdapter.java:36)
: at app//org.apache.lucene.tests.util.AbstractBeforeAfterRule$1.evaluate(AbstractBeforeAfterRule.java:43)
: at app//com.carrotsearch.randomizedtesting.rules.SystemPropertiesRestoreRule$1.evaluate(SystemPropertiesRestoreRule.java:80)
: at app//org.junit.rules.RunRules.evaluate(RunRules.java:20)
: at app//org.apache.lucene.tests.util.AbstractBeforeAfterRule$1.evaluate(AbstractBeforeAfterRule.java:43)
: at app//com.carrotsearch.randomizedtesting.rules.StatementAdapter.evaluate(StatementAdapter.java:36)
: at app//org.apache.lucene.tests.util.TestRuleStoreClassName$1.evaluate(TestRuleStoreClassName.java:38)
: at app//com.carrotsearch.randomizedtesting.rules.NoShadowingOrOverridesOnMethodsRule$1.evaluate(NoShadowingOrOverridesOnMethodsRule.java:40)
: at app//com.carrotsearch.randomizedtesting.rules.NoShadowingOrOverridesOnMethodsRule$1.evaluate(NoShadowingOrOverridesOnMethodsRule.java:40)
: at app//com.carrotsearch.randomizedtesting.rules.StatementAdapter.evaluate(StatementAdapter.java:36)
: at app//com.carrotsearch.randomizedtesting.rules.StatementAdapter.evaluate(StatementAdapter.java:36)
: at app//org.apache.lucene.tests.util.TestRuleAssertionsRequired$1.evaluate(TestRuleAssertionsRequired.java:53)
: at app//org.apache.lucene.tests.util.AbstractBeforeAfterRule$1.evaluate(AbstractBeforeAfterRule.java:43)
: at app//org.apache.lucene.tests.util.TestRuleMarkFailure$1.evaluate(TestRuleMarkFailure.java:44)
: at app//org.apache.lucene.tests.util.TestRuleIgnoreAfterMaxFailures$1.evaluate(TestRuleIgnoreAfterMaxFailures.java:60)
: at app//org.apache.lucene.tests.util.TestRuleIgnoreTestSuites$1.evaluate(TestRuleIgnoreTestSuites.java:47)
: at app//org.junit.rules.RunRules.evaluate(RunRules.java:20)
: at app//com.carrotsearch.randomizedtesting.rules.StatementAdapter.evaluate(StatementAdapter.java:36)
: at app//com.carrotsearch.randomizedtesting.ThreadLeakControl$StatementRunner.run(ThreadLeakControl.java:390)
: at app//com.carrotsearch.randomizedtesting.ThreadLeakControl.lambda$forkTimeoutingTask$0(ThreadLeakControl.java:850)
: at java.base@17.0.8.1/java.lang.Thread.run(Thread.java:857)
:
:
: FAILED: org.apache.solr.search.TestRecovery.testBuffering
:
: Error Message:
: java.lang.RuntimeException: mismatch: '-68'!='62' @ versions/[0]
:
: Stack Trace:
: java.lang.RuntimeException: mismatch: '-68'!='62' @ versions/[0]
: at __randomizedtesting.SeedInfo.seed([340F9724D936425B:29E1390F786FE370]:0)
: at app//org.apache.solr.SolrTestCaseJ4.assertJQ(SolrTestCaseJ4.java:1072)
: at app//org.apache.solr.SolrTestCaseJ4.assertJQ(SolrTestCaseJ4.java:1018)
: at app//org.apache.solr.search.TestRecovery.testBuffering(TestRecovery.java:739)
: at java.base@17.0.8.1/jdk.internal.reflect.NativeMethodAccessorImpl.invoke0(Native Method)
: at java.base@17.0.8.1/jdk.internal.reflect.NativeMethodAccessorImpl.invoke(NativeMethodAccessorImpl.java:77)
: at java.base@17.0.8.1/jdk.internal.reflect.DelegatingMethodAccessorImpl.invoke(DelegatingMethodAccessorImpl.java:43)
: at java.base@17.0.8.1/java.lang.reflect.Method.invoke(Method.java:568)
: at app//com.carrotsearch.randomizedtesting.RandomizedRunner.invoke(RandomizedRunner.java:1758)
: at app//com.carrotsearch.randomizedtesting.RandomizedRunner$8.evaluate(RandomizedRunner.java:946)
: at app//com.carrotsearch.randomizedtesting.RandomizedRunner$9.evaluate(RandomizedRunner.java:982)
: at app//com.carrotsearch.randomizedtesting.RandomizedRunner$10.evaluate(RandomizedRunner.java:996)
: at app//com.carrotsearch.randomizedtesting.rules.SystemPropertiesRestoreRule$1.evaluate(SystemPropertiesRestoreRule.java:80)
: at app//org.junit.rules.RunRules.evaluate(RunRules.java:20)
: at app//org.apache.lucene.tests.util.TestRuleSetupTeardownChained$1.evaluate(TestRuleSetupTeardownChained.java:48)
: at app//org.apache.lucene.tests.util.AbstractBeforeAfterRule$1.evaluate(AbstractBeforeAfterRule.java:43)
: at app//org.apache.lucene.tests.util.TestRuleThreadAndTestName$1.evaluate(TestRuleThreadAndTestName.java:45)
: at app//org.apache.lucene.tests.util.TestRuleIgnoreAfterMaxFailures$1.evaluate(TestRuleIgnoreAfterMaxFailures.java:60)
: at app//org.apache.lucene.tests.util.TestRuleMarkFailure$1.evaluate(TestRuleMarkFailure.java:44)
: at app//org.junit.rules.RunRules.evaluate(RunRules.java:20)
: at app//com.carrotsearch.randomizedtesting.rules.StatementAdapter.evaluate(StatementAdapter.java:36)
: at app//com.carrotsearch.randomizedtesting.ThreadLeakControl$StatementRunner.run(ThreadLeakControl.java:390)
: at app//com.carrotsearch.randomizedtesting.ThreadLeakControl.forkTimeoutingTask(ThreadLeakControl.java:843)
: at app//com.carrotsearch.randomizedtesting.ThreadLeakControl$3.evaluate(ThreadLeakControl.java:490)
: at app//com.carrotsearch.randomizedtesting.RandomizedRunner.runSingleTest(RandomizedRunner.java:955)
: at app//com.carrotsearch.randomizedtesting.RandomizedRunner$5.evaluate(RandomizedRunner.java:840)
: at app//com.carrotsearch.randomizedtesting.RandomizedRunner$6.evaluate(RandomizedRunner.java:891)
: at app//com.carrotsearch.randomizedtesting.RandomizedRunner$7.evaluate(RandomizedRunner.java:902)
: at app//com.carrotsearch.randomizedtesting.rules.StatementAdapter.evaluate(StatementAdapter.java:36)
: at app//com.carrotsearch.randomizedtesting.rules.StatementAdapter.evaluate(StatementAdapter.java:36)
: at app//org.apache.lucene.tests.util.AbstractBeforeAfterRule$1.evaluate(AbstractBeforeAfterRule.java:43)
: at app//com.carrotsearch.randomizedtesting.rules.SystemPropertiesRestoreRule$1.evaluate(SystemPropertiesRestoreRule.java:80)
: at app//org.junit.rules.RunRules.evaluate(RunRules.java:20)
: at app//org.apache.lucene.tests.util.AbstractBeforeAfterRule$1.evaluate(AbstractBeforeAfterRule.java:43)
: at app//com.carrotsearch.randomizedtesting.rules.StatementAdapter.evaluate(StatementAdapter.java:36)
: at app//org.apache.lucene.tests.util.TestRuleStoreClassName$1.evaluate(TestRuleStoreClassName.java:38)
: at app//com.carrotsearch.randomizedtesting.rules.NoShadowingOrOverridesOnMethodsRule$1.evaluate(NoShadowingOrOverridesOnMethodsRule.java:40)
: at app//com.carrotsearch.randomizedtesting.rules.NoShadowingOrOverridesOnMethodsRule$1.evaluate(NoShadowingOrOverridesOnMethodsRule.java:40)
: at app//com.carrotsearch.randomizedtesting.rules.StatementAdapter.evaluate(StatementAdapter.java:36)
: at app//com.carrotsearch.randomizedtesting.rules.StatementAdapter.evaluate(StatementAdapter.java:36)
: at app//org.apache.lucene.tests.util.TestRuleAssertionsRequired$1.evaluate(TestRuleAssertionsRequired.java:53)
: at app//org.apache.lucene.tests.util.AbstractBeforeAfterRule$1.evaluate(AbstractBeforeAfterRule.java:43)
: at app//org.apache.lucene.tests.util.TestRuleMarkFailure$1.evaluate(TestRuleMarkFailure.java:44)
: at app//org.apache.lucene.tests.util.TestRuleIgnoreAfterMaxFailures$1.evaluate(TestRuleIgnoreAfterMaxFailures.java:60)
: at app//org.apache.lucene.tests.util.TestRuleIgnoreTestSuites$1.evaluate(TestRuleIgnoreTestSuites.java:47)
: at app//org.junit.rules.RunRules.evaluate(RunRules.java:20)
: at app//com.carrotsearch.randomizedtesting.rules.StatementAdapter.evaluate(StatementAdapter.java:36)
: at app//com.carrotsearch.randomizedtesting.ThreadLeakControl$StatementRunner.run(ThreadLeakControl.java:390)
: at app//com.carrotsearch.randomizedtesting.ThreadLeakControl.lambda$forkTimeoutingTask$0(ThreadLeakControl.java:850)
: at java.base@17.0.8.1/java.lang.Thread.run(Thread.java:857)
:
:
: FAILED: org.apache.solr.search.TestRecovery.testBuffering
:
: Error Message:
: java.lang.RuntimeException: mismatch: '-68'!='62' @ versions/[0]
:
: Stack Trace:
: java.lang.RuntimeException: mismatch: '-68'!='62' @ versions/[0]
: at __randomizedtesting.SeedInfo.seed([340F9724D936425B:29E1390F786FE370]:0)
: at app//org.apache.solr.SolrTestCaseJ4.assertJQ(SolrTestCaseJ4.java:1072)
: at app//org.apache.solr.SolrTestCaseJ4.assertJQ(SolrTestCaseJ4.java:1018)
: at app//org.apache.solr.search.TestRecovery.testBuffering(TestRecovery.java:739)
: at java.base@17.0.8.1/jdk.internal.reflect.NativeMethodAccessorImpl.invoke0(Native Method)
: at java.base@17.0.8.1/jdk.internal.reflect.NativeMethodAccessorImpl.invoke(NativeMethodAccessorImpl.java:77)
: at java.base@17.0.8.1/jdk.internal.reflect.DelegatingMethodAccessorImpl.invoke(DelegatingMethodAccessorImpl.java:43)
: at java.base@17.0.8.1/java.lang.reflect.Method.invoke(Method.java:568)
: at app//com.carrotsearch.randomizedtesting.RandomizedRunner.invoke(RandomizedRunner.java:1758)
: at app//com.carrotsearch.randomizedtesting.RandomizedRunner$8.evaluate(RandomizedRunner.java:946)
: at app//com.carrotsearch.randomizedtesting.RandomizedRunner$9.evaluate(RandomizedRunner.java:982)
: at app//com.carrotsearch.randomizedtesting.RandomizedRunner$10.evaluate(RandomizedRunner.java:996)
: at app//com.carrotsearch.randomizedtesting.rules.SystemPropertiesRestoreRule$1.evaluate(SystemPropertiesRestoreRule.java:80)
: at app//org.junit.rules.RunRules.evaluate(RunRules.java:20)
: at app//org.apache.lucene.tests.util.TestRuleSetupTeardownChained$1.evaluate(TestRuleSetupTeardownChained.java:48)
: at app//org.apache.lucene.tests.util.AbstractBeforeAfterRule$1.evaluate(AbstractBeforeAfterRule.java:43)
: at app//org.apache.lucene.tests.util.TestRuleThreadAndTestName$1.evaluate(TestRuleThreadAndTestName.java:45)
: at app//org.apache.lucene.tests.util.TestRuleIgnoreAfterMaxFailures$1.evaluate(TestRuleIgnoreAfterMaxFailures.java:60)
: at app//org.apache.lucene.tests.util.TestRuleMarkFailure$1.evaluate(TestRuleMarkFailure.java:44)
: at app//org.junit.rules.RunRules.evaluate(RunRules.java:20)
: at app//com.carrotsearch.randomizedtesting.rules.StatementAdapter.evaluate(StatementAdapter.java:36)
: at app//com.carrotsearch.randomizedtesting.ThreadLeakControl$StatementRunner.run(ThreadLeakControl.java:390)
: at app//com.carrotsearch.randomizedtesting.ThreadLeakControl.forkTimeoutingTask(ThreadLeakControl.java:843)
: at app//com.carrotsearch.randomizedtesting.ThreadLeakControl$3.evaluate(ThreadLeakControl.java:490)
: at app//com.carrotsearch.randomizedtesting.RandomizedRunner.runSingleTest(RandomizedRunner.java:955)
: at app//com.carrotsearch.randomizedtesting.RandomizedRunner$5.evaluate(RandomizedRunner.java:840)
: at app//com.carrotsearch.randomizedtesting.RandomizedRunner$6.evaluate(RandomizedRunner.java:891)
: at app//com.carrotsearch.randomizedtesting.RandomizedRunner$7.evaluate(RandomizedRunner.java:902)
: at app//com.carrotsearch.randomizedtesting.rules.StatementAdapter.evaluate(StatementAdapter.java:36)
: at app//com.carrotsearch.randomizedtesting.rules.StatementAdapter.evaluate(StatementAdapter.java:36)
: at app//org.apache.lucene.tests.util.AbstractBeforeAfterRule$1.evaluate(AbstractBeforeAfterRule.java:43)
: at app//com.carrotsearch.randomizedtesting.rules.SystemPropertiesRestoreRule$1.evaluate(SystemPropertiesRestoreRule.java:80)
: at app//org.junit.rules.RunRules.evaluate(RunRules.java:20)
: at app//org.apache.lucene.tests.util.AbstractBeforeAfterRule$1.evaluate(AbstractBeforeAfterRule.java:43)
: at app//com.carrotsearch.randomizedtesting.rules.StatementAdapter.evaluate(StatementAdapter.java:36)
: at app//org.apache.lucene.tests.util.TestRuleStoreClassName$1.evaluate(TestRuleStoreClassName.java:38)
: at app//com.carrotsearch.randomizedtesting.rules.NoShadowingOrOverridesOnMethodsRule$1.evaluate(NoShadowingOrOverridesOnMethodsRule.java:40)
: at app//com.carrotsearch.randomizedtesting.rules.NoShadowingOrOverridesOnMethodsRule$1.evaluate(NoShadowingOrOverridesOnMethodsRule.java:40)
: at app//com.carrotsearch.randomizedtesting.rules.StatementAdapter.evaluate(StatementAdapter.java:36)
: at app//com.carrotsearch.randomizedtesting.rules.StatementAdapter.evaluate(StatementAdapter.java:36)
: at app//org.apache.lucene.tests.util.TestRuleAssertionsRequired$1.evaluate(TestRuleAssertionsRequired.java:53)
: at app//org.apache.lucene.tests.util.AbstractBeforeAfterRule$1.evaluate(AbstractBeforeAfterRule.java:43)
: at app//org.apache.lucene.tests.util.TestRuleMarkFailure$1.evaluate(TestRuleMarkFailure.java:44)
: at app//org.apache.lucene.tests.util.TestRuleIgnoreAfterMaxFailures$1.evaluate(TestRuleIgnoreAfterMaxFailures.java:60)
: at app//org.apache.lucene.tests.util.TestRuleIgnoreTestSuites$1.evaluate(TestRuleIgnoreTestSuites.java:47)
: at app//org.junit.rules.RunRules.evaluate(RunRules.java:20)
: at app//com.carrotsearch.randomizedtesting.rules.StatementAdapter.evaluate(StatementAdapter.java:36)
: at app//com.carrotsearch.randomizedtesting.ThreadLeakControl$StatementRunner.run(ThreadLeakControl.java:390)
: at app//com.carrotsearch.randomizedtesting.ThreadLeakControl.lambda$forkTimeoutingTask$0(ThreadLeakControl.java:850)
: at java.base@17.0.8.1/java.lang.Thread.run(Thread.java:857)
:
:
: FAILED: org.apache.solr.crossdc.manager.SolrAndKafkaIntegrationTest.classMethod
:
: Error Message:
: com.carrotsearch.randomizedtesting.ThreadLeakError: 1 thread leaked from SUITE scope at org.apache.solr.crossdc.manager.SolrAndKafkaIntegrationTest:
: 1) Thread[id=132, name=file lock watchdog, state=WAITING, group=main]
: at java.base/java.lang.Object.waitImpl(Native Method)
: at java.base/java.lang.Object.wait(Object.java:251)
: at java.base/java.lang.Object.wait(Object.java:190)
: at java.base/java.util.TimerThread.mainLoop(Timer.java:563)
: at java.base/java.util.TimerThread.run(Timer.java:542)
:
: Stack Trace:
: com.carrotsearch.randomizedtesting.ThreadLeakError: 1 thread leaked from SUITE scope at org.apache.solr.crossdc.manager.SolrAndKafkaIntegrationTest:
: 1) Thread[id=132, name=file lock watchdog, state=WAITING, group=main]
: at java.base/java.lang.Object.waitImpl(Native Method)
: at java.base/java.lang.Object.wait(Object.java:251)
: at java.base/java.lang.Object.wait(Object.java:190)
: at java.base/java.util.TimerThread.mainLoop(Timer.java:563)
: at java.base/java.util.TimerThread.run(Timer.java:542)
: at __randomizedtesting.SeedInfo.seed([340F9724D936425B]:0)
:
:
: FAILED: org.apache.solr.crossdc.manager.SolrAndKafkaIntegrationTest.classMethod
:
: Error Message:
: com.carrotsearch.randomizedtesting.ThreadLeakError: There are still zombie threads that couldn't be terminated:
: 1) Thread[id=132, name=file lock watchdog, state=WAITING, group=main]
: at java.base/java.lang.Object.waitImpl(Native Method)
: at java.base/java.lang.Object.wait(Object.java:251)
: at java.base/java.lang.Object.wait(Object.java:190)
: at java.base/java.util.TimerThread.mainLoop(Timer.java:563)
: at java.base/java.util.TimerThread.run(Timer.java:542)
:
: Stack Trace:
: com.carrotsearch.randomizedtesting.ThreadLeakError: There are still zombie threads that couldn't be terminated:
: 1) Thread[id=132, name=file lock watchdog, state=WAITING, group=main]
: at java.base/java.lang.Object.waitImpl(Native Method)
: at java.base/java.lang.Object.wait(Object.java:251)
: at java.base/java.lang.Object.wait(Object.java:190)
: at java.base/java.util.TimerThread.mainLoop(Timer.java:563)
: at java.base/java.util.TimerThread.run(Timer.java:542)
: at __randomizedtesting.SeedInfo.seed([340F9724D936425B]:0)
:
:
: FAILED: org.apache.solr.crossdc.manager.SimpleSolrIntegrationTest.classMethod
:
: Error Message:
: com.carrotsearch.randomizedtesting.ThreadLeakError: 1 thread leaked from SUITE scope at org.apache.solr.crossdc.manager.SimpleSolrIntegrationTest:
: 1) Thread[id=148, name=file lock watchdog, state=TIMED_WAITING, group=main]
: at java.base/java.lang.Object.waitImpl(Native Method)
: at java.base/java.lang.Object.wait(Object.java:251)
: at java.base/java.lang.Object.wait(Object.java:219)
: at java.base/java.util.TimerThread.mainLoop(Timer.java:599)
: at java.base/java.util.TimerThread.run(Timer.java:542)
:
: Stack Trace:
: com.carrotsearch.randomizedtesting.ThreadLeakError: 1 thread leaked from SUITE scope at org.apache.solr.crossdc.manager.SimpleSolrIntegrationTest:
: 1) Thread[id=148, name=file lock watchdog, state=TIMED_WAITING, group=main]
: at java.base/java.lang.Object.waitImpl(Native Method)
: at java.base/java.lang.Object.wait(Object.java:251)
: at java.base/java.lang.Object.wait(Object.java:219)
: at java.base/java.util.TimerThread.mainLoop(Timer.java:599)
: at java.base/java.util.TimerThread.run(Timer.java:542)
: at __randomizedtesting.SeedInfo.seed([340F9724D936425B]:0)
:
:
: FAILED: org.apache.solr.crossdc.manager.SimpleSolrIntegrationTest.classMethod
:
: Error Message:
: com.carrotsearch.randomizedtesting.ThreadLeakError: 1 thread leaked from SUITE scope at org.apache.solr.crossdc.manager.SimpleSolrIntegrationTest:
: 1) Thread[id=149, name=file lock watchdog, state=TIMED_WAITING, group=main]
: at java.base/java.lang.Object.waitImpl(Native Method)
: at java.base/java.lang.Object.wait(Object.java:251)
: at java.base/java.lang.Object.wait(Object.java:219)
: at java.base/java.util.TimerThread.mainLoop(Timer.java:599)
: at java.base/java.util.TimerThread.run(Timer.java:542)
:
: Stack Trace:
: com.carrotsearch.randomizedtesting.ThreadLeakError: 1 thread leaked from SUITE scope at org.apache.solr.crossdc.manager.SimpleSolrIntegrationTest:
: 1) Thread[id=149, name=file lock watchdog, state=TIMED_WAITING, group=main]
: at java.base/java.lang.Object.waitImpl(Native Method)
: at java.base/java.lang.Object.wait(Object.java:251)
: at java.base/java.lang.Object.wait(Object.java:219)
: at java.base/java.util.TimerThread.mainLoop(Timer.java:599)
: at java.base/java.util.TimerThread.run(Timer.java:542)
: at __randomizedtesting.SeedInfo.seed([340F9724D936425B]:0)
:
:
: FAILED: org.apache.solr.crossdc.manager.SimpleSolrIntegrationTest.classMethod
:
: Error Message:
: com.carrotsearch.randomizedtesting.ThreadLeakError: There are still zombie threads that couldn't be terminated:
: 1) Thread[id=149, name=file lock watchdog, state=WAITING, group=main]
: at java.base/java.lang.Object.waitImpl(Native Method)
: at java.base/java.lang.Object.wait(Object.java:251)
: at java.base/java.lang.Object.wait(Object.java:190)
: at java.base/java.util.TimerThread.mainLoop(Timer.java:563)
: at java.base/java.util.TimerThread.run(Timer.java:542)
:
: Stack Trace:
: com.carrotsearch.randomizedtesting.ThreadLeakError: There are still zombie threads that couldn't be terminated:
: 1) Thread[id=149, name=file lock watchdog, state=WAITING, group=main]
: at java.base/java.lang.Object.waitImpl(Native Method)
: at java.base/java.lang.Object.wait(Object.java:251)
: at java.base/java.lang.Object.wait(Object.java:190)
: at java.base/java.util.TimerThread.mainLoop(Timer.java:563)
: at java.base/java.util.TimerThread.run(Timer.java:542)
: at __randomizedtesting.SeedInfo.seed([340F9724D936425B]:0)
:
:
: FAILED: org.apache.solr.crossdc.manager.SimpleSolrIntegrationTest.classMethod
:
: Error Message:
: com.carrotsearch.randomizedtesting.ThreadLeakError: There are still zombie threads that couldn't be terminated:
: 1) Thread[id=150, name=file lock watchdog, state=WAITING, group=main]
: at java.base/java.lang.Object.waitImpl(Native Method)
: at java.base/java.lang.Object.wait(Object.java:251)
: at java.base/java.lang.Object.wait(Object.java:190)
: at java.base/java.util.TimerThread.mainLoop(Timer.java:563)
: at java.base/java.util.TimerThread.run(Timer.java:542)
:
: Stack Trace:
: com.carrotsearch.randomizedtesting.ThreadLeakError: There are still zombie threads that couldn't be terminated:
: 1) Thread[id=150, name=file lock watchdog, state=WAITING, group=main]
: at java.base/java.lang.Object.waitImpl(Native Method)
: at java.base/java.lang.Object.wait(Object.java:251)
: at java.base/java.lang.Object.wait(Object.java:190)
: at java.base/java.util.TimerThread.mainLoop(Timer.java:563)
: at java.base/java.util.TimerThread.run(Timer.java:542)
: at __randomizedtesting.SeedInfo.seed([340F9724D936425B]:0)
:
:
: FAILED: org.apache.solr.crossdc.manager.SimpleSolrIntegrationTest.classMethod
:
: Error Message:
: com.carrotsearch.randomizedtesting.ThreadLeakError: There are still zombie threads that couldn't be terminated:
: 1) Thread[id=88, name=file lock watchdog, state=WAITING, group=main]
: at java.base/java.lang.Object.waitImpl(Native Method)
: at java.base/java.lang.Object.wait(Object.java:251)
: at java.base/java.lang.Object.wait(Object.java:190)
: at java.base/java.util.TimerThread.mainLoop(Timer.java:563)
: at java.base/java.util.TimerThread.run(Timer.java:542)
:
: Stack Trace:
: com.carrotsearch.randomizedtesting.ThreadLeakError: There are still zombie threads that couldn't be terminated:
: 1) Thread[id=88, name=file lock watchdog, state=WAITING, group=main]
: at java.base/java.lang.Object.waitImpl(Native Method)
: at java.base/java.lang.Object.wait(Object.java:251)
: at java.base/java.lang.Object.wait(Object.java:190)
: at java.base/java.util.TimerThread.mainLoop(Timer.java:563)
: at java.base/java.util.TimerThread.run(Timer.java:542)
: at __randomizedtesting.SeedInfo.seed([340F9724D936425B]:0)
:
:
: FAILED: org.apache.solr.crossdc.manager.SimpleSolrIntegrationTest.classMethod
:
: Error Message:
: com.carrotsearch.randomizedtesting.ThreadLeakError: 1 thread leaked from SUITE scope at org.apache.solr.crossdc.manager.SimpleSolrIntegrationTest:
: 1) Thread[id=150, name=file lock watchdog, state=TIMED_WAITING, group=main]
: at java.base/java.lang.Object.waitImpl(Native Method)
: at java.base/java.lang.Object.wait(Object.java:251)
: at java.base/java.lang.Object.wait(Object.java:219)
: at java.base/java.util.TimerThread.mainLoop(Timer.java:599)
: at java.base/java.util.TimerThread.run(Timer.java:542)
:
: Stack Trace:
: com.carrotsearch.randomizedtesting.ThreadLeakError: 1 thread leaked from SUITE scope at org.apache.solr.crossdc.manager.SimpleSolrIntegrationTest:
: 1) Thread[id=150, name=file lock watchdog, state=TIMED_WAITING, group=main]
: at java.base/java.lang.Object.waitImpl(Native Method)
: at java.base/java.lang.Object.wait(Object.java:251)
: at java.base/java.lang.Object.wait(Object.java:219)
: at java.base/java.util.TimerThread.mainLoop(Timer.java:599)
: at java.base/java.util.TimerThread.run(Timer.java:542)
: at __randomizedtesting.SeedInfo.seed([340F9724D936425B]:0)
:
:
: FAILED: org.apache.solr.crossdc.manager.SimpleSolrIntegrationTest.classMethod
:
: Error Message:
: com.carrotsearch.randomizedtesting.ThreadLeakError: 1 thread leaked from SUITE scope at org.apache.solr.crossdc.manager.SimpleSolrIntegrationTest:
: 1) Thread[id=88, name=file lock watchdog, state=TIMED_WAITING, group=main]
: at java.base/java.lang.Object.waitImpl(Native Method)
: at java.base/java.lang.Object.wait(Object.java:251)
: at java.base/java.lang.Object.wait(Object.java:219)
: at java.base/java.util.TimerThread.mainLoop(Timer.java:599)
: at java.base/java.util.TimerThread.run(Timer.java:542)
:
: Stack Trace:
: com.carrotsearch.randomizedtesting.ThreadLeakError: 1 thread leaked from SUITE scope at org.apache.solr.crossdc.manager.SimpleSolrIntegrationTest:
: 1) Thread[id=88, name=file lock watchdog, state=TIMED_WAITING, group=main]
: at java.base/java.lang.Object.waitImpl(Native Method)
: at java.base/java.lang.Object.wait(Object.java:251)
: at java.base/java.lang.Object.wait(Object.java:219)
: at java.base/java.util.TimerThread.mainLoop(Timer.java:599)
: at java.base/java.util.TimerThread.run(Timer.java:542)
: at __randomizedtesting.SeedInfo.seed([340F9724D936425B]:0)
:
:
: FAILED: org.apache.solr.crossdc.manager.SimpleSolrIntegrationTest.classMethod
:
: Error Message:
: com.carrotsearch.randomizedtesting.ThreadLeakError: There are still zombie threads that couldn't be terminated:
: 1) Thread[id=148, name=file lock watchdog, state=WAITING, group=main]
: at java.base/java.lang.Object.waitImpl(Native Method)
: at java.base/java.lang.Object.wait(Object.java:251)
: at java.base/java.lang.Object.wait(Object.java:190)
: at java.base/java.util.TimerThread.mainLoop(Timer.java:563)
: at java.base/java.util.TimerThread.run(Timer.java:542)
:
: Stack Trace:
: com.carrotsearch.randomizedtesting.ThreadLeakError: There are still zombie threads that couldn't be terminated:
: 1) Thread[id=148, name=file lock watchdog, state=WAITING, group=main]
: at java.base/java.lang.Object.waitImpl(Native Method)
: at java.base/java.lang.Object.wait(Object.java:251)
: at java.base/java.lang.Object.wait(Object.java:190)
: at java.base/java.util.TimerThread.mainLoop(Timer.java:563)
: at java.base/java.util.TimerThread.run(Timer.java:542)
: at __randomizedtesting.SeedInfo.seed([340F9724D936425B]:0)
:
:
: FAILED: org.apache.solr.crossdc.update.processor.MirroringUpdateProcessorTest.classMethod
:
: Error Message:
: com.carrotsearch.randomizedtesting.ThreadLeakError: There are still zombie threads that couldn't be terminated:
: 1) Thread[id=41, name=file lock watchdog, state=WAITING, group=main]
: at java.base/java.lang.Object.waitImpl(Native Method)
: at java.base/java.lang.Object.wait(Object.java:251)
: at java.base/java.lang.Object.wait(Object.java:190)
: at java.base/java.util.TimerThread.mainLoop(Timer.java:563)
: at java.base/java.util.TimerThread.run(Timer.java:542)
:
: Stack Trace:
: com.carrotsearch.randomizedtesting.ThreadLeakError: There are still zombie threads that couldn't be terminated:
: 1) Thread[id=41, name=file lock watchdog, state=WAITING, group=main]
: at java.base/java.lang.Object.waitImpl(Native Method)
: at java.base/java.lang.Object.wait(Object.java:251)
: at java.base/java.lang.Object.wait(Object.java:190)
: at java.base/java.util.TimerThread.mainLoop(Timer.java:563)
: at java.base/java.util.TimerThread.run(Timer.java:542)
: at __randomizedtesting.SeedInfo.seed([340F9724D936425B]:0)
:
:
: FAILED: org.apache.solr.crossdc.update.processor.MirroringUpdateProcessorTest.classMethod
:
: Error Message:
: com.carrotsearch.randomizedtesting.ThreadLeakError: 1 thread leaked from SUITE scope at org.apache.solr.crossdc.update.processor.MirroringUpdateProcessorTest:
: 1) Thread[id=41, name=file lock watchdog, state=TIMED_WAITING, group=main]
: at java.base/java.lang.Object.waitImpl(Native Method)
: at java.base/java.lang.Object.wait(Object.java:251)
: at java.base/java.lang.Object.wait(Object.java:219)
: at java.base/java.util.TimerThread.mainLoop(Timer.java:599)
: at java.base/java.util.TimerThread.run(Timer.java:542)
:
: Stack Trace:
: com.carrotsearch.randomizedtesting.ThreadLeakError: 1 thread leaked from SUITE scope at org.apache.solr.crossdc.update.processor.MirroringUpdateProcessorTest:
: 1) Thread[id=41, name=file lock watchdog, state=TIMED_WAITING, group=main]
: at java.base/java.lang.Object.waitImpl(Native Method)
: at java.base/java.lang.Object.wait(Object.java:251)
: at java.base/java.lang.Object.wait(Object.java:219)
: at java.base/java.util.TimerThread.mainLoop(Timer.java:599)
: at java.base/java.util.TimerThread.run(Timer.java:542)
: at __randomizedtesting.SeedInfo.seed([340F9724D936425B]:0)
:
:
: FAILED: org.apache.solr.hdfs.search.TestRecoveryHdfs.testBuffering
:
: Error Message:
: java.lang.RuntimeException: mismatch: '-2010'!='1030' @ versions/[0]
:
: Stack Trace:
: java.lang.RuntimeException: mismatch: '-2010'!='1030' @ versions/[0]
: at __randomizedtesting.SeedInfo.seed([340F9724D936425B:29E1390F786FE370]:0)
: at app//org.apache.solr.SolrTestCaseJ4.assertJQ(SolrTestCaseJ4.java:1072)
: at app//org.apache.solr.SolrTestCaseJ4.assertJQ(SolrTestCaseJ4.java:1018)
: at app//org.apache.solr.hdfs.search.TestRecoveryHdfs.testBuffering(TestRecoveryHdfs.java:325)
: at java.base@17.0.8.1/jdk.internal.reflect.NativeMethodAccessorImpl.invoke0(Native Method)
: at java.base@17.0.8.1/jdk.internal.reflect.NativeMethodAccessorImpl.invoke(NativeMethodAccessorImpl.java:77)
: at java.base@17.0.8.1/jdk.internal.reflect.DelegatingMethodAccessorImpl.invoke(DelegatingMethodAccessorImpl.java:43)
: at java.base@17.0.8.1/java.lang.reflect.Method.invoke(Method.java:568)
: at app//com.carrotsearch.randomizedtesting.RandomizedRunner.invoke(RandomizedRunner.java:1758)
: at app//com.carrotsearch.randomizedtesting.RandomizedRunner$8.evaluate(RandomizedRunner.java:946)
: at app//com.carrotsearch.randomizedtesting.RandomizedRunner$9.evaluate(RandomizedRunner.java:982)
: at app//com.carrotsearch.randomizedtesting.RandomizedRunner$10.evaluate(RandomizedRunner.java:996)
: at app//com.carrotsearch.randomizedtesting.rules.SystemPropertiesRestoreRule$1.evaluate(SystemPropertiesRestoreRule.java:80)
: at app//org.junit.rules.RunRules.evaluate(RunRules.java:20)
: at app//org.apache.lucene.tests.util.TestRuleSetupTeardownChained$1.evaluate(TestRuleSetupTeardownChained.java:48)
: at app//org.apache.lucene.tests.util.AbstractBeforeAfterRule$1.evaluate(AbstractBeforeAfterRule.java:43)
: at app//org.apache.lucene.tests.util.TestRuleThreadAndTestName$1.evaluate(TestRuleThreadAndTestName.java:45)
: at app//org.apache.lucene.tests.util.TestRuleIgnoreAfterMaxFailures$1.evaluate(TestRuleIgnoreAfterMaxFailures.java:60)
: at app//org.apache.lucene.tests.util.TestRuleMarkFailure$1.evaluate(TestRuleMarkFailure.java:44)
: at app//org.junit.rules.RunRules.evaluate(RunRules.java:20)
: at app//com.carrotsearch.randomizedtesting.rules.StatementAdapter.evaluate(StatementAdapter.java:36)
: at app//com.carrotsearch.randomizedtesting.ThreadLeakControl$StatementRunner.run(ThreadLeakControl.java:390)
: at app//com.carrotsearch.randomizedtesting.ThreadLeakControl.forkTimeoutingTask(ThreadLeakControl.java:843)
: at app//com.carrotsearch.randomizedtesting.ThreadLeakControl$3.evaluate(ThreadLeakControl.java:490)
: at app//com.carrotsearch.randomizedtesting.RandomizedRunner.runSingleTest(RandomizedRunner.java:955)
: at app//com.carrotsearch.randomizedtesting.RandomizedRunner$5.evaluate(RandomizedRunner.java:840)
: at app//com.carrotsearch.randomizedtesting.RandomizedRunner$6.evaluate(RandomizedRunner.java:891)
: at app//com.carrotsearch.randomizedtesting.RandomizedRunner$7.evaluate(RandomizedRunner.java:902)
: at app//com.carrotsearch.randomizedtesting.rules.StatementAdapter.evaluate(StatementAdapter.java:36)
: at app//com.carrotsearch.randomizedtesting.rules.StatementAdapter.evaluate(StatementAdapter.java:36)
: at app//org.apache.lucene.tests.util.AbstractBeforeAfterRule$1.evaluate(AbstractBeforeAfterRule.java:43)
: at app//com.carrotsearch.randomizedtesting.rules.SystemPropertiesRestoreRule$1.evaluate(SystemPropertiesRestoreRule.java:80)
: at app//org.junit.rules.RunRules.evaluate(RunRules.java:20)
: at app//org.apache.lucene.tests.util.AbstractBeforeAfterRule$1.evaluate(AbstractBeforeAfterRule.java:43)
: at app//com.carrotsearch.randomizedtesting.rules.StatementAdapter.evaluate(StatementAdapter.java:36)
: at app//org.apache.lucene.tests.util.TestRuleStoreClassName$1.evaluate(TestRuleStoreClassName.java:38)
: at app//com.carrotsearch.randomizedtesting.rules.NoShadowingOrOverridesOnMethodsRule$1.evaluate(NoShadowingOrOverridesOnMethodsRule.java:40)
: at app//com.carrotsearch.randomizedtesting.rules.NoShadowingOrOverridesOnMethodsRule$1.evaluate(NoShadowingOrOverridesOnMethodsRule.java:40)
: at app//com.carrotsearch.randomizedtesting.rules.StatementAdapter.evaluate(StatementAdapter.java:36)
: at app//com.carrotsearch.randomizedtesting.rules.StatementAdapter.evaluate(StatementAdapter.java:36)
: at app//org.apache.lucene.tests.util.TestRuleAssertionsRequired$1.evaluate(TestRuleAssertionsRequired.java:53)
: at app//org.apache.lucene.tests.util.AbstractBeforeAfterRule$1.evaluate(AbstractBeforeAfterRule.java:43)
: at app//org.apache.lucene.tests.util.TestRuleMarkFailure$1.evaluate(TestRuleMarkFailure.java:44)
: at app//org.apache.lucene.tests.util.TestRuleIgnoreAfterMaxFailures$1.evaluate(TestRuleIgnoreAfterMaxFailures.java:60)
: at app//org.apache.lucene.tests.util.TestRuleIgnoreTestSuites$1.evaluate(TestRuleIgnoreTestSuites.java:47)
: at app//org.junit.rules.RunRules.evaluate(RunRules.java:20)
: at app//com.carrotsearch.randomizedtesting.rules.StatementAdapter.evaluate(StatementAdapter.java:36)
: at app//com.carrotsearch.randomizedtesting.ThreadLeakControl$StatementRunner.run(ThreadLeakControl.java:390)
: at app//com.carrotsearch.randomizedtesting.ThreadLeakControl.lambda$forkTimeoutingTask$0(ThreadLeakControl.java:850)
: at java.base@17.0.8.1/java.lang.Thread.run(Thread.java:857)
:
:
: FAILED: org.apache.solr.hdfs.search.TestRecoveryHdfs.testBuffering
:
: Error Message:
: java.lang.RuntimeException: mismatch: '-2010'!='1030' @ versions/[0]
:
: Stack Trace:
: java.lang.RuntimeException: mismatch: '-2010'!='1030' @ versions/[0]
: at __randomizedtesting.SeedInfo.seed([340F9724D936425B:29E1390F786FE370]:0)
: at app//org.apache.solr.SolrTestCaseJ4.assertJQ(SolrTestCaseJ4.java:1072)
: at app//org.apache.solr.SolrTestCaseJ4.assertJQ(SolrTestCaseJ4.java:1018)
: at app//org.apache.solr.hdfs.search.TestRecoveryHdfs.testBuffering(TestRecoveryHdfs.java:325)
: at java.base@17.0.8.1/jdk.internal.reflect.NativeMethodAccessorImpl.invoke0(Native Method)
: at java.base@17.0.8.1/jdk.internal.reflect.NativeMethodAccessorImpl.invoke(NativeMethodAccessorImpl.java:77)
: at java.base@17.0.8.1/jdk.internal.reflect.DelegatingMethodAccessorImpl.invoke(DelegatingMethodAccessorImpl.java:43)
: at java.base@17.0.8.1/java.lang.reflect.Method.invoke(Method.java:568)
: at app//com.carrotsearch.randomizedtesting.RandomizedRunner.invoke(RandomizedRunner.java:1758)
: at app//com.carrotsearch.randomizedtesting.RandomizedRunner$8.evaluate(RandomizedRunner.java:946)
: at app//com.carrotsearch.randomizedtesting.RandomizedRunner$9.evaluate(RandomizedRunner.java:982)
: at app//com.carrotsearch.randomizedtesting.RandomizedRunner$10.evaluate(RandomizedRunner.java:996)
: at app//com.carrotsearch.randomizedtesting.rules.SystemPropertiesRestoreRule$1.evaluate(SystemPropertiesRestoreRule.java:80)
: at app//org.junit.rules.RunRules.evaluate(RunRules.java:20)
: at app//org.apache.lucene.tests.util.TestRuleSetupTeardownChained$1.evaluate(TestRuleSetupTeardownChained.java:48)
: at app//org.apache.lucene.tests.util.AbstractBeforeAfterRule$1.evaluate(AbstractBeforeAfterRule.java:43)
: at app//org.apache.lucene.tests.util.TestRuleThreadAndTestName$1.evaluate(TestRuleThreadAndTestName.java:45)
: at app//org.apache.lucene.tests.util.TestRuleIgnoreAfterMaxFailures$1.evaluate(TestRuleIgnoreAfterMaxFailures.java:60)
: at app//org.apache.lucene.tests.util.TestRuleMarkFailure$1.evaluate(TestRuleMarkFailure.java:44)
: at app//org.junit.rules.RunRules.evaluate(RunRules.java:20)
: at app//com.carrotsearch.randomizedtesting.rules.StatementAdapter.evaluate(StatementAdapter.java:36)
: at app//com.carrotsearch.randomizedtesting.ThreadLeakControl$StatementRunner.run(ThreadLeakControl.java:390)
: at app//com.carrotsearch.randomizedtesting.ThreadLeakControl.forkTimeoutingTask(ThreadLeakControl.java:843)
: at app//com.carrotsearch.randomizedtesting.ThreadLeakControl$3.evaluate(ThreadLeakControl.java:490)
: at app//com.carrotsearch.randomizedtesting.RandomizedRunner.runSingleTest(RandomizedRunner.java:955)
: at app//com.carrotsearch.randomizedtesting.RandomizedRunner$5.evaluate(RandomizedRunner.java:840)
: at app//com.carrotsearch.randomizedtesting.RandomizedRunner$6.evaluate(RandomizedRunner.java:891)
: at app//com.carrotsearch.randomizedtesting.RandomizedRunner$7.evaluate(RandomizedRunner.java:902)
: at app//com.carrotsearch.randomizedtesting.rules.StatementAdapter.evaluate(StatementAdapter.java:36)
: at app//com.carrotsearch.randomizedtesting.rules.StatementAdapter.evaluate(StatementAdapter.java:36)
: at app//org.apache.lucene.tests.util.AbstractBeforeAfterRule$1.evaluate(AbstractBeforeAfterRule.java:43)
: at app//com.carrotsearch.randomizedtesting.rules.SystemPropertiesRestoreRule$1.evaluate(SystemPropertiesRestoreRule.java:80)
: at app//org.junit.rules.RunRules.evaluate(RunRules.java:20)
: at app//org.apache.lucene.tests.util.AbstractBeforeAfterRule$1.evaluate(AbstractBeforeAfterRule.java:43)
: at app//com.carrotsearch.randomizedtesting.rules.StatementAdapter.evaluate(StatementAdapter.java:36)
: at app//org.apache.lucene.tests.util.TestRuleStoreClassName$1.evaluate(TestRuleStoreClassName.java:38)
: at app//com.carrotsearch.randomizedtesting.rules.NoShadowingOrOverridesOnMethodsRule$1.evaluate(NoShadowingOrOverridesOnMethodsRule.java:40)
: at app//com.carrotsearch.randomizedtesting.rules.NoShadowingOrOverridesOnMethodsRule$1.evaluate(NoShadowingOrOverridesOnMethodsRule.java:40)
: at app//com.carrotsearch.randomizedtesting.rules.StatementAdapter.evaluate(StatementAdapter.java:36)
: at app//com.carrotsearch.randomizedtesting.rules.StatementAdapter.evaluate(StatementAdapter.java:36)
: at app//org.apache.lucene.tests.util.TestRuleAssertionsRequired$1.evaluate(TestRuleAssertionsRequired.java:53)
: at app//org.apache.lucene.tests.util.AbstractBeforeAfterRule$1.evaluate(AbstractBeforeAfterRule.java:43)
: at app//org.apache.lucene.tests.util.TestRuleMarkFailure$1.evaluate(TestRuleMarkFailure.java:44)
: at app//org.apache.lucene.tests.util.TestRuleIgnoreAfterMaxFailures$1.evaluate(TestRuleIgnoreAfterMaxFailures.java:60)
: at app//org.apache.lucene.tests.util.TestRuleIgnoreTestSuites$1.evaluate(TestRuleIgnoreTestSuites.java:47)
: at app//org.junit.rules.RunRules.evaluate(RunRules.java:20)
: at app//com.carrotsearch.randomizedtesting.rules.StatementAdapter.evaluate(StatementAdapter.java:36)
: at app//com.carrotsearch.randomizedtesting.ThreadLeakControl$StatementRunner.run(ThreadLeakControl.java:390)
: at app//com.carrotsearch.randomizedtesting.ThreadLeakControl.lambda$forkTimeoutingTask$0(ThreadLeakControl.java:850)
: at java.base@17.0.8.1/java.lang.Thread.run(Thread.java:857)
:
:
: FAILED: org.apache.solr.hdfs.search.TestRecoveryHdfs.testBuffering
:
: Error Message:
: java.lang.RuntimeException: mismatch: '-2010'!='1030' @ versions/[0]
:
: Stack Trace:
: java.lang.RuntimeException: mismatch: '-2010'!='1030' @ versions/[0]
: at __randomizedtesting.SeedInfo.seed([340F9724D936425B:29E1390F786FE370]:0)
: at app//org.apache.solr.SolrTestCaseJ4.assertJQ(SolrTestCaseJ4.java:1072)
: at app//org.apache.solr.SolrTestCaseJ4.assertJQ(SolrTestCaseJ4.java:1018)
: at app//org.apache.solr.hdfs.search.TestRecoveryHdfs.testBuffering(TestRecoveryHdfs.java:325)
: at java.base@17.0.8.1/jdk.internal.reflect.NativeMethodAccessorImpl.invoke0(Native Method)
: at java.base@17.0.8.1/jdk.internal.reflect.NativeMethodAccessorImpl.invoke(NativeMethodAccessorImpl.java:77)
: at java.base@17.0.8.1/jdk.internal.reflect.DelegatingMethodAccessorImpl.invoke(DelegatingMethodAccessorImpl.java:43)
: at java.base@17.0.8.1/java.lang.reflect.Method.invoke(Method.java:568)
: at app//com.carrotsearch.randomizedtesting.RandomizedRunner.invoke(RandomizedRunner.java:1758)
: at app//com.carrotsearch.randomizedtesting.RandomizedRunner$8.evaluate(RandomizedRunner.java:946)
: at app//com.carrotsearch.randomizedtesting.RandomizedRunner$9.evaluate(RandomizedRunner.java:982)
: at app//com.carrotsearch.randomizedtesting.RandomizedRunner$10.evaluate(RandomizedRunner.java:996)
: at app//com.carrotsearch.randomizedtesting.rules.SystemPropertiesRestoreRule$1.evaluate(SystemPropertiesRestoreRule.java:80)
: at app//org.junit.rules.RunRules.evaluate(RunRules.java:20)
: at app//org.apache.lucene.tests.util.TestRuleSetupTeardownChained$1.evaluate(TestRuleSetupTeardownChained.java:48)
: at app//org.apache.lucene.tests.util.AbstractBeforeAfterRule$1.evaluate(AbstractBeforeAfterRule.java:43)
: at app//org.apache.lucene.tests.util.TestRuleThreadAndTestName$1.evaluate(TestRuleThreadAndTestName.java:45)
: at app//org.apache.lucene.tests.util.TestRuleIgnoreAfterMaxFailures$1.evaluate(TestRuleIgnoreAfterMaxFailures.java:60)
: at app//org.apache.lucene.tests.util.TestRuleMarkFailure$1.evaluate(TestRuleMarkFailure.java:44)
: at app//org.junit.rules.RunRules.evaluate(RunRules.java:20)
: at app//com.carrotsearch.randomizedtesting.rules.StatementAdapter.evaluate(StatementAdapter.java:36)
: at app//com.carrotsearch.randomizedtesting.ThreadLeakControl$StatementRunner.run(ThreadLeakControl.java:390)
: at app//com.carrotsearch.randomizedtesting.ThreadLeakControl.forkTimeoutingTask(ThreadLeakControl.java:843)
: at app//com.carrotsearch.randomizedtesting.ThreadLeakControl$3.evaluate(ThreadLeakControl.java:490)
: at app//com.carrotsearch.randomizedtesting.RandomizedRunner.runSingleTest(RandomizedRunner.java:955)
: at app//com.carrotsearch.randomizedtesting.RandomizedRunner$5.evaluate(RandomizedRunner.java:840)
: at app//com.carrotsearch.randomizedtesting.RandomizedRunner$6.evaluate(RandomizedRunner.java:891)
: at app//com.carrotsearch.randomizedtesting.RandomizedRunner$7.evaluate(RandomizedRunner.java:902)
: at app//com.carrotsearch.randomizedtesting.rules.StatementAdapter.evaluate(StatementAdapter.java:36)
: at app//com.carrotsearch.randomizedtesting.rules.StatementAdapter.evaluate(StatementAdapter.java:36)
: at app//org.apache.lucene.tests.util.AbstractBeforeAfterRule$1.evaluate(AbstractBeforeAfterRule.java:43)
: at app//com.carrotsearch.randomizedtesting.rules.SystemPropertiesRestoreRule$1.evaluate(SystemPropertiesRestoreRule.java:80)
: at app//org.junit.rules.RunRules.evaluate(RunRules.java:20)
: at app//org.apache.lucene.tests.util.AbstractBeforeAfterRule$1.evaluate(AbstractBeforeAfterRule.java:43)
: at app//com.carrotsearch.randomizedtesting.rules.StatementAdapter.evaluate(StatementAdapter.java:36)
: at app//org.apache.lucene.tests.util.TestRuleStoreClassName$1.evaluate(TestRuleStoreClassName.java:38)
: at app//com.carrotsearch.randomizedtesting.rules.NoShadowingOrOverridesOnMethodsRule$1.evaluate(NoShadowingOrOverridesOnMethodsRule.java:40)
: at app//com.carrotsearch.randomizedtesting.rules.NoShadowingOrOverridesOnMethodsRule$1.evaluate(NoShadowingOrOverridesOnMethodsRule.java:40)
: at app//com.carrotsearch.randomizedtesting.rules.StatementAdapter.evaluate(StatementAdapter.java:36)
: at app//com.carrotsearch.randomizedtesting.rules.StatementAdapter.evaluate(StatementAdapter.java:36)
: at app//org.apache.lucene.tests.util.TestRuleAssertionsRequired$1.evaluate(TestRuleAssertionsRequired.java:53)
: at app//org.apache.lucene.tests.util.AbstractBeforeAfterRule$1.evaluate(AbstractBeforeAfterRule.java:43)
: at app//org.apache.lucene.tests.util.TestRuleMarkFailure$1.evaluate(TestRuleMarkFailure.java:44)
: at app//org.apache.lucene.tests.util.TestRuleIgnoreAfterMaxFailures$1.evaluate(TestRuleIgnoreAfterMaxFailures.java:60)
: at app//org.apache.lucene.tests.util.TestRuleIgnoreTestSuites$1.evaluate(TestRuleIgnoreTestSuites.java:47)
: at app//org.junit.rules.RunRules.evaluate(RunRules.java:20)
: at app//com.carrotsearch.randomizedtesting.rules.StatementAdapter.evaluate(StatementAdapter.java:36)
: at app//com.carrotsearch.randomizedtesting.ThreadLeakControl$StatementRunner.run(ThreadLeakControl.java:390)
: at app//com.carrotsearch.randomizedtesting.ThreadLeakControl.lambda$forkTimeoutingTask$0(ThreadLeakControl.java:850)
: at java.base@17.0.8.1/java.lang.Thread.run(Thread.java:857)
:
:
: FAILED: org.apache.solr.hdfs.search.TestRecoveryHdfs.testBuffering
:
: Error Message:
: java.lang.RuntimeException: mismatch: '-2010'!='1030' @ versions/[0]
:
: Stack Trace:
: java.lang.RuntimeException: mismatch: '-2010'!='1030' @ versions/[0]
: at __randomizedtesting.SeedInfo.seed([340F9724D936425B:29E1390F786FE370]:0)
: at app//org.apache.solr.SolrTestCaseJ4.assertJQ(SolrTestCaseJ4.java:1072)
: at app//org.apache.solr.SolrTestCaseJ4.assertJQ(SolrTestCaseJ4.java:1018)
: at app//org.apache.solr.hdfs.search.TestRecoveryHdfs.testBuffering(TestRecoveryHdfs.java:325)
: at java.base@17.0.8.1/jdk.internal.reflect.NativeMethodAccessorImpl.invoke0(Native Method)
: at java.base@17.0.8.1/jdk.internal.reflect.NativeMethodAccessorImpl.invoke(NativeMethodAccessorImpl.java:77)
: at java.base@17.0.8.1/jdk.internal.reflect.DelegatingMethodAccessorImpl.invoke(DelegatingMethodAccessorImpl.java:43)
: at java.base@17.0.8.1/java.lang.reflect.Method.invoke(Method.java:568)
: at app//com.carrotsearch.randomizedtesting.RandomizedRunner.invoke(RandomizedRunner.java:1758)
: at app//com.carrotsearch.randomizedtesting.RandomizedRunner$8.evaluate(RandomizedRunner.java:946)
: at app//com.carrotsearch.randomizedtesting.RandomizedRunner$9.evaluate(RandomizedRunner.java:982)
: at app//com.carrotsearch.randomizedtesting.RandomizedRunner$10.evaluate(RandomizedRunner.java:996)
: at app//com.carrotsearch.randomizedtesting.rules.SystemPropertiesRestoreRule$1.evaluate(SystemPropertiesRestoreRule.java:80)
: at app//org.junit.rules.RunRules.evaluate(RunRules.java:20)
: at app//org.apache.lucene.tests.util.TestRuleSetupTeardownChained$1.evaluate(TestRuleSetupTeardownChained.java:48)
: at app//org.apache.lucene.tests.util.AbstractBeforeAfterRule$1.evaluate(AbstractBeforeAfterRule.java:43)
: at app//org.apache.lucene.tests.util.TestRuleThreadAndTestName$1.evaluate(TestRuleThreadAndTestName.java:45)
: at app//org.apache.lucene.tests.util.TestRuleIgnoreAfterMaxFailures$1.evaluate(TestRuleIgnoreAfterMaxFailures.java:60)
: at app//org.apache.lucene.tests.util.TestRuleMarkFailure$1.evaluate(TestRuleMarkFailure.java:44)
: at app//org.junit.rules.RunRules.evaluate(RunRules.java:20)
: at app//com.carrotsearch.randomizedtesting.rules.StatementAdapter.evaluate(StatementAdapter.java:36)
: at app//com.carrotsearch.randomizedtesting.ThreadLeakControl$StatementRunner.run(ThreadLeakControl.java:390)
: at app//com.carrotsearch.randomizedtesting.ThreadLeakControl.forkTimeoutingTask(ThreadLeakControl.java:843)
: at app//com.carrotsearch.randomizedtesting.ThreadLeakControl$3.evaluate(ThreadLeakControl.java:490)
: at app//com.carrotsearch.randomizedtesting.RandomizedRunner.runSingleTest(RandomizedRunner.java:955)
: at app//com.carrotsearch.randomizedtesting.RandomizedRunner$5.evaluate(RandomizedRunner.java:840)
: at app//com.carrotsearch.randomizedtesting.RandomizedRunner$6.evaluate(RandomizedRunner.java:891)
: at app//com.carrotsearch.randomizedtesting.RandomizedRunner$7.evaluate(RandomizedRunner.java:902)
: at app//com.carrotsearch.randomizedtesting.rules.StatementAdapter.evaluate(StatementAdapter.java:36)
: at app//com.carrotsearch.randomizedtesting.rules.StatementAdapter.evaluate(StatementAdapter.java:36)
: at app//org.apache.lucene.tests.util.AbstractBeforeAfterRule$1.evaluate(AbstractBeforeAfterRule.java:43)
: at app//com.carrotsearch.randomizedtesting.rules.SystemPropertiesRestoreRule$1.evaluate(SystemPropertiesRestoreRule.java:80)
: at app//org.junit.rules.RunRules.evaluate(RunRules.java:20)
: at app//org.apache.lucene.tests.util.AbstractBeforeAfterRule$1.evaluate(AbstractBeforeAfterRule.java:43)
: at app//com.carrotsearch.randomizedtesting.rules.StatementAdapter.evaluate(StatementAdapter.java:36)
: at app//org.apache.lucene.tests.util.TestRuleStoreClassName$1.evaluate(TestRuleStoreClassName.java:38)
: at app//com.carrotsearch.randomizedtesting.rules.NoShadowingOrOverridesOnMethodsRule$1.evaluate(NoShadowingOrOverridesOnMethodsRule.java:40)
: at app//com.carrotsearch.randomizedtesting.rules.NoShadowingOrOverridesOnMethodsRule$1.evaluate(NoShadowingOrOverridesOnMethodsRule.java:40)
: at app//com.carrotsearch.randomizedtesting.rules.StatementAdapter.evaluate(StatementAdapter.java:36)
: at app//com.carrotsearch.randomizedtesting.rules.StatementAdapter.evaluate(StatementAdapter.java:36)
: at app//org.apache.lucene.tests.util.TestRuleAssertionsRequired$1.evaluate(TestRuleAssertionsRequired.java:53)
: at app//org.apache.lucene.tests.util.AbstractBeforeAfterRule$1.evaluate(AbstractBeforeAfterRule.java:43)
: at app//org.apache.lucene.tests.util.TestRuleMarkFailure$1.evaluate(TestRuleMarkFailure.java:44)
: at app//org.apache.lucene.tests.util.TestRuleIgnoreAfterMaxFailures$1.evaluate(TestRuleIgnoreAfterMaxFailures.java:60)
: at app//org.apache.lucene.tests.util.TestRuleIgnoreTestSuites$1.evaluate(TestRuleIgnoreTestSuites.java:47)
: at app//org.junit.rules.RunRules.evaluate(RunRules.java:20)
: at app//com.carrotsearch.randomizedtesting.rules.StatementAdapter.evaluate(StatementAdapter.java:36)
: at app//com.carrotsearch.randomizedtesting.ThreadLeakControl$StatementRunner.run(ThreadLeakControl.java:390)
: at app//com.carrotsearch.randomizedtesting.ThreadLeakControl.lambda$forkTimeoutingTask$0(ThreadLeakControl.java:850)
: at java.base@17.0.8.1/java.lang.Thread.run(Thread.java:857)
:
-Hoss
http://www.lucidworks.com/
---------------------------------------------------------------------
To unsubscribe, e-mail: dev-unsubscribe@solr.apache.org
For additional commands, e-mail: dev-help@solr.apache.org