You are viewing a plain text version of this content. The canonical link for it is here.
Posted to builds@beam.apache.org by Apache Jenkins Server <je...@builds.apache.org> on 2022/02/14 18:39:26 UTC

Build failed in Jenkins: beam_PostCommit_Java_DataflowV2 #1268

See <https://ci-beam.apache.org/job/beam_PostCommit_Java_DataflowV2/1268/display/redirect?page=changes>

Changes:

[noreply] Update 2.36.0 blog post to mention ARM64 support

[noreply] Minor: Disable checker framework in nightly snapshot (#16829)

[noreply] [BEAM-13860] Make `DoFn.infer_output_type` return element type (#16788)


------------------------------------------
[...truncated 98.68 KB...]
  File "/usr/lib/python3.8/urllib/request.py", line 222, in urlopen
    return opener.open(url, data, timeout)
  File "/usr/lib/python3.8/urllib/request.py", line 531, in open
    response = meth(req, response)
  File "/usr/lib/python3.8/urllib/request.py", line 640, in http_response
    response = self.parent.error(
  File "/usr/lib/python3.8/urllib/request.py", line 563, in error
    result = self._call_chain(*args)
  File "/usr/lib/python3.8/urllib/request.py", line 502, in _call_chain
    result = func(*args)
  File "/usr/lib/python3.8/urllib/request.py", line 755, in http_error_302
    return self.parent.open(new, timeout=req.timeout)
  File "/usr/lib/python3.8/urllib/request.py", line 531, in open
    response = meth(req, response)
  File "/usr/lib/python3.8/urllib/request.py", line 640, in http_response
    response = self.parent.error(
  File "/usr/lib/python3.8/urllib/request.py", line 563, in error
    result = self._call_chain(*args)
  File "/usr/lib/python3.8/urllib/request.py", line 502, in _call_chain
    result = func(*args)
  File "/usr/lib/python3.8/urllib/request.py", line 755, in http_error_302
    return self.parent.open(new, timeout=req.timeout)
  File "/usr/lib/python3.8/urllib/request.py", line 531, in open
    response = meth(req, response)
  File "/usr/lib/python3.8/urllib/request.py", line 640, in http_response
    response = self.parent.error(
  File "/usr/lib/python3.8/urllib/request.py", line 569, in error
    return self._call_chain(*args)
  File "/usr/lib/python3.8/urllib/request.py", line 502, in _call_chain
    result = func(*args)
  File "/usr/lib/python3.8/urllib/request.py", line 649, in http_error_default
    raise HTTPError(req.full_url, code, msg, hdrs, fp)
urllib.error.HTTPError: HTTP Error 502: Bad Gateway
ERROR:root:Invalid url for pcollections-2.1.2: http://www.opensource.org/licenses/mit-license.php. Retrying...
Traceback (most recent call last):
  File "/home/jenkins/jenkins-slave/workspace/beam_PostCommit_Java_DataflowV2/src/sdks/java/container/license_scripts/pull_licenses_java.py", line 58, in pull_from_url
    url_read = urlopen(url)
  File "/usr/lib/python3.8/urllib/request.py", line 222, in urlopen
    return opener.open(url, data, timeout)
  File "/usr/lib/python3.8/urllib/request.py", line 531, in open
    response = meth(req, response)
  File "/usr/lib/python3.8/urllib/request.py", line 640, in http_response
    response = self.parent.error(
  File "/usr/lib/python3.8/urllib/request.py", line 563, in error
    result = self._call_chain(*args)
  File "/usr/lib/python3.8/urllib/request.py", line 502, in _call_chain
    result = func(*args)
  File "/usr/lib/python3.8/urllib/request.py", line 755, in http_error_302
    return self.parent.open(new, timeout=req.timeout)
  File "/usr/lib/python3.8/urllib/request.py", line 531, in open
    response = meth(req, response)
  File "/usr/lib/python3.8/urllib/request.py", line 640, in http_response
    response = self.parent.error(
  File "/usr/lib/python3.8/urllib/request.py", line 569, in error
    return self._call_chain(*args)
  File "/usr/lib/python3.8/urllib/request.py", line 502, in _call_chain
    result = func(*args)
  File "/usr/lib/python3.8/urllib/request.py", line 649, in http_error_default
    raise HTTPError(req.full_url, code, msg, hdrs, fp)
urllib.error.HTTPError: HTTP Error 502: Bad Gateway
ERROR:root:Invalid url for mysql-1.16.3: http://opensource.org/licenses/MIT. Retrying...
INFO:root:Replaced local file URL with file:///home/jenkins/jenkins-slave/workspace/beam_PostCommit_Java_DataflowV2/src/sdks/java/container/license_scripts/manual_licenses/xz/COPYING for xz-1.5
Traceback (most recent call last):
  File "/home/jenkins/jenkins-slave/workspace/beam_PostCommit_Java_DataflowV2/src/sdks/java/container/license_scripts/pull_licenses_java.py", line 58, in pull_from_url
    url_read = urlopen(url)
  File "/usr/lib/python3.8/urllib/request.py", line 222, in urlopen
    return opener.open(url, data, timeout)
  File "/usr/lib/python3.8/urllib/request.py", line 531, in open
    response = meth(req, response)
  File "/usr/lib/python3.8/urllib/request.py", line 640, in http_response
    response = self.parent.error(
  File "/usr/lib/python3.8/urllib/request.py", line 563, in error
    result = self._call_chain(*args)
  File "/usr/lib/python3.8/urllib/request.py", line 502, in _call_chain
    result = func(*args)
  File "/usr/lib/python3.8/urllib/request.py", line 755, in http_error_302
    return self.parent.open(new, timeout=req.timeout)
  File "/usr/lib/python3.8/urllib/request.py", line 531, in open
    response = meth(req, response)
  File "/usr/lib/python3.8/urllib/request.py", line 640, in http_response
    response = self.parent.error(
  File "/usr/lib/python3.8/urllib/request.py", line 569, in error
    return self._call_chain(*args)
  File "/usr/lib/python3.8/urllib/request.py", line 502, in _call_chain
    result = func(*args)
  File "/usr/lib/python3.8/urllib/request.py", line 649, in http_error_default
    raise HTTPError(req.full_url, code, msg, hdrs, fp)
urllib.error.HTTPError: HTTP Error 502: Bad Gateway
ERROR:root:Invalid url for mysql-1.16.3: http://opensource.org/licenses/MIT. Retrying...

> Task :release:go-licenses:java:dockerRun
+ go-licenses save github.com/apache/beam/sdks/java/container --save_path=/output/licenses
+ go-licenses csv github.com/apache/beam/sdks/java/container
+ tee /output/licenses/list.csv
google.golang.org/protobuf,https://go.googlesource.com/protobuf/+/refs/heads/master/LICENSE,BSD-3-Clause
golang.org/x/text,https://go.googlesource.com/text/+/refs/heads/master/LICENSE,BSD-3-Clause
github.com/apache/beam/sdks/java/container,https://github.com/apache/beam/blob/master/LICENSE,Apache-2.0
github.com/golang/protobuf,https://github.com/golang/protobuf/blob/master/LICENSE,BSD-3-Clause
golang.org/x/net,https://go.googlesource.com/net/+/refs/heads/master/LICENSE,BSD-3-Clause
google.golang.org/genproto/googleapis/rpc/status,https://github.com/googleapis/go-genproto/blob/master/LICENSE,Apache-2.0
golang.org/x/sys,https://go.googlesource.com/sys/+/refs/heads/master/LICENSE,BSD-3-Clause
github.com/apache/beam/sdks/go/pkg/beam,https://github.com/apache/beam/blob/master/sdks/go/README.md,Apache-2.0
google.golang.org/grpc,https://github.com/grpc/grpc-go/blob/master/LICENSE,Apache-2.0
+ chmod -R a+w /output/licenses

> Task :release:go-licenses:java:createLicenses
> Task :sdks:java:container:java8:copyGolangLicenses

> Task :sdks:java:container:pullLicenses
INFO:root:pull_licenses_java.py succeed. It took 87.521206 seconds with 16 threads.
Copying licenses from /home/jenkins/jenkins-slave/workspace/beam_PostCommit_Java_DataflowV2/src/sdks/java/container/build/target/java_third_party_licenses to /home/jenkins/jenkins-slave/workspace/beam_PostCommit_Java_DataflowV2/src/sdks/java/container/build/target/third_party_licenses.
Finished license_scripts.sh

> Task :sdks:java:container:java8:copyJavaThirdPartyLicenses
> Task :sdks:java:container:java8:dockerPrepare
> Task :sdks:java:container:java8:docker

> Task :runners:google-cloud-dataflow-java:buildAndPushDockerJavaContainer
WARNING: `gcloud docker` will not be supported for Docker client versions above 18.03.

As an alternative, use `gcloud auth configure-docker` to configure `docker` to
use `gcloud` as a credential helper, then use `docker` as you would for non-GCR
registries, e.g. `docker pull gcr.io/project-id/my-image`. Add
`--verbosity=error` to silence this warning: `gcloud docker
--verbosity=error -- pull gcr.io/project-id/my-image`.

See: https://cloud.google.com/container-registry/docs/support/deprecation-notices#gcloud-docker

The push refers to repository [us.gcr.io/apache-beam-testing/java-postcommit-it/java]
afa1eb2293d8: Preparing
165ca4a64c18: Preparing
c2e7fa8e9ac8: Preparing
ec2aa65be9b0: Preparing
8f4d7df52269: Preparing
98b76abd25c7: Preparing
118d7ddd337b: Preparing
178c97dc69a5: Preparing
1754d7befc3f: Preparing
df58c25ec959: Preparing
1bfb28a6f92c: Preparing
6ef721ac1821: Preparing
be61809c22b5: Preparing
f53ed9ea8a10: Preparing
6be21046fcff: Preparing
1e5fdc3d671c: Preparing
613ab28cf833: Preparing
bed676ceab7a: Preparing
6398d5cccd2c: Preparing
0b0f2f2f5279: Preparing
98b76abd25c7: Waiting
be61809c22b5: Waiting
f53ed9ea8a10: Waiting
6be21046fcff: Waiting
1e5fdc3d671c: Waiting
118d7ddd337b: Waiting
178c97dc69a5: Waiting
613ab28cf833: Waiting
6398d5cccd2c: Waiting
bed676ceab7a: Waiting
0b0f2f2f5279: Waiting
1754d7befc3f: Waiting
df58c25ec959: Waiting
1bfb28a6f92c: Waiting
8f4d7df52269: Pushed
c2e7fa8e9ac8: Pushed
165ca4a64c18: Pushed
afa1eb2293d8: Pushed
ec2aa65be9b0: Pushed
178c97dc69a5: Pushed
98b76abd25c7: Pushed
df58c25ec959: Pushed
1754d7befc3f: Pushed
f53ed9ea8a10: Layer already exists
6be21046fcff: Layer already exists
1e5fdc3d671c: Layer already exists
613ab28cf833: Layer already exists
bed676ceab7a: Layer already exists
6398d5cccd2c: Layer already exists
0b0f2f2f5279: Layer already exists
be61809c22b5: Pushed
6ef721ac1821: Pushed
118d7ddd337b: Pushed
1bfb28a6f92c: Pushed
20220214180135: digest: sha256:9d45773b9f372ee76127ec0224cb6fa604617e591550e250312690a5cadf4531 size: 4520

> Task :runners:google-cloud-dataflow-java:coreSDKJavaRunnerV2IntegrationTest NO-SOURCE
> Task :runners:google-cloud-dataflow-java:examplesJavaRunnerV2IntegrationTest

***********************************************************
***********************************************************
**********************Set Up Pubsub************************
The Pub/Sub topic has been set up for this example: projects/apache-beam-testing/topics/testpipeline-jenkins-0214180510-9a4957f3
The Pub/Sub subscription has been set up for this example: projects/apache-beam-testing/subscriptions/testpipeline-jenkins-0214180510-9a4957f3
******************Set Up Big Query Table*******************
The BigQuery table has been set up for this example: apache-beam-testing:traffic_max_lane_flow_1644861903811.traffic_max_lane_flow_table
*************************Tear Down*************************
The Pub/Sub topic has been deleted: projects/apache-beam-testing/topics/testpipeline-jenkins-0214180510-9a4957f3
The Pub/Sub subscription has been deleted: projects/apache-beam-testing/subscriptions/testpipeline-jenkins-0214180510-9a4957f3
The BigQuery table might contain the example's output, and it is not deleted automatically: apache-beam-testing:traffic_max_lane_flow_1644861903811.traffic_max_lane_flow_table
Please go to the Developers Console to delete it manually. Otherwise, you may be charged for its usage.
***********************************************************
***********************************************************

***********************************************************
***********************************************************
**********************Set Up Pubsub************************
The Pub/Sub topic has been set up for this example: projects/apache-beam-testing/topics/testpipeline-jenkins-0214180510-c187d87a
The Pub/Sub subscription has been set up for this example: projects/apache-beam-testing/subscriptions/testpipeline-jenkins-0214180510-c187d87a
******************Set Up Big Query Table*******************
The BigQuery table has been set up for this example: apache-beam-testing:traffic_routes_1644861903706.traffic_routes_table
*************************Tear Down*************************
The Pub/Sub topic has been deleted: projects/apache-beam-testing/topics/testpipeline-jenkins-0214180510-c187d87a
The Pub/Sub subscription has been deleted: projects/apache-beam-testing/subscriptions/testpipeline-jenkins-0214180510-c187d87a
The BigQuery table might contain the example's output, and it is not deleted automatically: apache-beam-testing:traffic_routes_1644861903706.traffic_routes_table
Please go to the Developers Console to delete it manually. Otherwise, you may be charged for its usage.
***********************************************************
***********************************************************

> Task :runners:google-cloud-dataflow-java:googleCloudPlatformRunnerV2IntegrationTest
FATAL: command execution failed
java.io.IOException: Backing channel 'apache-beam-jenkins-5' is disconnected.
	at hudson.remoting.RemoteInvocationHandler.channelOrFail(RemoteInvocationHandler.java:216)
	at hudson.remoting.RemoteInvocationHandler.invoke(RemoteInvocationHandler.java:286)
	at com.sun.proxy.$Proxy133.isAlive(Unknown Source)
	at hudson.Launcher$RemoteLauncher$ProcImpl.isAlive(Launcher.java:1211)
	at hudson.Launcher$RemoteLauncher$ProcImpl.join(Launcher.java:1203)
	at hudson.Launcher$ProcStarter.join(Launcher.java:523)
	at hudson.plugins.gradle.Gradle.perform(Gradle.java:317)
	at hudson.tasks.BuildStepMonitor$1.perform(BuildStepMonitor.java:20)
	at hudson.model.AbstractBuild$AbstractBuildExecution.perform(AbstractBuild.java:803)
	at hudson.model.Build$BuildExecution.build(Build.java:197)
	at hudson.model.Build$BuildExecution.doRun(Build.java:163)
	at hudson.model.AbstractBuild$AbstractBuildExecution.run(AbstractBuild.java:513)
	at hudson.model.Run.execute(Run.java:1906)
	at hudson.model.FreeStyleBuild.run(FreeStyleBuild.java:43)
	at hudson.model.ResourceController.execute(ResourceController.java:97)
	at hudson.model.Executor.run(Executor.java:429)
Caused by: java.io.IOException: Pipe closed after 0 cycles
	at org.apache.sshd.common.channel.ChannelPipedInputStream.read(ChannelPipedInputStream.java:118)
	at org.apache.sshd.common.channel.ChannelPipedInputStream.read(ChannelPipedInputStream.java:101)
	at hudson.remoting.FlightRecorderInputStream.read(FlightRecorderInputStream.java:93)
	at hudson.remoting.ChunkedInputStream.readHeader(ChunkedInputStream.java:74)
	at hudson.remoting.ChunkedInputStream.readUntilBreak(ChunkedInputStream.java:104)
	at hudson.remoting.ChunkedCommandTransport.readBlock(ChunkedCommandTransport.java:39)
	at hudson.remoting.AbstractSynchronousByteArrayCommandTransport.read(AbstractSynchronousByteArrayCommandTransport.java:34)
	at hudson.remoting.SynchronousCommandTransport$ReaderThread.run(SynchronousCommandTransport.java:61)
Build step 'Invoke Gradle script' changed build result to FAILURE
Build step 'Invoke Gradle script' marked build as failure
ERROR: apache-beam-jenkins-5 is offline; cannot locate jdk_1.8_latest

---------------------------------------------------------------------
To unsubscribe, e-mail: builds-unsubscribe@beam.apache.org
For additional commands, e-mail: builds-help@beam.apache.org